You are viewing a plain text version of this content. The canonical link for it is here.
Posted to builds@solr.apache.org by Apache Jenkins Server <je...@builds.apache.org> on 2026/09/19 11:49:10 UTC
[JENKINS] Solr » Solr-TestIntegration-10.x - Build # 330 - Still Failing!
Build: https://ci-builds.apache.org/job/Solr/job/Solr-TestIntegration-10.x/330/
No tests ran.
Build Log:
[...truncated 359 lines...]
BUILD FAILED in 23s
4 actionable tasks: 4 executed
Publishing Build Scan to Develocity...
The Develocity server (develocity.apache.org) rejected the credential with prefix '7x3jzizm4zpygv7psbkg6byvm4'.
Your credential has expired.
Build step 'Invoke Gradle script' changed build result to FAILURE
Build step 'Invoke Gradle script' marked build as failure
Archiving artifacts
Email was triggered for: Failure - Any
Sending email for trigger: Failure - Any
[JENKINS] Solr » Solr-TestIntegration-10.x - Build # 331 - Still Failing!
Posted by Apache Jenkins Server <je...@builds.apache.org>.
Build: https://ci-builds.apache.org/job/Solr/job/Solr-TestIntegration-10.x/331/
No tests ran.
Build Log:
[...truncated 359 lines...]
BUILD FAILED in 23s
4 actionable tasks: 4 executed
Publishing Build Scan to Develocity...
The Develocity server (develocity.apache.org) rejected the credential with prefix '7x3jzizm4zpygv7psbkg6byvm4'.
Your credential has expired.
Build step 'Invoke Gradle script' changed build result to FAILURE
Build step 'Invoke Gradle script' marked build as failure
Archiving artifacts
Email was triggered for: Failure - Any
Sending email for trigger: Failure - Any