You are viewing a plain text version of this content. The canonical link for it is here.
Posted to builds@beam.apache.org by Apache Jenkins Server <je...@builds.apache.org> on 2022/08/31 00:03:38 UTC
Build failed in Jenkins: beam_PostCommit_XVR_Direct #3080
See <https://ci-beam.apache.org/job/beam_PostCommit_XVR_Direct/3080/display/redirect>
Changes:
------------------------------------------
[...truncated 2.67 MB...]
INFO apache_beam.runners.portability.portable_runner:portable_runner.py:581 Job state changed to STARTING
INFO apache_beam.runners.portability.portable_runner:portable_runner.py:581 Job state changed to RUNNING
INFO root:portable_runner.py:574 Default Python SDK image for environment is apache/beam_python3.9_sdk:2.42.0.dev
INFO root:portable_runner.py:574 ==================== <function annotate_downstream_side_inputs at 0x7f412c364820> ====================
INFO root:portable_runner.py:574 ==================== <function fix_side_input_pcoll_coders at 0x7f412c364940> ====================
INFO root:portable_runner.py:574 ==================== <function pack_combiners at 0x7f412c364e50> ====================
INFO root:portable_runner.py:574 ==================== <function lift_combiners at 0x7f412c364ee0> ====================
INFO root:portable_runner.py:574 ==================== <function expand_sdf at 0x7f412c3650d0> ====================
INFO root:portable_runner.py:574 ==================== <function expand_gbk at 0x7f412c365160> ====================
INFO root:portable_runner.py:574 ==================== <function sink_flattens at 0x7f412c365280> ====================
INFO root:portable_runner.py:574 ==================== <function greedily_fuse at 0x7f412c365310> ====================
INFO root:portable_runner.py:574 ==================== <function read_to_impulse at 0x7f412c3653a0> ====================
INFO root:portable_runner.py:574 ==================== <function impulse_to_input at 0x7f412c365430> ====================
INFO root:portable_runner.py:574 ==================== <function sort_stages at 0x7f412c365670> ====================
INFO root:portable_runner.py:574 ==================== <function add_impulse_to_dangling_transforms at 0x7f412c365790> ====================
INFO root:portable_runner.py:574 ==================== <function setup_timer_mapping at 0x7f412c3655e0> ====================
INFO root:portable_runner.py:574 ==================== <function populate_data_channel_coders at 0x7f412c365700> ====================
INFO root:portable_runner.py:574 starting control server on port 41683
INFO root:portable_runner.py:574 starting data server on port 43721
INFO root:portable_runner.py:574 starting state server on port 36327
INFO root:portable_runner.py:574 starting logging server on port 45175
INFO root:portable_runner.py:574 Created Worker handler <apache_beam.runners.portability.fn_api_runner.worker_handlers.DockerSdkWorkerHandler object at 0x7f415b976eb0> for environment external_9beam:env:docker:v1 (beam:env:docker:v1, b'\n apache/beam_java8_sdk:2.42.0.dev')
INFO root:portable_runner.py:574 Attempting to pull image apache/beam_java8_sdk:2.42.0.dev
INFO root:portable_runner.py:574 Unable to pull image apache/beam_java8_sdk:2.42.0.dev, defaulting to local image if it exists
INFO root:portable_runner.py:574 Waiting for docker to start up. Current status is running
INFO root:portable_runner.py:574 Docker container is running. container_id = b'8bcfa7a7ae29b15a637070dd6a1f0e62c7e9aea890622a7afe5139d1152550b1', worker_id = worker_87
INFO root:portable_runner.py:574 Created Worker handler <apache_beam.runners.portability.fn_api_runner.worker_handlers.DockerSdkWorkerHandler object at 0x7f415c1343d0> for environment ref_Environment_default_environment_2 (beam:env:docker:v1, b'\n$apache/beam_python3.9_sdk:2.42.0.dev')
INFO root:portable_runner.py:574 Attempting to pull image apache/beam_python3.9_sdk:2.42.0.dev
INFO root:portable_runner.py:574 Unable to pull image apache/beam_python3.9_sdk:2.42.0.dev, defaulting to local image if it exists
INFO root:portable_runner.py:574 Waiting for docker to start up. Current status is running
INFO root:portable_runner.py:574 Docker container is running. container_id = b'26238296aad19ed52dd8a4f300ff7e733a514a113ad267665faf8c26a0c45313', worker_id = worker_88
INFO root:portable_runner.py:574 Completed job in 27.896316289901733 seconds with state DONE.
INFO apache_beam.runners.portability.portable_runner:portable_runner.py:581 Job state changed to DONE
PASSED [100%]
=================================== FAILURES ===================================
__________________________ SqlTransformTest.test_map ___________________________
self = <apache_beam.transforms.sql_test.SqlTransformTest testMethod=test_map>
def test_map(self):
with TestPipeline() as p:
out = (
p
| beam.Create([
Shopper('bob', {
'bananas': 6, 'cherries': 3
}),
Shopper('alice', {
'apples': 2, 'bananas': 3
})
]).with_output_types(Shopper)
| SqlTransform("SELECT * FROM PCOLLECTION WHERE shopper = 'alice'"))
> assert_that(out, equal_to([('alice', {'apples': 2, 'bananas': 3})]))
apache_beam/transforms/sql_test.py:190:
_ _ _ _ _ _ _ _ _ _ _ _ _ _ _ _ _ _ _ _ _ _ _ _ _ _ _ _ _ _ _ _ _ _ _ _ _ _ _ _
apache_beam/pipeline.py:597: in __exit__
self.result = self.run()
apache_beam/testing/test_pipeline.py:116: in run
state = result.wait_until_finish()
apache_beam/runners/portability/portable_runner.py:607: in wait_until_finish
raise self._runtime_exception
apache_beam/runners/portability/portable_runner.py:613: in _observe_state
for state_response in self._state_stream:
../../build/gradleenv/1922375555/lib/python3.9/site-packages/grpc/_channel.py:426: in __next__
return self._next()
_ _ _ _ _ _ _ _ _ _ _ _ _ _ _ _ _ _ _ _ _ _ _ _ _ _ _ _ _ _ _ _ _ _ _ _ _ _ _ _
self = <_MultiThreadedRendezvous of RPC that terminated with:
status = StatusCode.DEADLINE_EXCEEDED
details = "Deadline Exc...0.1:45639","file":"src/core/lib/surface/call.cc","file_line":966,"grpc_message":"Deadline Exceeded","grpc_status":4}"
>
def _next(self):
with self._state.condition:
if self._state.code is None:
event_handler = _event_handler(self._state,
self._response_deserializer)
self._state.due.add(cygrpc.OperationType.receive_message)
operating = self._call.operate(
(cygrpc.ReceiveMessageOperation(_EMPTY_FLAGS),),
event_handler)
if not operating:
self._state.due.remove(cygrpc.OperationType.receive_message)
elif self._state.code is grpc.StatusCode.OK:
raise StopIteration()
else:
raise self
def _response_ready():
return (self._state.response is not None or
(cygrpc.OperationType.receive_message
not in self._state.due and
self._state.code is not None))
_common.wait(self._state.condition.wait, _response_ready)
if self._state.response is not None:
response = self._state.response
self._state.response = None
return response
elif cygrpc.OperationType.receive_message not in self._state.due:
if self._state.code is grpc.StatusCode.OK:
raise StopIteration()
elif self._state.code is not None:
> raise self
E grpc._channel._MultiThreadedRendezvous: <_MultiThreadedRendezvous of RPC that terminated with:
E status = StatusCode.DEADLINE_EXCEEDED
E details = "Deadline Exceeded"
E debug_error_string = "{"created":"@1661904019.076144685","description":"Error received from peer ipv4:127.0.0.1:45639","file":"src/core/lib/surface/call.cc","file_line":966,"grpc_message":"Deadline Exceeded","grpc_status":4}"
E >
../../build/gradleenv/1922375555/lib/python3.9/site-packages/grpc/_channel.py:826: _MultiThreadedRendezvous
------------------------------ Captured log call -------------------------------
INFO apache_beam.utils.subprocess_server:subprocess_server.py:254 Using pre-built snapshot at <https://ci-beam.apache.org/job/beam_PostCommit_XVR_Direct/ws/src/sdks/java/extensions/sql/expansion-service/build/libs/beam-sdks-java-extensions-sql-expansion-service-2.42.0-SNAPSHOT.jar>
INFO root:external.py:769 Starting a JAR-based expansion service from JAR <https://ci-beam.apache.org/job/beam_PostCommit_XVR_Direct/ws/src/sdks/java/extensions/sql/expansion-service/build/libs/beam-sdks-java-extensions-sql-expansion-service-2.42.0-SNAPSHOT.jar>
INFO apache_beam.utils.subprocess_server:subprocess_server.py:116 Starting service with ['java' '-jar' '<https://ci-beam.apache.org/job/beam_PostCommit_XVR_Direct/ws/src/sdks/java/extensions/sql/expansion-service/build/libs/beam-sdks-java-extensions-sql-expansion-service-2.42.0-SNAPSHOT.jar'> '33995' '--filesToStage=<https://ci-beam.apache.org/job/beam_PostCommit_XVR_Direct/ws/src/sdks/java/extensions/sql/expansion-service/build/libs/beam-sdks-java-extensions-sql-expansion-service-2.42.0-SNAPSHOT.jar']>
INFO apache_beam.utils.subprocess_server:subprocess_server.py:132 Starting expansion service at localhost:33995
INFO apache_beam.utils.subprocess_server:subprocess_server.py:132 Aug 30, 2022 11:58:56 PM org.apache.beam.sdk.expansion.service.ExpansionService loadRegisteredTransforms
INFO apache_beam.utils.subprocess_server:subprocess_server.py:132 INFO: Registering external transforms: [beam:external:java:sql:v1, beam:transform:org.apache.beam:pubsub_read:v1, beam:transform:org.apache.beam:pubsub_write:v1, beam:transform:org.apache.beam:pubsublite_write:v1, beam:transform:org.apache.beam:pubsublite_read:v1, beam:transform:org.apache.beam:spanner_insert:v1, beam:transform:org.apache.beam:spanner_update:v1, beam:transform:org.apache.beam:spanner_replace:v1, beam:transform:org.apache.beam:spanner_insert_or_update:v1, beam:transform:org.apache.beam:spanner_delete:v1, beam:transform:org.apache.beam:spanner_read:v1, beam:transform:org.apache.beam:kafka_read_with_metadata:v1, beam:transform:org.apache.beam:kafka_read_without_metadata:v1, beam:transform:org.apache.beam:kafka_write:v1, beam:external:java:generate_sequence:v1]
INFO apache_beam.utils.subprocess_server:subprocess_server.py:132 beam:external:java:sql:v1: org.apache.beam.sdk.expansion.service.ExpansionService$ExternalTransformRegistrarLoader$1@47eaca72
INFO apache_beam.utils.subprocess_server:subprocess_server.py:132 beam:transform:org.apache.beam:pubsub_read:v1: org.apache.beam.sdk.expansion.service.ExpansionService$ExternalTransformRegistrarLoader$1@55141def
INFO apache_beam.utils.subprocess_server:subprocess_server.py:132 beam:transform:org.apache.beam:pubsub_write:v1: org.apache.beam.sdk.expansion.service.ExpansionService$ExternalTransformRegistrarLoader$1@55182842
INFO apache_beam.utils.subprocess_server:subprocess_server.py:132 beam:transform:org.apache.beam:pubsublite_write:v1: org.apache.beam.sdk.expansion.service.ExpansionService$ExternalTransformRegistrarLoader$1@3270d194
INFO apache_beam.utils.subprocess_server:subprocess_server.py:132 beam:transform:org.apache.beam:pubsublite_read:v1: org.apache.beam.sdk.expansion.service.ExpansionService$ExternalTransformRegistrarLoader$1@235834f2
INFO apache_beam.utils.subprocess_server:subprocess_server.py:132 beam:transform:org.apache.beam:spanner_insert:v1: org.apache.beam.sdk.expansion.service.ExpansionService$ExternalTransformRegistrarLoader$1@5656be13
INFO apache_beam.utils.subprocess_server:subprocess_server.py:132 beam:transform:org.apache.beam:spanner_update:v1: org.apache.beam.sdk.expansion.service.ExpansionService$ExternalTransformRegistrarLoader$1@4218d6a3
INFO apache_beam.utils.subprocess_server:subprocess_server.py:132 beam:transform:org.apache.beam:spanner_replace:v1: org.apache.beam.sdk.expansion.service.ExpansionService$ExternalTransformRegistrarLoader$1@76505305
INFO apache_beam.utils.subprocess_server:subprocess_server.py:132 beam:transform:org.apache.beam:spanner_insert_or_update:v1: org.apache.beam.sdk.expansion.service.ExpansionService$ExternalTransformRegistrarLoader$1@14cd1699
INFO apache_beam.utils.subprocess_server:subprocess_server.py:132 beam:transform:org.apache.beam:spanner_delete:v1: org.apache.beam.sdk.expansion.service.ExpansionService$ExternalTransformRegistrarLoader$1@77888435
INFO apache_beam.utils.subprocess_server:subprocess_server.py:132 beam:transform:org.apache.beam:spanner_read:v1: org.apache.beam.sdk.expansion.service.ExpansionService$ExternalTransformRegistrarLoader$1@73a1e9a9
INFO apache_beam.utils.subprocess_server:subprocess_server.py:132 beam:transform:org.apache.beam:kafka_read_with_metadata:v1: org.apache.beam.sdk.expansion.service.ExpansionService$ExternalTransformRegistrarLoader$1@71d44a3
INFO apache_beam.utils.subprocess_server:subprocess_server.py:132 beam:transform:org.apache.beam:kafka_read_without_metadata:v1: org.apache.beam.sdk.expansion.service.ExpansionService$ExternalTransformRegistrarLoader$1@7b98f307
INFO apache_beam.utils.subprocess_server:subprocess_server.py:132 beam:transform:org.apache.beam:kafka_write:v1: org.apache.beam.sdk.expansion.service.ExpansionService$ExternalTransformRegistrarLoader$1@4802796d
INFO apache_beam.utils.subprocess_server:subprocess_server.py:132 beam:external:java:generate_sequence:v1: org.apache.beam.sdk.expansion.service.ExpansionService$ExternalTransformRegistrarLoader$1@34123d65
WARNING root:subprocess_server.py:95 Waiting for grpc channel to be ready at localhost:33995.
INFO apache_beam.utils.subprocess_server:subprocess_server.py:132 Aug 30, 2022 11:58:59 PM org.apache.beam.sdk.expansion.service.ExpansionService expand
INFO apache_beam.utils.subprocess_server:subprocess_server.py:132 INFO: Expanding 'SqlTransform(beam:external:java:sql:v1)' with URN 'beam:external:java:sql:v1'
INFO apache_beam.utils.subprocess_server:subprocess_server.py:132 Aug 30, 2022 11:58:59 PM org.apache.beam.sdk.expansion.service.ExpansionService$ExternalTransformRegistrarLoader payloadToConfig
INFO apache_beam.utils.subprocess_server:subprocess_server.py:132 WARNING: Configuration class 'org.apache.beam.sdk.extensions.sql.expansion.ExternalSqlTransformRegistrar$Configuration' has no schema registered. Attempting to construct with setter approach.
INFO apache_beam.utils.subprocess_server:subprocess_server.py:132 Aug 30, 2022 11:59:00 PM org.apache.beam.sdk.expansion.service.ExpansionService$ExternalTransformRegistrarLoader payloadToConfig
INFO apache_beam.utils.subprocess_server:subprocess_server.py:132 WARNING: Configuration class 'org.apache.beam.sdk.extensions.sql.expansion.ExternalSqlTransformRegistrar$Configuration' has no schema registered. Attempting to construct with setter approach.
INFO apache_beam.utils.subprocess_server:subprocess_server.py:132 Aug 30, 2022 11:59:03 PM org.apache.beam.sdk.extensions.sql.impl.CalciteQueryPlanner convertToBeamRel
INFO apache_beam.utils.subprocess_server:subprocess_server.py:132 INFO: SQL:
INFO apache_beam.utils.subprocess_server:subprocess_server.py:132 SELECT `PCOLLECTION`.`shopper`, `PCOLLECTION`.`cart`
INFO apache_beam.utils.subprocess_server:subprocess_server.py:132 FROM `beam`.`PCOLLECTION` AS `PCOLLECTION`
INFO apache_beam.utils.subprocess_server:subprocess_server.py:132 WHERE `PCOLLECTION`.`shopper` = 'alice'
INFO apache_beam.utils.subprocess_server:subprocess_server.py:132 Aug 30, 2022 11:59:04 PM org.apache.beam.sdk.extensions.sql.impl.CalciteQueryPlanner convertToBeamRel
INFO apache_beam.utils.subprocess_server:subprocess_server.py:132 INFO: SQLPlan>
INFO apache_beam.utils.subprocess_server:subprocess_server.py:132 LogicalProject(shopper=[$0], cart=[$1])
INFO apache_beam.utils.subprocess_server:subprocess_server.py:132 LogicalFilter(condition=[=($0, 'alice')])
INFO apache_beam.utils.subprocess_server:subprocess_server.py:132 BeamIOSourceRel(table=[[beam, PCOLLECTION]])
INFO apache_beam.utils.subprocess_server:subprocess_server.py:132
INFO apache_beam.utils.subprocess_server:subprocess_server.py:132 Aug 30, 2022 11:59:05 PM org.apache.beam.sdk.extensions.sql.impl.CalciteQueryPlanner convertToBeamRel
INFO apache_beam.utils.subprocess_server:subprocess_server.py:132 INFO: BEAMPlan>
INFO apache_beam.utils.subprocess_server:subprocess_server.py:132 BeamCalcRel(expr#0..1=[{inputs}], expr#2=['alice':VARCHAR], expr#3=[=($t0, $t2)], proj#0..1=[{exprs}], $condition=[$t3])
INFO apache_beam.utils.subprocess_server:subprocess_server.py:132 BeamIOSourceRel(table=[[beam, PCOLLECTION]])
INFO apache_beam.utils.subprocess_server:subprocess_server.py:132
INFO root:environments.py:376 Default Python SDK image for environment is apache/beam_python3.9_sdk:2.42.0.dev
INFO root:environments.py:299 No image given, using default Python SDK image
INFO root:environments.py:376 Default Python SDK image for environment is apache/beam_python3.9_sdk:2.42.0.dev
INFO root:environments.py:302 Python SDK container image set to "apache/beam_python3.9_sdk:2.42.0.dev" for Docker environment
INFO apache_beam.runners.portability.fn_api_runner.translations:translations.py:714 ==================== <function pack_combiners at 0x7f3d7eb040d0> ====================
INFO apache_beam.runners.portability.fn_api_runner.translations:translations.py:714 ==================== <function lift_combiners at 0x7f3d7eb04160> ====================
INFO apache_beam.runners.portability.fn_api_runner.translations:translations.py:714 ==================== <function sort_stages at 0x7f3d7eb048b0> ====================
INFO apache_beam.runners.portability.portable_runner:portable_runner.py:581 Job state changed to STOPPED
INFO apache_beam.runners.portability.portable_runner:portable_runner.py:581 Job state changed to STARTING
INFO apache_beam.runners.portability.portable_runner:portable_runner.py:581 Job state changed to RUNNING
INFO root:portable_runner.py:574 Default Python SDK image for environment is apache/beam_python3.9_sdk:2.42.0.dev
INFO root:portable_runner.py:574 ==================== <function annotate_downstream_side_inputs at 0x7f412c364820> ====================
INFO root:portable_runner.py:574 ==================== <function fix_side_input_pcoll_coders at 0x7f412c364940> ====================
INFO root:portable_runner.py:574 ==================== <function pack_combiners at 0x7f412c364e50> ====================
INFO root:portable_runner.py:574 ==================== <function lift_combiners at 0x7f412c364ee0> ====================
INFO root:portable_runner.py:574 ==================== <function expand_sdf at 0x7f412c3650d0> ====================
INFO root:portable_runner.py:574 ==================== <function expand_gbk at 0x7f412c365160> ====================
INFO root:portable_runner.py:574 ==================== <function sink_flattens at 0x7f412c365280> ====================
INFO root:portable_runner.py:574 ==================== <function greedily_fuse at 0x7f412c365310> ====================
INFO root:portable_runner.py:574 ==================== <function read_to_impulse at 0x7f412c3653a0> ====================
INFO root:portable_runner.py:574 ==================== <function impulse_to_input at 0x7f412c365430> ====================
INFO root:portable_runner.py:574 ==================== <function sort_stages at 0x7f412c365670> ====================
INFO root:portable_runner.py:574 ==================== <function add_impulse_to_dangling_transforms at 0x7f412c365790> ====================
INFO root:portable_runner.py:574 ==================== <function setup_timer_mapping at 0x7f412c3655e0> ====================
INFO root:portable_runner.py:574 ==================== <function populate_data_channel_coders at 0x7f412c365700> ====================
INFO root:portable_runner.py:574 starting control server on port 44631
INFO root:portable_runner.py:574 starting data server on port 43013
INFO root:portable_runner.py:574 starting state server on port 39343
INFO root:portable_runner.py:574 starting logging server on port 43505
INFO root:portable_runner.py:574 Created Worker handler <apache_beam.runners.portability.fn_api_runner.worker_handlers.DockerSdkWorkerHandler object at 0x7f412c21dfa0> for environment ref_Environment_default_environment_2 (beam:env:docker:v1, b'\n$apache/beam_python3.9_sdk:2.42.0.dev')
INFO root:portable_runner.py:574 Attempting to pull image apache/beam_python3.9_sdk:2.42.0.dev
INFO root:portable_runner.py:574 Unable to pull image apache/beam_python3.9_sdk:2.42.0.dev, defaulting to local image if it exists
INFO root:portable_runner.py:574 Waiting for docker to start up. Current status is running
INFO root:portable_runner.py:574 Docker container is running. container_id = b'e929904f9a3535d1a2a2d1371b060884d12ef44ce9fec4df68a303b1f273c66a', worker_id = worker_77
INFO root:portable_runner.py:574 Created Worker handler <apache_beam.runners.portability.fn_api_runner.worker_handlers.DockerSdkWorkerHandler object at 0x7f412c239fd0> for environment external_4beam:env:docker:v1 (beam:env:docker:v1, b'\n apache/beam_java8_sdk:2.42.0.dev')
INFO root:portable_runner.py:574 Attempting to pull image apache/beam_java8_sdk:2.42.0.dev
INFO root:portable_runner.py:574 Unable to pull image apache/beam_java8_sdk:2.42.0.dev, defaulting to local image if it exists
=============================== warnings summary ===============================
../../build/gradleenv/1922375555/lib/python3.9/site-packages/hdfs/config.py:15
<https://ci-beam.apache.org/job/beam_PostCommit_XVR_Direct/ws/src/build/gradleenv/1922375555/lib/python3.9/site-packages/hdfs/config.py>:15: DeprecationWarning: the imp module is deprecated in favour of importlib; see the module's documentation for alternative uses
from imp import load_source
../../build/gradleenv/1922375555/lib/python3.9/site-packages/tenacity/_asyncio.py:42
<https://ci-beam.apache.org/job/beam_PostCommit_XVR_Direct/ws/src/build/gradleenv/1922375555/lib/python3.9/site-packages/tenacity/_asyncio.py>:42: DeprecationWarning: "@coroutine" decorator is deprecated since Python 3.8, use "async def" instead
def call(self, fn, *args, **kwargs):
-- Docs: https://docs.pytest.org/en/stable/how-to/capture-warnings.html
- generated xml file: <https://ci-beam.apache.org/job/beam_PostCommit_XVR_Direct/ws/src/sdks/python/pytest_xlangSqlValidateRunner.xml> -
=========================== short test summary info ============================
FAILED apache_beam/transforms/sql_test.py::SqlTransformTest::test_map - grpc....
= 1 failed, 8 passed, 2 skipped, 6544 deselected, 2 warnings in 365.72s (0:06:05) =
> Task :sdks:python:test-suites:direct:xlang:validatesCrossLanguageRunnerPythonUsingSql FAILED
> Task :sdks:python:test-suites:direct:xlang:validatesCrossLanguageRunnerCleanup
Stopping expansion service pid: 1876076.
Stopping expansion service pid: 1876077.
> Task :sdks:python:test-suites:direct:xlang:fnApiJobServerCleanup
Killing process at 1871027
FAILURE: Build failed with an exception.
* What went wrong:
Execution failed for task ':sdks:python:test-suites:direct:xlang:validatesCrossLanguageRunnerPythonUsingSql'.
> Process 'command 'sh'' finished with non-zero exit value 1
* Try:
> Run with --stacktrace option to get the stack trace.
> Run with --info or --debug option to get more log output.
> Run with --scan to get full insights.
* Get more help at https://help.gradle.org
Deprecated Gradle features were used in this build, making it incompatible with Gradle 8.0.
You can use '--warning-mode all' to show the individual deprecation warnings and determine if they come from your own scripts or plugins.
See https://docs.gradle.org/7.4/userguide/command_line_interface.html#sec:command_line_warnings
Execution optimizations have been disabled for 1 invalid unit(s) of work during this build to ensure correctness.
Please consult deprecation warnings for more details.
BUILD FAILED in 26m 1s
232 actionable tasks: 32 executed, 200 up-to-date
Publishing build scan...
https://gradle.com/s/uehnq4djoe4eo
Build step 'Invoke Gradle script' changed build result to FAILURE
Build step 'Invoke Gradle script' marked build as failure
---------------------------------------------------------------------
To unsubscribe, e-mail: builds-unsubscribe@beam.apache.org
For additional commands, e-mail: builds-help@beam.apache.org
Jenkins build is back to normal : beam_PostCommit_XVR_Direct #3081
Posted by Apache Jenkins Server <je...@builds.apache.org>.
See <https://ci-beam.apache.org/job/beam_PostCommit_XVR_Direct/3081/display/redirect?page=changes>
---------------------------------------------------------------------
To unsubscribe, e-mail: builds-unsubscribe@beam.apache.org
For additional commands, e-mail: builds-help@beam.apache.org