You are viewing a plain text version of this content. The canonical link for it is here.
Posted to dev@kafka.apache.org by Apache Jenkins Server <je...@builds.apache.org> on 2021/01/18 04:27:23 UTC
Build failed in Jenkins: Kafka » kafka-trunk-jdk15 #419
See <https://ci-builds.apache.org/job/Kafka/job/kafka-trunk-jdk15/419/display/redirect?page=changes>
Changes:
[github] KAFKA-12200: Migrate connect:file module to JUnit 5 (#9917)
------------------------------------------
[...truncated 3.64 MB...]
MockProcessorContextStateStoreTest > builder = org.apache.kafka.streams.state.internals.WindowStoreBuilder@6b52b06f, timestamped = false, caching = false, logging = true STARTED
MockProcessorContextStateStoreTest > builder = org.apache.kafka.streams.state.internals.WindowStoreBuilder@6b52b06f, timestamped = false, caching = false, logging = true PASSED
MockProcessorContextStateStoreTest > builder = org.apache.kafka.streams.state.internals.WindowStoreBuilder@23d05ff4, timestamped = false, caching = false, logging = true STARTED
MockProcessorContextStateStoreTest > builder = org.apache.kafka.streams.state.internals.WindowStoreBuilder@23d05ff4, timestamped = false, caching = false, logging = true PASSED
MockProcessorContextStateStoreTest > builder = org.apache.kafka.streams.state.internals.WindowStoreBuilder@4f48f2e5, timestamped = false, caching = false, logging = true STARTED
MockProcessorContextStateStoreTest > builder = org.apache.kafka.streams.state.internals.WindowStoreBuilder@4f48f2e5, timestamped = false, caching = false, logging = true PASSED
MockProcessorContextStateStoreTest > builder = org.apache.kafka.streams.state.internals.WindowStoreBuilder@6a2f400e, timestamped = false, caching = false, logging = false STARTED
MockProcessorContextStateStoreTest > builder = org.apache.kafka.streams.state.internals.WindowStoreBuilder@6a2f400e, timestamped = false, caching = false, logging = false PASSED
MockProcessorContextStateStoreTest > builder = org.apache.kafka.streams.state.internals.WindowStoreBuilder@74257e5d, timestamped = false, caching = false, logging = false STARTED
MockProcessorContextStateStoreTest > builder = org.apache.kafka.streams.state.internals.WindowStoreBuilder@74257e5d, timestamped = false, caching = false, logging = false PASSED
MockProcessorContextStateStoreTest > builder = org.apache.kafka.streams.state.internals.WindowStoreBuilder@154022ab, timestamped = false, caching = false, logging = false STARTED
MockProcessorContextStateStoreTest > builder = org.apache.kafka.streams.state.internals.WindowStoreBuilder@154022ab, timestamped = false, caching = false, logging = false PASSED
MockProcessorContextStateStoreTest > builder = org.apache.kafka.streams.state.internals.SessionStoreBuilder@37681333, timestamped = false, caching = true, logging = true STARTED
MockProcessorContextStateStoreTest > builder = org.apache.kafka.streams.state.internals.SessionStoreBuilder@37681333, timestamped = false, caching = true, logging = true PASSED
MockProcessorContextStateStoreTest > builder = org.apache.kafka.streams.state.internals.SessionStoreBuilder@6cc4063d, timestamped = false, caching = true, logging = true STARTED
MockProcessorContextStateStoreTest > builder = org.apache.kafka.streams.state.internals.SessionStoreBuilder@6cc4063d, timestamped = false, caching = true, logging = true PASSED
MockProcessorContextStateStoreTest > builder = org.apache.kafka.streams.state.internals.SessionStoreBuilder@7a4ca735, timestamped = false, caching = true, logging = false STARTED
MockProcessorContextStateStoreTest > builder = org.apache.kafka.streams.state.internals.SessionStoreBuilder@7a4ca735, timestamped = false, caching = true, logging = false PASSED
MockProcessorContextStateStoreTest > builder = org.apache.kafka.streams.state.internals.SessionStoreBuilder@70567e4b, timestamped = false, caching = true, logging = false STARTED
MockProcessorContextStateStoreTest > builder = org.apache.kafka.streams.state.internals.SessionStoreBuilder@70567e4b, timestamped = false, caching = true, logging = false PASSED
MockProcessorContextStateStoreTest > builder = org.apache.kafka.streams.state.internals.SessionStoreBuilder@1f742195, timestamped = false, caching = false, logging = true STARTED
MockProcessorContextStateStoreTest > builder = org.apache.kafka.streams.state.internals.SessionStoreBuilder@1f742195, timestamped = false, caching = false, logging = true PASSED
MockProcessorContextStateStoreTest > builder = org.apache.kafka.streams.state.internals.SessionStoreBuilder@22018cd3, timestamped = false, caching = false, logging = true STARTED
MockProcessorContextStateStoreTest > builder = org.apache.kafka.streams.state.internals.SessionStoreBuilder@22018cd3, timestamped = false, caching = false, logging = true PASSED
MockProcessorContextStateStoreTest > builder = org.apache.kafka.streams.state.internals.SessionStoreBuilder@5bc19e0c, timestamped = false, caching = false, logging = false STARTED
MockProcessorContextStateStoreTest > builder = org.apache.kafka.streams.state.internals.SessionStoreBuilder@5bc19e0c, timestamped = false, caching = false, logging = false PASSED
MockProcessorContextStateStoreTest > builder = org.apache.kafka.streams.state.internals.SessionStoreBuilder@130a63eb, timestamped = false, caching = false, logging = false STARTED
MockProcessorContextStateStoreTest > builder = org.apache.kafka.streams.state.internals.SessionStoreBuilder@130a63eb, timestamped = false, caching = false, logging = false PASSED
TestRecordTest > testConsumerRecord() STARTED
TestRecordTest > testConsumerRecord() PASSED
TestRecordTest > testToString() STARTED
TestRecordTest > testToString() PASSED
TestRecordTest > testInvalidRecords() STARTED
TestRecordTest > testInvalidRecords() PASSED
TestRecordTest > testPartialConstructorEquals() STARTED
TestRecordTest > testPartialConstructorEquals() PASSED
TestRecordTest > testMultiFieldMatcher() STARTED
TestRecordTest > testMultiFieldMatcher() PASSED
TestRecordTest > testFields() STARTED
TestRecordTest > testFields() PASSED
TestRecordTest > testProducerRecord() STARTED
TestRecordTest > testProducerRecord() PASSED
TestRecordTest > testEqualsAndHashCode() STARTED
TestRecordTest > testEqualsAndHashCode() PASSED
> Task :streams:upgrade-system-tests-0100:compileJava NO-SOURCE
> Task :streams:upgrade-system-tests-0100:processResources NO-SOURCE
> Task :streams:upgrade-system-tests-0100:classes UP-TO-DATE
> Task :streams:upgrade-system-tests-0100:checkstyleMain NO-SOURCE
> Task :streams:upgrade-system-tests-0100:compileTestJava
> Task :streams:upgrade-system-tests-0100:processTestResources NO-SOURCE
> Task :streams:upgrade-system-tests-0100:testClasses
> Task :streams:upgrade-system-tests-0100:checkstyleTest
> Task :streams:upgrade-system-tests-0100:spotbugsMain NO-SOURCE
> Task :streams:upgrade-system-tests-0100:test
> Task :streams:upgrade-system-tests-0101:compileJava NO-SOURCE
> Task :streams:upgrade-system-tests-0101:processResources NO-SOURCE
> Task :streams:upgrade-system-tests-0101:classes UP-TO-DATE
> Task :streams:upgrade-system-tests-0101:checkstyleMain NO-SOURCE
> Task :streams:upgrade-system-tests-0101:compileTestJava
> Task :streams:upgrade-system-tests-0101:processTestResources NO-SOURCE
> Task :streams:upgrade-system-tests-0101:testClasses
> Task :streams:upgrade-system-tests-0101:checkstyleTest
> Task :streams:upgrade-system-tests-0101:spotbugsMain NO-SOURCE
> Task :streams:upgrade-system-tests-0101:test
> Task :streams:upgrade-system-tests-0102:compileJava NO-SOURCE
> Task :streams:upgrade-system-tests-0102:processResources NO-SOURCE
> Task :streams:upgrade-system-tests-0102:classes UP-TO-DATE
> Task :streams:upgrade-system-tests-0102:checkstyleMain NO-SOURCE
> Task :streams:upgrade-system-tests-0102:compileTestJava
> Task :streams:upgrade-system-tests-0102:processTestResources NO-SOURCE
> Task :streams:upgrade-system-tests-0102:testClasses
> Task :streams:upgrade-system-tests-0102:checkstyleTest
> Task :streams:upgrade-system-tests-0102:spotbugsMain NO-SOURCE
> Task :streams:upgrade-system-tests-0102:test
> Task :streams:upgrade-system-tests-0110:compileJava NO-SOURCE
> Task :streams:upgrade-system-tests-0110:processResources NO-SOURCE
> Task :streams:upgrade-system-tests-0110:classes UP-TO-DATE
> Task :streams:upgrade-system-tests-0110:checkstyleMain NO-SOURCE
> Task :streams:upgrade-system-tests-0110:compileTestJava
> Task :streams:upgrade-system-tests-0110:processTestResources NO-SOURCE
> Task :streams:upgrade-system-tests-0110:testClasses
> Task :streams:upgrade-system-tests-0110:checkstyleTest
> Task :streams:upgrade-system-tests-0110:spotbugsMain NO-SOURCE
> Task :streams:upgrade-system-tests-0110:test
> Task :streams:upgrade-system-tests-10:compileJava NO-SOURCE
> Task :streams:upgrade-system-tests-10:processResources NO-SOURCE
> Task :streams:upgrade-system-tests-10:classes UP-TO-DATE
> Task :streams:upgrade-system-tests-10:checkstyleMain NO-SOURCE
> Task :streams:upgrade-system-tests-10:compileTestJava
> Task :streams:upgrade-system-tests-10:processTestResources NO-SOURCE
> Task :streams:upgrade-system-tests-10:testClasses
> Task :streams:upgrade-system-tests-10:checkstyleTest
> Task :streams:upgrade-system-tests-10:spotbugsMain NO-SOURCE
> Task :streams:upgrade-system-tests-10:test
> Task :streams:upgrade-system-tests-11:compileJava NO-SOURCE
> Task :streams:upgrade-system-tests-11:processResources NO-SOURCE
> Task :streams:upgrade-system-tests-11:classes UP-TO-DATE
> Task :streams:upgrade-system-tests-11:checkstyleMain NO-SOURCE
> Task :streams:upgrade-system-tests-11:compileTestJava
> Task :streams:upgrade-system-tests-11:processTestResources NO-SOURCE
> Task :streams:upgrade-system-tests-11:testClasses
> Task :streams:upgrade-system-tests-11:checkstyleTest
> Task :streams:upgrade-system-tests-11:spotbugsMain NO-SOURCE
> Task :streams:upgrade-system-tests-11:test
> Task :streams:upgrade-system-tests-20:compileJava NO-SOURCE
> Task :streams:upgrade-system-tests-20:processResources NO-SOURCE
> Task :streams:upgrade-system-tests-20:classes UP-TO-DATE
> Task :streams:upgrade-system-tests-20:checkstyleMain NO-SOURCE
> Task :streams:upgrade-system-tests-20:compileTestJava
> Task :streams:upgrade-system-tests-20:processTestResources NO-SOURCE
> Task :streams:upgrade-system-tests-20:testClasses
> Task :streams:upgrade-system-tests-20:checkstyleTest
> Task :streams:upgrade-system-tests-20:spotbugsMain NO-SOURCE
> Task :streams:upgrade-system-tests-20:test
> Task :streams:upgrade-system-tests-21:compileJava NO-SOURCE
> Task :streams:upgrade-system-tests-21:processResources NO-SOURCE
> Task :streams:upgrade-system-tests-21:classes UP-TO-DATE
> Task :streams:upgrade-system-tests-21:checkstyleMain NO-SOURCE
> Task :streams:upgrade-system-tests-21:compileTestJava
> Task :streams:upgrade-system-tests-21:processTestResources NO-SOURCE
> Task :streams:upgrade-system-tests-21:testClasses
> Task :streams:upgrade-system-tests-21:checkstyleTest
> Task :streams:upgrade-system-tests-21:spotbugsMain NO-SOURCE
> Task :streams:upgrade-system-tests-21:test
> Task :streams:upgrade-system-tests-22:compileJava NO-SOURCE
> Task :streams:upgrade-system-tests-22:processResources NO-SOURCE
> Task :streams:upgrade-system-tests-22:classes UP-TO-DATE
> Task :streams:upgrade-system-tests-22:checkstyleMain NO-SOURCE
> Task :streams:upgrade-system-tests-22:compileTestJava
> Task :streams:upgrade-system-tests-22:processTestResources NO-SOURCE
> Task :streams:upgrade-system-tests-22:testClasses
> Task :streams:upgrade-system-tests-22:checkstyleTest
> Task :streams:upgrade-system-tests-22:spotbugsMain NO-SOURCE
> Task :streams:upgrade-system-tests-22:test
> Task :streams:upgrade-system-tests-23:compileJava NO-SOURCE
> Task :streams:upgrade-system-tests-23:processResources NO-SOURCE
> Task :streams:upgrade-system-tests-23:classes UP-TO-DATE
> Task :streams:upgrade-system-tests-23:checkstyleMain NO-SOURCE
> Task :streams:upgrade-system-tests-23:compileTestJava
> Task :streams:upgrade-system-tests-23:processTestResources NO-SOURCE
> Task :streams:upgrade-system-tests-23:testClasses
> Task :streams:upgrade-system-tests-23:checkstyleTest
> Task :streams:upgrade-system-tests-23:spotbugsMain NO-SOURCE
> Task :streams:upgrade-system-tests-23:test
> Task :streams:upgrade-system-tests-24:compileJava NO-SOURCE
> Task :streams:upgrade-system-tests-24:processResources NO-SOURCE
> Task :streams:upgrade-system-tests-24:classes UP-TO-DATE
> Task :streams:upgrade-system-tests-24:checkstyleMain NO-SOURCE
> Task :streams:upgrade-system-tests-24:compileTestJava
> Task :streams:upgrade-system-tests-24:processTestResources NO-SOURCE
> Task :streams:upgrade-system-tests-24:testClasses
> Task :streams:upgrade-system-tests-24:checkstyleTest
> Task :streams:upgrade-system-tests-24:spotbugsMain NO-SOURCE
> Task :streams:upgrade-system-tests-24:test
> Task :streams:upgrade-system-tests-25:compileJava NO-SOURCE
> Task :streams:upgrade-system-tests-25:processResources NO-SOURCE
> Task :streams:upgrade-system-tests-25:classes UP-TO-DATE
> Task :streams:upgrade-system-tests-25:checkstyleMain NO-SOURCE
> Task :streams:upgrade-system-tests-25:compileTestJava
> Task :streams:upgrade-system-tests-25:processTestResources NO-SOURCE
> Task :streams:upgrade-system-tests-25:testClasses
> Task :streams:upgrade-system-tests-25:checkstyleTest
> Task :streams:upgrade-system-tests-25:spotbugsMain NO-SOURCE
> Task :streams:upgrade-system-tests-25:test
> Task :streams:upgrade-system-tests-26:compileJava NO-SOURCE
> Task :streams:upgrade-system-tests-26:processResources NO-SOURCE
> Task :streams:upgrade-system-tests-26:classes UP-TO-DATE
> Task :streams:upgrade-system-tests-26:checkstyleMain NO-SOURCE
> Task :streams:upgrade-system-tests-26:compileTestJava
> Task :streams:upgrade-system-tests-26:processTestResources NO-SOURCE
> Task :streams:upgrade-system-tests-26:testClasses
> Task :streams:upgrade-system-tests-26:checkstyleTest
> Task :streams:upgrade-system-tests-26:spotbugsMain NO-SOURCE
> Task :streams:upgrade-system-tests-26:test
> Task :streams:upgrade-system-tests-27:compileJava NO-SOURCE
> Task :streams:upgrade-system-tests-27:processResources NO-SOURCE
> Task :streams:upgrade-system-tests-27:classes UP-TO-DATE
> Task :streams:upgrade-system-tests-27:checkstyleMain NO-SOURCE
> Task :streams:upgrade-system-tests-27:compileTestJava
> Task :streams:upgrade-system-tests-27:processTestResources NO-SOURCE
> Task :streams:upgrade-system-tests-27:testClasses
> Task :streams:upgrade-system-tests-27:checkstyleTest
> Task :streams:upgrade-system-tests-27:spotbugsMain NO-SOURCE
> Task :streams:upgrade-system-tests-27:test
FAILURE: Build failed with an exception.
* What went wrong:
Execution failed for task ':streams:test'.
> There were failing tests. See the report at: file://<https://ci-builds.apache.org/job/Kafka/job/kafka-trunk-jdk15/ws/streams/build/reports/tests/test/index.html>
* Try:
Run with --stacktrace option to get the stack trace. Run with --info or --debug option to get more log output. Run with --scan to get full insights.
* Get more help at https://help.gradle.org
Deprecated Gradle features were used in this build, making it incompatible with Gradle 7.0.
Use '--warning-mode all' to show the individual deprecation warnings.
See https://docs.gradle.org/6.7.1/userguide/command_line_interface.html#sec:command_line_warnings
BUILD FAILED in 2h 33m 45s
250 actionable tasks: 214 executed, 36 up-to-date
Build step 'Execute shell' marked build as failure
Recording test results
Not sending mail to unregistered user github@hugo-hirsch.de
Jenkins build is back to normal : Kafka » kafka-trunk-jdk15 #433
Posted by Apache Jenkins Server <je...@builds.apache.org>.
See <https://ci-builds.apache.org/job/Kafka/job/kafka-trunk-jdk15/433/display/redirect?page=changes>
Build failed in Jenkins: Kafka » kafka-trunk-jdk15 #432
Posted by Apache Jenkins Server <je...@builds.apache.org>.
See <https://ci-builds.apache.org/job/Kafka/job/kafka-trunk-jdk15/432/display/redirect?page=changes>
Changes:
[github] HOTFIX: fix RocksDBMetricsTest (#9935)
------------------------------------------
[...truncated 3.57 MB...]
TopologyTestDriverEosTest > shouldReturnAllStores() PASSED
TopologyTestDriverEosTest > shouldNotCreateStateDirectoryForStatelessTopology() STARTED
TopologyTestDriverEosTest > shouldNotCreateStateDirectoryForStatelessTopology() PASSED
TopologyTestDriverEosTest > shouldApplyGlobalUpdatesCorrectlyInRecursiveTopologies() STARTED
TopologyTestDriverEosTest > shouldApplyGlobalUpdatesCorrectlyInRecursiveTopologies() PASSED
TopologyTestDriverEosTest > shouldReturnAllStoresNames() STARTED
TopologyTestDriverEosTest > shouldReturnAllStoresNames() PASSED
TopologyTestDriverEosTest > shouldPassRecordHeadersIntoSerializersAndDeserializers() STARTED
TopologyTestDriverEosTest > shouldPassRecordHeadersIntoSerializersAndDeserializers() PASSED
TopologyTestDriverEosTest > shouldProcessConsumerRecordList() STARTED
TopologyTestDriverEosTest > shouldProcessConsumerRecordList() PASSED
TopologyTestDriverEosTest > shouldUseSinkSpecificSerializers() STARTED
TopologyTestDriverEosTest > shouldUseSinkSpecificSerializers() PASSED
TopologyTestDriverEosTest > shouldFlushStoreForFirstInput() STARTED
TopologyTestDriverEosTest > shouldFlushStoreForFirstInput() PASSED
TopologyTestDriverEosTest > shouldProcessFromSourceThatMatchPattern() STARTED
TopologyTestDriverEosTest > shouldProcessFromSourceThatMatchPattern() PASSED
TopologyTestDriverEosTest > shouldCaptureSinkTopicNamesIfWrittenInto() STARTED
TopologyTestDriverEosTest > shouldCaptureSinkTopicNamesIfWrittenInto() PASSED
TopologyTestDriverEosTest > shouldUpdateStoreForNewKey() STARTED
TopologyTestDriverEosTest > shouldUpdateStoreForNewKey() PASSED
TopologyTestDriverEosTest > shouldSendRecordViaCorrectSourceTopicDeprecated() STARTED
TopologyTestDriverEosTest > shouldSendRecordViaCorrectSourceTopicDeprecated() PASSED
TopologyTestDriverEosTest > shouldPunctuateOnWallClockTime() STARTED
TopologyTestDriverEosTest > shouldPunctuateOnWallClockTime() PASSED
TopologyTestDriverEosTest > shouldSetRecordMetadata() STARTED
TopologyTestDriverEosTest > shouldSetRecordMetadata() PASSED
TopologyTestDriverEosTest > shouldNotUpdateStoreForLargerValue() STARTED
TopologyTestDriverEosTest > shouldNotUpdateStoreForLargerValue() PASSED
TopologyTestDriverEosTest > shouldReturnCorrectInMemoryStoreTypeOnly() STARTED
TopologyTestDriverEosTest > shouldReturnCorrectInMemoryStoreTypeOnly() PASSED
TopologyTestDriverEosTest > shouldThrowForMissingTime() STARTED
TopologyTestDriverEosTest > shouldThrowForMissingTime() PASSED
TopologyTestDriverEosTest > shouldCaptureInternalTopicNamesIfWrittenInto() STARTED
TopologyTestDriverEosTest > shouldCaptureInternalTopicNamesIfWrittenInto() PASSED
TopologyTestDriverEosTest > shouldPunctuateOnWallClockTimeDeprecated() STARTED
TopologyTestDriverEosTest > shouldPunctuateOnWallClockTimeDeprecated() PASSED
TopologyTestDriverEosTest > shouldProcessRecordForTopic() STARTED
TopologyTestDriverEosTest > shouldProcessRecordForTopic() PASSED
TopologyTestDriverEosTest > shouldForwardRecordsFromSubtopologyToSubtopology() STARTED
TopologyTestDriverEosTest > shouldForwardRecordsFromSubtopologyToSubtopology() PASSED
TopologyTestDriverEosTest > shouldNotUpdateStoreForSmallerValue() STARTED
TopologyTestDriverEosTest > shouldNotUpdateStoreForSmallerValue() PASSED
TopologyTestDriverEosTest > shouldCreateStateDirectoryForStatefulTopology() STARTED
TopologyTestDriverEosTest > shouldCreateStateDirectoryForStatefulTopology() PASSED
TopologyTestDriverEosTest > shouldNotRequireParameters() STARTED
TopologyTestDriverEosTest > shouldNotRequireParameters() PASSED
TopologyTestDriverEosTest > shouldPunctuateIfWallClockTimeAdvances() STARTED
TopologyTestDriverEosTest > shouldPunctuateIfWallClockTimeAdvances() PASSED
> Task :streams:upgrade-system-tests-0101:compileJava NO-SOURCE
> Task :streams:upgrade-system-tests-0101:processResources NO-SOURCE
> Task :streams:upgrade-system-tests-0101:classes UP-TO-DATE
> Task :streams:upgrade-system-tests-0101:checkstyleMain NO-SOURCE
> Task :streams:upgrade-system-tests-0101:compileTestJava
> Task :streams:upgrade-system-tests-0101:processTestResources NO-SOURCE
> Task :streams:upgrade-system-tests-0101:testClasses
> Task :streams:upgrade-system-tests-0101:checkstyleTest
> Task :streams:upgrade-system-tests-0101:spotbugsMain NO-SOURCE
> Task :streams:upgrade-system-tests-0101:test
> Task :streams:upgrade-system-tests-0102:compileJava NO-SOURCE
> Task :streams:upgrade-system-tests-0102:processResources NO-SOURCE
> Task :streams:upgrade-system-tests-0102:classes UP-TO-DATE
> Task :streams:upgrade-system-tests-0102:checkstyleMain NO-SOURCE
> Task :streams:upgrade-system-tests-0102:compileTestJava
> Task :streams:upgrade-system-tests-0102:processTestResources NO-SOURCE
> Task :streams:upgrade-system-tests-0102:testClasses
> Task :streams:upgrade-system-tests-0102:checkstyleTest
> Task :streams:upgrade-system-tests-0102:spotbugsMain NO-SOURCE
> Task :streams:upgrade-system-tests-0102:test
> Task :streams:upgrade-system-tests-0110:compileJava NO-SOURCE
> Task :streams:upgrade-system-tests-0110:processResources NO-SOURCE
> Task :streams:upgrade-system-tests-0110:classes UP-TO-DATE
> Task :streams:upgrade-system-tests-0110:checkstyleMain NO-SOURCE
> Task :streams:upgrade-system-tests-0110:compileTestJava
> Task :streams:upgrade-system-tests-0110:processTestResources NO-SOURCE
> Task :streams:upgrade-system-tests-0110:testClasses
> Task :streams:upgrade-system-tests-0110:checkstyleTest
> Task :streams:upgrade-system-tests-0110:spotbugsMain NO-SOURCE
> Task :streams:upgrade-system-tests-0110:test
> Task :streams:upgrade-system-tests-10:compileJava NO-SOURCE
> Task :streams:upgrade-system-tests-10:processResources NO-SOURCE
> Task :streams:upgrade-system-tests-10:classes UP-TO-DATE
> Task :streams:upgrade-system-tests-10:checkstyleMain NO-SOURCE
> Task :streams:upgrade-system-tests-10:compileTestJava
> Task :streams:upgrade-system-tests-10:processTestResources NO-SOURCE
> Task :streams:upgrade-system-tests-10:testClasses
> Task :streams:upgrade-system-tests-10:checkstyleTest
> Task :streams:upgrade-system-tests-10:spotbugsMain NO-SOURCE
> Task :streams:upgrade-system-tests-10:test
> Task :streams:upgrade-system-tests-11:compileJava NO-SOURCE
> Task :streams:upgrade-system-tests-11:processResources NO-SOURCE
> Task :streams:upgrade-system-tests-11:classes UP-TO-DATE
> Task :streams:upgrade-system-tests-11:checkstyleMain NO-SOURCE
> Task :streams:upgrade-system-tests-11:compileTestJava
> Task :streams:upgrade-system-tests-11:processTestResources NO-SOURCE
> Task :streams:upgrade-system-tests-11:testClasses
> Task :streams:upgrade-system-tests-11:checkstyleTest
> Task :streams:upgrade-system-tests-11:spotbugsMain NO-SOURCE
> Task :streams:upgrade-system-tests-11:test
> Task :streams:upgrade-system-tests-20:compileJava NO-SOURCE
> Task :streams:upgrade-system-tests-20:processResources NO-SOURCE
> Task :streams:upgrade-system-tests-20:classes UP-TO-DATE
> Task :streams:upgrade-system-tests-20:checkstyleMain NO-SOURCE
> Task :streams:upgrade-system-tests-20:compileTestJava
> Task :streams:upgrade-system-tests-20:processTestResources NO-SOURCE
> Task :streams:upgrade-system-tests-20:testClasses
> Task :streams:upgrade-system-tests-20:checkstyleTest
> Task :streams:upgrade-system-tests-20:spotbugsMain NO-SOURCE
> Task :streams:upgrade-system-tests-20:test
> Task :streams:upgrade-system-tests-21:compileJava NO-SOURCE
> Task :streams:upgrade-system-tests-21:processResources NO-SOURCE
> Task :streams:upgrade-system-tests-21:classes UP-TO-DATE
> Task :streams:upgrade-system-tests-21:checkstyleMain NO-SOURCE
> Task :streams:upgrade-system-tests-21:compileTestJava
> Task :streams:upgrade-system-tests-21:processTestResources NO-SOURCE
> Task :streams:upgrade-system-tests-21:testClasses
> Task :streams:upgrade-system-tests-21:checkstyleTest
> Task :streams:upgrade-system-tests-21:spotbugsMain NO-SOURCE
> Task :streams:upgrade-system-tests-21:test
> Task :streams:upgrade-system-tests-22:compileJava NO-SOURCE
> Task :streams:upgrade-system-tests-22:processResources NO-SOURCE
> Task :streams:upgrade-system-tests-22:classes UP-TO-DATE
> Task :streams:upgrade-system-tests-22:checkstyleMain NO-SOURCE
> Task :streams:upgrade-system-tests-22:compileTestJava
> Task :streams:upgrade-system-tests-22:processTestResources NO-SOURCE
> Task :streams:upgrade-system-tests-22:testClasses
> Task :streams:upgrade-system-tests-22:checkstyleTest
> Task :streams:upgrade-system-tests-22:spotbugsMain NO-SOURCE
> Task :streams:upgrade-system-tests-22:test
> Task :streams:upgrade-system-tests-23:compileJava NO-SOURCE
> Task :streams:upgrade-system-tests-23:processResources NO-SOURCE
> Task :streams:upgrade-system-tests-23:classes UP-TO-DATE
> Task :streams:upgrade-system-tests-23:checkstyleMain NO-SOURCE
> Task :streams:upgrade-system-tests-23:compileTestJava
> Task :streams:upgrade-system-tests-23:processTestResources NO-SOURCE
> Task :streams:upgrade-system-tests-23:testClasses
> Task :streams:upgrade-system-tests-23:checkstyleTest
> Task :streams:upgrade-system-tests-23:spotbugsMain NO-SOURCE
> Task :streams:upgrade-system-tests-23:test
> Task :streams:upgrade-system-tests-24:compileJava NO-SOURCE
> Task :streams:upgrade-system-tests-24:processResources NO-SOURCE
> Task :streams:upgrade-system-tests-24:classes UP-TO-DATE
> Task :streams:upgrade-system-tests-24:checkstyleMain NO-SOURCE
> Task :streams:upgrade-system-tests-24:compileTestJava
> Task :streams:upgrade-system-tests-24:processTestResources NO-SOURCE
> Task :streams:upgrade-system-tests-24:testClasses
> Task :streams:upgrade-system-tests-24:checkstyleTest
> Task :streams:upgrade-system-tests-24:spotbugsMain NO-SOURCE
> Task :streams:upgrade-system-tests-24:test
> Task :streams:upgrade-system-tests-25:compileJava NO-SOURCE
> Task :streams:upgrade-system-tests-25:processResources NO-SOURCE
> Task :streams:upgrade-system-tests-25:classes UP-TO-DATE
> Task :streams:upgrade-system-tests-25:checkstyleMain NO-SOURCE
> Task :streams:upgrade-system-tests-25:compileTestJava
> Task :streams:upgrade-system-tests-25:processTestResources NO-SOURCE
> Task :streams:upgrade-system-tests-25:testClasses
> Task :streams:upgrade-system-tests-25:checkstyleTest
> Task :streams:upgrade-system-tests-25:spotbugsMain NO-SOURCE
> Task :streams:upgrade-system-tests-25:test
> Task :streams:upgrade-system-tests-26:compileJava NO-SOURCE
> Task :streams:upgrade-system-tests-26:processResources NO-SOURCE
> Task :streams:upgrade-system-tests-26:classes UP-TO-DATE
> Task :streams:upgrade-system-tests-26:checkstyleMain NO-SOURCE
> Task :streams:upgrade-system-tests-26:compileTestJava
> Task :streams:upgrade-system-tests-26:processTestResources NO-SOURCE
> Task :streams:upgrade-system-tests-26:testClasses
> Task :streams:upgrade-system-tests-26:checkstyleTest
> Task :streams:upgrade-system-tests-26:spotbugsMain NO-SOURCE
> Task :streams:upgrade-system-tests-26:test
> Task :streams:upgrade-system-tests-27:compileJava NO-SOURCE
> Task :streams:upgrade-system-tests-27:processResources NO-SOURCE
> Task :streams:upgrade-system-tests-27:classes UP-TO-DATE
> Task :streams:upgrade-system-tests-27:checkstyleMain NO-SOURCE
> Task :streams:upgrade-system-tests-27:compileTestJava
> Task :streams:upgrade-system-tests-27:processTestResources NO-SOURCE
> Task :streams:upgrade-system-tests-27:testClasses
> Task :streams:upgrade-system-tests-27:checkstyleTest
> Task :streams:upgrade-system-tests-27:spotbugsMain NO-SOURCE
> Task :streams:upgrade-system-tests-27:test
FAILURE: Build failed with an exception.
* What went wrong:
Execution failed for task ':streams:test'.
> There were failing tests. See the report at: file://<https://ci-builds.apache.org/job/Kafka/job/kafka-trunk-jdk15/ws/streams/build/reports/tests/test/index.html>
* Try:
Run with --stacktrace option to get the stack trace. Run with --info or --debug option to get more log output. Run with --scan to get full insights.
* Get more help at https://help.gradle.org
Deprecated Gradle features were used in this build, making it incompatible with Gradle 7.0.
Use '--warning-mode all' to show the individual deprecation warnings.
See https://docs.gradle.org/6.8/userguide/command_line_interface.html#sec:command_line_warnings
BUILD FAILED in 2h 31m 18s
250 actionable tasks: 214 executed, 36 up-to-date
Build step 'Execute shell' marked build as failure
Recording test results
Not sending mail to unregistered user github@hugo-hirsch.de
Build failed in Jenkins: Kafka » kafka-trunk-jdk15 #431
Posted by Apache Jenkins Server <je...@builds.apache.org>.
See <https://ci-builds.apache.org/job/Kafka/job/kafka-trunk-jdk15/431/display/redirect?page=changes>
Changes:
[github] KAFKA-8460: produce records with current timestamp (#9877)
------------------------------------------
[...truncated 3.58 MB...]
TestTopicsTest > shouldNotAllowToCreateWithNullDriver() PASSED
TestTopicsTest > testDuration() STARTED
TestTopicsTest > testDuration() PASSED
TestTopicsTest > testOutputToString() STARTED
TestTopicsTest > testOutputToString() PASSED
TestTopicsTest > testValue() STARTED
TestTopicsTest > testValue() PASSED
TestTopicsTest > testTimestampAutoAdvance() STARTED
TestTopicsTest > testTimestampAutoAdvance() PASSED
TestTopicsTest > testOutputWrongSerde() STARTED
TestTopicsTest > testOutputWrongSerde() PASSED
TestTopicsTest > shouldNotAllowToCreateOutputTopicWithNullTopicName() STARTED
TestTopicsTest > shouldNotAllowToCreateOutputTopicWithNullTopicName() PASSED
TestTopicsTest > testWrongSerde() STARTED
TestTopicsTest > testWrongSerde() PASSED
TestTopicsTest > testKeyValuesToMapWithNull() STARTED
TestTopicsTest > testKeyValuesToMapWithNull() PASSED
TestTopicsTest > testNonExistingOutputTopic() STARTED
TestTopicsTest > testNonExistingOutputTopic() PASSED
TestTopicsTest > testMultipleTopics() STARTED
TestTopicsTest > testMultipleTopics() PASSED
TestTopicsTest > testKeyValueList() STARTED
TestTopicsTest > testKeyValueList() PASSED
TestTopicsTest > shouldNotAllowToCreateOutputWithNullDriver() STARTED
TestTopicsTest > shouldNotAllowToCreateOutputWithNullDriver() PASSED
TestTopicsTest > testValueList() STARTED
TestTopicsTest > testValueList() PASSED
TestTopicsTest > testRecordList() STARTED
TestTopicsTest > testRecordList() PASSED
TestTopicsTest > testNonExistingInputTopic() STARTED
TestTopicsTest > testNonExistingInputTopic() PASSED
TestTopicsTest > testKeyValuesToMap() STARTED
TestTopicsTest > testKeyValuesToMap() PASSED
TestTopicsTest > testRecordsToList() STARTED
TestTopicsTest > testRecordsToList() PASSED
TestTopicsTest > testKeyValueListDuration() STARTED
TestTopicsTest > testKeyValueListDuration() PASSED
TestTopicsTest > testInputToString() STARTED
TestTopicsTest > testInputToString() PASSED
TestTopicsTest > testTimestamp() STARTED
TestTopicsTest > testTimestamp() PASSED
TestTopicsTest > testWithHeaders() STARTED
TestTopicsTest > testWithHeaders() PASSED
TestTopicsTest > testKeyValue() STARTED
TestTopicsTest > testKeyValue() PASSED
TestTopicsTest > shouldNotAllowToCreateTopicWithNullTopicName() STARTED
TestTopicsTest > shouldNotAllowToCreateTopicWithNullTopicName() PASSED
> Task :streams:upgrade-system-tests-0102:compileJava NO-SOURCE
> Task :streams:upgrade-system-tests-0102:processResources NO-SOURCE
> Task :streams:upgrade-system-tests-0102:classes UP-TO-DATE
> Task :streams:upgrade-system-tests-0102:checkstyleMain NO-SOURCE
> Task :streams:upgrade-system-tests-0102:compileTestJava
> Task :streams:upgrade-system-tests-0102:processTestResources NO-SOURCE
> Task :streams:upgrade-system-tests-0102:testClasses
> Task :streams:upgrade-system-tests-0102:checkstyleTest
> Task :streams:upgrade-system-tests-0102:spotbugsMain NO-SOURCE
> Task :streams:upgrade-system-tests-0102:test
> Task :streams:upgrade-system-tests-0110:compileJava NO-SOURCE
> Task :streams:upgrade-system-tests-0110:processResources NO-SOURCE
> Task :streams:upgrade-system-tests-0110:classes UP-TO-DATE
> Task :streams:upgrade-system-tests-0110:checkstyleMain NO-SOURCE
> Task :streams:upgrade-system-tests-0110:compileTestJava
> Task :streams:upgrade-system-tests-0110:processTestResources NO-SOURCE
> Task :streams:upgrade-system-tests-0110:testClasses
> Task :streams:upgrade-system-tests-0110:checkstyleTest
> Task :streams:upgrade-system-tests-0110:spotbugsMain NO-SOURCE
> Task :streams:upgrade-system-tests-0110:test
> Task :streams:upgrade-system-tests-10:compileJava NO-SOURCE
> Task :streams:upgrade-system-tests-10:processResources NO-SOURCE
> Task :streams:upgrade-system-tests-10:classes UP-TO-DATE
> Task :streams:upgrade-system-tests-10:checkstyleMain NO-SOURCE
> Task :streams:upgrade-system-tests-10:compileTestJava
> Task :streams:upgrade-system-tests-10:processTestResources NO-SOURCE
> Task :streams:upgrade-system-tests-10:testClasses
> Task :streams:upgrade-system-tests-10:checkstyleTest
> Task :streams:upgrade-system-tests-10:spotbugsMain NO-SOURCE
> Task :streams:upgrade-system-tests-10:test
> Task :streams:upgrade-system-tests-11:compileJava NO-SOURCE
> Task :streams:upgrade-system-tests-11:processResources NO-SOURCE
> Task :streams:upgrade-system-tests-11:classes UP-TO-DATE
> Task :streams:upgrade-system-tests-11:checkstyleMain NO-SOURCE
> Task :streams:upgrade-system-tests-11:compileTestJava
> Task :streams:upgrade-system-tests-11:processTestResources NO-SOURCE
> Task :streams:upgrade-system-tests-11:testClasses
> Task :streams:upgrade-system-tests-11:checkstyleTest
> Task :streams:upgrade-system-tests-11:spotbugsMain NO-SOURCE
> Task :streams:upgrade-system-tests-11:test
> Task :streams:upgrade-system-tests-20:compileJava NO-SOURCE
> Task :streams:upgrade-system-tests-20:processResources NO-SOURCE
> Task :streams:upgrade-system-tests-20:classes UP-TO-DATE
> Task :streams:upgrade-system-tests-20:checkstyleMain NO-SOURCE
> Task :streams:upgrade-system-tests-20:compileTestJava
> Task :streams:upgrade-system-tests-20:processTestResources NO-SOURCE
> Task :streams:upgrade-system-tests-20:testClasses
> Task :streams:upgrade-system-tests-20:checkstyleTest
> Task :streams:upgrade-system-tests-20:spotbugsMain NO-SOURCE
> Task :streams:upgrade-system-tests-20:test
> Task :streams:upgrade-system-tests-21:compileJava NO-SOURCE
> Task :streams:upgrade-system-tests-21:processResources NO-SOURCE
> Task :streams:upgrade-system-tests-21:classes UP-TO-DATE
> Task :streams:upgrade-system-tests-21:checkstyleMain NO-SOURCE
> Task :streams:upgrade-system-tests-21:compileTestJava
> Task :streams:upgrade-system-tests-21:processTestResources NO-SOURCE
> Task :streams:upgrade-system-tests-21:testClasses
> Task :streams:upgrade-system-tests-21:checkstyleTest
> Task :streams:upgrade-system-tests-21:spotbugsMain NO-SOURCE
> Task :streams:upgrade-system-tests-21:test
> Task :streams:upgrade-system-tests-22:compileJava NO-SOURCE
> Task :streams:upgrade-system-tests-22:processResources NO-SOURCE
> Task :streams:upgrade-system-tests-22:classes UP-TO-DATE
> Task :streams:upgrade-system-tests-22:checkstyleMain NO-SOURCE
> Task :streams:upgrade-system-tests-22:compileTestJava
> Task :streams:upgrade-system-tests-22:processTestResources NO-SOURCE
> Task :streams:upgrade-system-tests-22:testClasses
> Task :streams:upgrade-system-tests-22:checkstyleTest
> Task :streams:upgrade-system-tests-22:spotbugsMain NO-SOURCE
> Task :streams:upgrade-system-tests-22:test
> Task :streams:upgrade-system-tests-23:compileJava NO-SOURCE
> Task :streams:upgrade-system-tests-23:processResources NO-SOURCE
> Task :streams:upgrade-system-tests-23:classes UP-TO-DATE
> Task :streams:upgrade-system-tests-23:checkstyleMain NO-SOURCE
> Task :streams:upgrade-system-tests-23:compileTestJava
> Task :streams:upgrade-system-tests-23:processTestResources NO-SOURCE
> Task :streams:upgrade-system-tests-23:testClasses
> Task :streams:upgrade-system-tests-23:checkstyleTest
> Task :streams:upgrade-system-tests-23:spotbugsMain NO-SOURCE
> Task :streams:upgrade-system-tests-23:test
> Task :streams:upgrade-system-tests-24:compileJava NO-SOURCE
> Task :streams:upgrade-system-tests-24:processResources NO-SOURCE
> Task :streams:upgrade-system-tests-24:classes UP-TO-DATE
> Task :streams:upgrade-system-tests-24:checkstyleMain NO-SOURCE
> Task :streams:upgrade-system-tests-24:compileTestJava
> Task :streams:upgrade-system-tests-24:processTestResources NO-SOURCE
> Task :streams:upgrade-system-tests-24:testClasses
> Task :streams:upgrade-system-tests-24:checkstyleTest
> Task :streams:upgrade-system-tests-24:spotbugsMain NO-SOURCE
> Task :streams:upgrade-system-tests-24:test
> Task :streams:upgrade-system-tests-25:compileJava NO-SOURCE
> Task :streams:upgrade-system-tests-25:processResources NO-SOURCE
> Task :streams:upgrade-system-tests-25:classes UP-TO-DATE
> Task :streams:upgrade-system-tests-25:checkstyleMain NO-SOURCE
> Task :streams:upgrade-system-tests-25:compileTestJava
> Task :streams:upgrade-system-tests-25:processTestResources NO-SOURCE
> Task :streams:upgrade-system-tests-25:testClasses
> Task :streams:upgrade-system-tests-25:checkstyleTest
> Task :streams:upgrade-system-tests-25:spotbugsMain NO-SOURCE
> Task :streams:upgrade-system-tests-25:test
> Task :streams:upgrade-system-tests-26:compileJava NO-SOURCE
> Task :streams:upgrade-system-tests-26:processResources NO-SOURCE
> Task :streams:upgrade-system-tests-26:classes UP-TO-DATE
> Task :streams:upgrade-system-tests-26:checkstyleMain NO-SOURCE
> Task :streams:upgrade-system-tests-26:compileTestJava
> Task :streams:upgrade-system-tests-26:processTestResources NO-SOURCE
> Task :streams:upgrade-system-tests-26:testClasses
> Task :streams:upgrade-system-tests-26:checkstyleTest
> Task :streams:upgrade-system-tests-26:spotbugsMain NO-SOURCE
> Task :streams:upgrade-system-tests-26:test
> Task :streams:upgrade-system-tests-27:compileJava NO-SOURCE
> Task :streams:upgrade-system-tests-27:processResources NO-SOURCE
> Task :streams:upgrade-system-tests-27:classes UP-TO-DATE
> Task :streams:upgrade-system-tests-27:checkstyleMain NO-SOURCE
> Task :streams:upgrade-system-tests-27:compileTestJava
> Task :streams:upgrade-system-tests-27:processTestResources NO-SOURCE
> Task :streams:upgrade-system-tests-27:testClasses
> Task :streams:upgrade-system-tests-27:checkstyleTest
> Task :streams:upgrade-system-tests-27:spotbugsMain NO-SOURCE
> Task :streams:upgrade-system-tests-27:test
FAILURE: Build completed with 2 failures.
1: Task failed with an exception.
-----------
* What went wrong:
Execution failed for task ':streams:test'.
> There were failing tests. See the report at: file://<https://ci-builds.apache.org/job/Kafka/job/kafka-trunk-jdk15/ws/streams/build/reports/tests/test/index.html>
* Try:
Run with --stacktrace option to get the stack trace. Run with --info or --debug option to get more log output. Run with --scan to get full insights.
==============================================================================
2: Task failed with an exception.
-----------
* What went wrong:
Execution failed for task ':connect:mirror:test'.
> There were failing tests. See the report at: file://<https://ci-builds.apache.org/job/Kafka/job/kafka-trunk-jdk15/ws/connect/mirror/build/reports/tests/test/index.html>
* Try:
Run with --stacktrace option to get the stack trace. Run with --info or --debug option to get more log output. Run with --scan to get full insights.
==============================================================================
* Get more help at https://help.gradle.org
Deprecated Gradle features were used in this build, making it incompatible with Gradle 7.0.
Use '--warning-mode all' to show the individual deprecation warnings.
See https://docs.gradle.org/6.8/userguide/command_line_interface.html#sec:command_line_warnings
BUILD FAILED in 2h 34m 13s
250 actionable tasks: 214 executed, 36 up-to-date
Build step 'Execute shell' marked build as failure
Recording test results
Not sending mail to unregistered user github@hugo-hirsch.de
Build failed in Jenkins: Kafka » kafka-trunk-jdk15 #430
Posted by Apache Jenkins Server <je...@builds.apache.org>.
See <https://ci-builds.apache.org/job/Kafka/job/kafka-trunk-jdk15/430/display/redirect?page=changes>
Changes:
[github] MINOR: Add 'task container' class to KafkaStreams TaskManager (#9835)
------------------------------------------
[...truncated 3.57 MB...]
MockProcessorContextStateStoreTest > builder = org.apache.kafka.streams.state.internals.WindowStoreBuilder@474fd3bb, timestamped = false, caching = true, logging = false PASSED
MockProcessorContextStateStoreTest > builder = org.apache.kafka.streams.state.internals.WindowStoreBuilder@5b808845, timestamped = false, caching = true, logging = false STARTED
MockProcessorContextStateStoreTest > builder = org.apache.kafka.streams.state.internals.WindowStoreBuilder@5b808845, timestamped = false, caching = true, logging = false PASSED
MockProcessorContextStateStoreTest > builder = org.apache.kafka.streams.state.internals.WindowStoreBuilder@31244935, timestamped = false, caching = false, logging = true STARTED
MockProcessorContextStateStoreTest > builder = org.apache.kafka.streams.state.internals.WindowStoreBuilder@31244935, timestamped = false, caching = false, logging = true PASSED
MockProcessorContextStateStoreTest > builder = org.apache.kafka.streams.state.internals.WindowStoreBuilder@138cb8d5, timestamped = false, caching = false, logging = true STARTED
MockProcessorContextStateStoreTest > builder = org.apache.kafka.streams.state.internals.WindowStoreBuilder@138cb8d5, timestamped = false, caching = false, logging = true PASSED
MockProcessorContextStateStoreTest > builder = org.apache.kafka.streams.state.internals.WindowStoreBuilder@197ce7c5, timestamped = false, caching = false, logging = true STARTED
MockProcessorContextStateStoreTest > builder = org.apache.kafka.streams.state.internals.WindowStoreBuilder@197ce7c5, timestamped = false, caching = false, logging = true PASSED
MockProcessorContextStateStoreTest > builder = org.apache.kafka.streams.state.internals.WindowStoreBuilder@49c316a6, timestamped = false, caching = false, logging = false STARTED
MockProcessorContextStateStoreTest > builder = org.apache.kafka.streams.state.internals.WindowStoreBuilder@49c316a6, timestamped = false, caching = false, logging = false PASSED
MockProcessorContextStateStoreTest > builder = org.apache.kafka.streams.state.internals.WindowStoreBuilder@5abe2753, timestamped = false, caching = false, logging = false STARTED
MockProcessorContextStateStoreTest > builder = org.apache.kafka.streams.state.internals.WindowStoreBuilder@5abe2753, timestamped = false, caching = false, logging = false PASSED
MockProcessorContextStateStoreTest > builder = org.apache.kafka.streams.state.internals.WindowStoreBuilder@78a19c36, timestamped = false, caching = false, logging = false STARTED
MockProcessorContextStateStoreTest > builder = org.apache.kafka.streams.state.internals.WindowStoreBuilder@78a19c36, timestamped = false, caching = false, logging = false PASSED
MockProcessorContextStateStoreTest > builder = org.apache.kafka.streams.state.internals.SessionStoreBuilder@201ed991, timestamped = false, caching = true, logging = true STARTED
MockProcessorContextStateStoreTest > builder = org.apache.kafka.streams.state.internals.SessionStoreBuilder@201ed991, timestamped = false, caching = true, logging = true PASSED
MockProcessorContextStateStoreTest > builder = org.apache.kafka.streams.state.internals.SessionStoreBuilder@d4e4408, timestamped = false, caching = true, logging = true STARTED
MockProcessorContextStateStoreTest > builder = org.apache.kafka.streams.state.internals.SessionStoreBuilder@d4e4408, timestamped = false, caching = true, logging = true PASSED
MockProcessorContextStateStoreTest > builder = org.apache.kafka.streams.state.internals.SessionStoreBuilder@7c8066b6, timestamped = false, caching = true, logging = false STARTED
MockProcessorContextStateStoreTest > builder = org.apache.kafka.streams.state.internals.SessionStoreBuilder@7c8066b6, timestamped = false, caching = true, logging = false PASSED
MockProcessorContextStateStoreTest > builder = org.apache.kafka.streams.state.internals.SessionStoreBuilder@72e2eca, timestamped = false, caching = true, logging = false STARTED
MockProcessorContextStateStoreTest > builder = org.apache.kafka.streams.state.internals.SessionStoreBuilder@72e2eca, timestamped = false, caching = true, logging = false PASSED
MockProcessorContextStateStoreTest > builder = org.apache.kafka.streams.state.internals.SessionStoreBuilder@553950f3, timestamped = false, caching = false, logging = true STARTED
MockProcessorContextStateStoreTest > builder = org.apache.kafka.streams.state.internals.SessionStoreBuilder@553950f3, timestamped = false, caching = false, logging = true PASSED
MockProcessorContextStateStoreTest > builder = org.apache.kafka.streams.state.internals.SessionStoreBuilder@28500c1, timestamped = false, caching = false, logging = true STARTED
MockProcessorContextStateStoreTest > builder = org.apache.kafka.streams.state.internals.SessionStoreBuilder@28500c1, timestamped = false, caching = false, logging = true PASSED
MockProcessorContextStateStoreTest > builder = org.apache.kafka.streams.state.internals.SessionStoreBuilder@57bcdd50, timestamped = false, caching = false, logging = false STARTED
MockProcessorContextStateStoreTest > builder = org.apache.kafka.streams.state.internals.SessionStoreBuilder@57bcdd50, timestamped = false, caching = false, logging = false PASSED
MockProcessorContextStateStoreTest > builder = org.apache.kafka.streams.state.internals.SessionStoreBuilder@38eaec18, timestamped = false, caching = false, logging = false STARTED
MockProcessorContextStateStoreTest > builder = org.apache.kafka.streams.state.internals.SessionStoreBuilder@38eaec18, timestamped = false, caching = false, logging = false PASSED
TestRecordTest > testConsumerRecord() STARTED
TestRecordTest > testConsumerRecord() PASSED
TestRecordTest > testToString() STARTED
TestRecordTest > testToString() PASSED
TestRecordTest > testInvalidRecords() STARTED
TestRecordTest > testInvalidRecords() PASSED
TestRecordTest > testPartialConstructorEquals() STARTED
TestRecordTest > testPartialConstructorEquals() PASSED
TestRecordTest > testMultiFieldMatcher() STARTED
TestRecordTest > testMultiFieldMatcher() PASSED
TestRecordTest > testFields() STARTED
TestRecordTest > testFields() PASSED
TestRecordTest > testProducerRecord() STARTED
TestRecordTest > testProducerRecord() PASSED
TestRecordTest > testEqualsAndHashCode() STARTED
TestRecordTest > testEqualsAndHashCode() PASSED
> Task :streams:upgrade-system-tests-0102:compileJava NO-SOURCE
> Task :streams:upgrade-system-tests-0102:processResources NO-SOURCE
> Task :streams:upgrade-system-tests-0102:classes UP-TO-DATE
> Task :streams:upgrade-system-tests-0102:checkstyleMain NO-SOURCE
> Task :streams:upgrade-system-tests-0102:compileTestJava
> Task :streams:upgrade-system-tests-0102:processTestResources NO-SOURCE
> Task :streams:upgrade-system-tests-0102:testClasses
> Task :streams:upgrade-system-tests-0102:checkstyleTest
> Task :streams:upgrade-system-tests-0102:spotbugsMain NO-SOURCE
> Task :streams:upgrade-system-tests-0102:test
> Task :streams:upgrade-system-tests-0110:compileJava NO-SOURCE
> Task :streams:upgrade-system-tests-0110:processResources NO-SOURCE
> Task :streams:upgrade-system-tests-0110:classes UP-TO-DATE
> Task :streams:upgrade-system-tests-0110:checkstyleMain NO-SOURCE
> Task :streams:upgrade-system-tests-0110:compileTestJava
> Task :streams:upgrade-system-tests-0110:processTestResources NO-SOURCE
> Task :streams:upgrade-system-tests-0110:testClasses
> Task :streams:upgrade-system-tests-0110:checkstyleTest
> Task :streams:upgrade-system-tests-0110:spotbugsMain NO-SOURCE
> Task :streams:upgrade-system-tests-0110:test
> Task :streams:upgrade-system-tests-10:compileJava NO-SOURCE
> Task :streams:upgrade-system-tests-10:processResources NO-SOURCE
> Task :streams:upgrade-system-tests-10:classes UP-TO-DATE
> Task :streams:upgrade-system-tests-10:checkstyleMain NO-SOURCE
> Task :streams:upgrade-system-tests-10:compileTestJava
> Task :streams:upgrade-system-tests-10:processTestResources NO-SOURCE
> Task :streams:upgrade-system-tests-10:testClasses
> Task :streams:upgrade-system-tests-10:checkstyleTest
> Task :streams:upgrade-system-tests-10:spotbugsMain NO-SOURCE
> Task :streams:upgrade-system-tests-10:test
> Task :streams:upgrade-system-tests-11:compileJava NO-SOURCE
> Task :streams:upgrade-system-tests-11:processResources NO-SOURCE
> Task :streams:upgrade-system-tests-11:classes UP-TO-DATE
> Task :streams:upgrade-system-tests-11:checkstyleMain NO-SOURCE
> Task :streams:upgrade-system-tests-11:compileTestJava
> Task :streams:upgrade-system-tests-11:processTestResources NO-SOURCE
> Task :streams:upgrade-system-tests-11:testClasses
> Task :streams:upgrade-system-tests-11:checkstyleTest
> Task :streams:upgrade-system-tests-11:spotbugsMain NO-SOURCE
> Task :streams:upgrade-system-tests-11:test
> Task :streams:upgrade-system-tests-20:compileJava NO-SOURCE
> Task :streams:upgrade-system-tests-20:processResources NO-SOURCE
> Task :streams:upgrade-system-tests-20:classes UP-TO-DATE
> Task :streams:upgrade-system-tests-20:checkstyleMain NO-SOURCE
> Task :streams:upgrade-system-tests-20:compileTestJava
> Task :streams:upgrade-system-tests-20:processTestResources NO-SOURCE
> Task :streams:upgrade-system-tests-20:testClasses
> Task :streams:upgrade-system-tests-20:checkstyleTest
> Task :streams:upgrade-system-tests-20:spotbugsMain NO-SOURCE
> Task :streams:upgrade-system-tests-20:test
> Task :streams:upgrade-system-tests-21:compileJava NO-SOURCE
> Task :streams:upgrade-system-tests-21:processResources NO-SOURCE
> Task :streams:upgrade-system-tests-21:classes UP-TO-DATE
> Task :streams:upgrade-system-tests-21:checkstyleMain NO-SOURCE
> Task :streams:upgrade-system-tests-21:compileTestJava
> Task :streams:upgrade-system-tests-21:processTestResources NO-SOURCE
> Task :streams:upgrade-system-tests-21:testClasses
> Task :streams:upgrade-system-tests-21:checkstyleTest
> Task :streams:upgrade-system-tests-21:spotbugsMain NO-SOURCE
> Task :streams:upgrade-system-tests-21:test
> Task :streams:upgrade-system-tests-22:compileJava NO-SOURCE
> Task :streams:upgrade-system-tests-22:processResources NO-SOURCE
> Task :streams:upgrade-system-tests-22:classes UP-TO-DATE
> Task :streams:upgrade-system-tests-22:checkstyleMain NO-SOURCE
> Task :streams:upgrade-system-tests-22:compileTestJava
> Task :streams:upgrade-system-tests-22:processTestResources NO-SOURCE
> Task :streams:upgrade-system-tests-22:testClasses
> Task :streams:upgrade-system-tests-22:checkstyleTest
> Task :streams:upgrade-system-tests-22:spotbugsMain NO-SOURCE
> Task :streams:upgrade-system-tests-22:test
> Task :streams:upgrade-system-tests-23:compileJava NO-SOURCE
> Task :streams:upgrade-system-tests-23:processResources NO-SOURCE
> Task :streams:upgrade-system-tests-23:classes UP-TO-DATE
> Task :streams:upgrade-system-tests-23:checkstyleMain NO-SOURCE
> Task :streams:upgrade-system-tests-23:compileTestJava
> Task :streams:upgrade-system-tests-23:processTestResources NO-SOURCE
> Task :streams:upgrade-system-tests-23:testClasses
> Task :streams:upgrade-system-tests-23:checkstyleTest
> Task :streams:upgrade-system-tests-23:spotbugsMain NO-SOURCE
> Task :streams:upgrade-system-tests-23:test
> Task :streams:upgrade-system-tests-24:compileJava NO-SOURCE
> Task :streams:upgrade-system-tests-24:processResources NO-SOURCE
> Task :streams:upgrade-system-tests-24:classes UP-TO-DATE
> Task :streams:upgrade-system-tests-24:checkstyleMain NO-SOURCE
> Task :streams:upgrade-system-tests-24:compileTestJava
> Task :streams:upgrade-system-tests-24:processTestResources NO-SOURCE
> Task :streams:upgrade-system-tests-24:testClasses
> Task :streams:upgrade-system-tests-24:checkstyleTest
> Task :streams:upgrade-system-tests-24:spotbugsMain NO-SOURCE
> Task :streams:upgrade-system-tests-24:test
> Task :streams:upgrade-system-tests-25:compileJava NO-SOURCE
> Task :streams:upgrade-system-tests-25:processResources NO-SOURCE
> Task :streams:upgrade-system-tests-25:classes UP-TO-DATE
> Task :streams:upgrade-system-tests-25:checkstyleMain NO-SOURCE
> Task :streams:upgrade-system-tests-25:compileTestJava
> Task :streams:upgrade-system-tests-25:processTestResources NO-SOURCE
> Task :streams:upgrade-system-tests-25:testClasses
> Task :streams:upgrade-system-tests-25:checkstyleTest
> Task :streams:upgrade-system-tests-25:spotbugsMain NO-SOURCE
> Task :streams:upgrade-system-tests-25:test
> Task :streams:upgrade-system-tests-26:compileJava NO-SOURCE
> Task :streams:upgrade-system-tests-26:processResources NO-SOURCE
> Task :streams:upgrade-system-tests-26:classes UP-TO-DATE
> Task :streams:upgrade-system-tests-26:checkstyleMain NO-SOURCE
> Task :streams:upgrade-system-tests-26:compileTestJava
> Task :streams:upgrade-system-tests-26:processTestResources NO-SOURCE
> Task :streams:upgrade-system-tests-26:testClasses
> Task :streams:upgrade-system-tests-26:checkstyleTest
> Task :streams:upgrade-system-tests-26:spotbugsMain NO-SOURCE
> Task :streams:upgrade-system-tests-26:test
> Task :streams:upgrade-system-tests-27:compileJava NO-SOURCE
> Task :streams:upgrade-system-tests-27:processResources NO-SOURCE
> Task :streams:upgrade-system-tests-27:classes UP-TO-DATE
> Task :streams:upgrade-system-tests-27:checkstyleMain NO-SOURCE
> Task :streams:upgrade-system-tests-27:compileTestJava
> Task :streams:upgrade-system-tests-27:processTestResources NO-SOURCE
> Task :streams:upgrade-system-tests-27:testClasses
> Task :streams:upgrade-system-tests-27:checkstyleTest
> Task :streams:upgrade-system-tests-27:spotbugsMain NO-SOURCE
> Task :streams:upgrade-system-tests-27:test
FAILURE: Build completed with 2 failures.
1: Task failed with an exception.
-----------
* What went wrong:
Execution failed for task ':core:test'.
> There were failing tests. See the report at: file://<https://ci-builds.apache.org/job/Kafka/job/kafka-trunk-jdk15/ws/core/build/reports/tests/test/index.html>
* Try:
Run with --stacktrace option to get the stack trace. Run with --info or --debug option to get more log output. Run with --scan to get full insights.
==============================================================================
2: Task failed with an exception.
-----------
* What went wrong:
Execution failed for task ':streams:test'.
> There were failing tests. See the report at: file://<https://ci-builds.apache.org/job/Kafka/job/kafka-trunk-jdk15/ws/streams/build/reports/tests/test/index.html>
* Try:
Run with --stacktrace option to get the stack trace. Run with --info or --debug option to get more log output. Run with --scan to get full insights.
==============================================================================
* Get more help at https://help.gradle.org
Deprecated Gradle features were used in this build, making it incompatible with Gradle 7.0.
Use '--warning-mode all' to show the individual deprecation warnings.
See https://docs.gradle.org/6.8/userguide/command_line_interface.html#sec:command_line_warnings
BUILD FAILED in 2h 33m 50s
250 actionable tasks: 214 executed, 36 up-to-date
Build step 'Execute shell' marked build as failure
Recording test results
Not sending mail to unregistered user github@hugo-hirsch.de
Build failed in Jenkins: Kafka » kafka-trunk-jdk15 #429
Posted by Apache Jenkins Server <je...@builds.apache.org>.
See <https://ci-builds.apache.org/job/Kafka/job/kafka-trunk-jdk15/429/display/redirect?page=changes>
Changes:
[github] MINOR: Fix StreamsOptimizedTest (#9911)
[github] KAFKA-9924: Add docs for RocksDB properties-based metrics (#9895)
------------------------------------------
[...truncated 3.57 MB...]
MockProcessorContextStateStoreTest > builder = org.apache.kafka.streams.state.internals.WindowStoreBuilder@f7297e9, timestamped = false, caching = true, logging = false PASSED
MockProcessorContextStateStoreTest > builder = org.apache.kafka.streams.state.internals.WindowStoreBuilder@2b217d75, timestamped = false, caching = true, logging = false STARTED
MockProcessorContextStateStoreTest > builder = org.apache.kafka.streams.state.internals.WindowStoreBuilder@2b217d75, timestamped = false, caching = true, logging = false PASSED
MockProcessorContextStateStoreTest > builder = org.apache.kafka.streams.state.internals.WindowStoreBuilder@2121bcb3, timestamped = false, caching = false, logging = true STARTED
MockProcessorContextStateStoreTest > builder = org.apache.kafka.streams.state.internals.WindowStoreBuilder@2121bcb3, timestamped = false, caching = false, logging = true PASSED
MockProcessorContextStateStoreTest > builder = org.apache.kafka.streams.state.internals.WindowStoreBuilder@38629315, timestamped = false, caching = false, logging = true STARTED
MockProcessorContextStateStoreTest > builder = org.apache.kafka.streams.state.internals.WindowStoreBuilder@38629315, timestamped = false, caching = false, logging = true PASSED
MockProcessorContextStateStoreTest > builder = org.apache.kafka.streams.state.internals.WindowStoreBuilder@28c9998e, timestamped = false, caching = false, logging = true STARTED
MockProcessorContextStateStoreTest > builder = org.apache.kafka.streams.state.internals.WindowStoreBuilder@28c9998e, timestamped = false, caching = false, logging = true PASSED
MockProcessorContextStateStoreTest > builder = org.apache.kafka.streams.state.internals.WindowStoreBuilder@69dc4de6, timestamped = false, caching = false, logging = false STARTED
MockProcessorContextStateStoreTest > builder = org.apache.kafka.streams.state.internals.WindowStoreBuilder@69dc4de6, timestamped = false, caching = false, logging = false PASSED
MockProcessorContextStateStoreTest > builder = org.apache.kafka.streams.state.internals.WindowStoreBuilder@2e0132b1, timestamped = false, caching = false, logging = false STARTED
MockProcessorContextStateStoreTest > builder = org.apache.kafka.streams.state.internals.WindowStoreBuilder@2e0132b1, timestamped = false, caching = false, logging = false PASSED
MockProcessorContextStateStoreTest > builder = org.apache.kafka.streams.state.internals.WindowStoreBuilder@29917374, timestamped = false, caching = false, logging = false STARTED
MockProcessorContextStateStoreTest > builder = org.apache.kafka.streams.state.internals.WindowStoreBuilder@29917374, timestamped = false, caching = false, logging = false PASSED
MockProcessorContextStateStoreTest > builder = org.apache.kafka.streams.state.internals.SessionStoreBuilder@723869e1, timestamped = false, caching = true, logging = true STARTED
MockProcessorContextStateStoreTest > builder = org.apache.kafka.streams.state.internals.SessionStoreBuilder@723869e1, timestamped = false, caching = true, logging = true PASSED
MockProcessorContextStateStoreTest > builder = org.apache.kafka.streams.state.internals.SessionStoreBuilder@9e3b4ff, timestamped = false, caching = true, logging = true STARTED
MockProcessorContextStateStoreTest > builder = org.apache.kafka.streams.state.internals.SessionStoreBuilder@9e3b4ff, timestamped = false, caching = true, logging = true PASSED
MockProcessorContextStateStoreTest > builder = org.apache.kafka.streams.state.internals.SessionStoreBuilder@767c3146, timestamped = false, caching = true, logging = false STARTED
MockProcessorContextStateStoreTest > builder = org.apache.kafka.streams.state.internals.SessionStoreBuilder@767c3146, timestamped = false, caching = true, logging = false PASSED
MockProcessorContextStateStoreTest > builder = org.apache.kafka.streams.state.internals.SessionStoreBuilder@4845e2b3, timestamped = false, caching = true, logging = false STARTED
MockProcessorContextStateStoreTest > builder = org.apache.kafka.streams.state.internals.SessionStoreBuilder@4845e2b3, timestamped = false, caching = true, logging = false PASSED
MockProcessorContextStateStoreTest > builder = org.apache.kafka.streams.state.internals.SessionStoreBuilder@41fc355f, timestamped = false, caching = false, logging = true STARTED
MockProcessorContextStateStoreTest > builder = org.apache.kafka.streams.state.internals.SessionStoreBuilder@41fc355f, timestamped = false, caching = false, logging = true PASSED
MockProcessorContextStateStoreTest > builder = org.apache.kafka.streams.state.internals.SessionStoreBuilder@694c756d, timestamped = false, caching = false, logging = true STARTED
MockProcessorContextStateStoreTest > builder = org.apache.kafka.streams.state.internals.SessionStoreBuilder@694c756d, timestamped = false, caching = false, logging = true PASSED
MockProcessorContextStateStoreTest > builder = org.apache.kafka.streams.state.internals.SessionStoreBuilder@542b0bfd, timestamped = false, caching = false, logging = false STARTED
MockProcessorContextStateStoreTest > builder = org.apache.kafka.streams.state.internals.SessionStoreBuilder@542b0bfd, timestamped = false, caching = false, logging = false PASSED
MockProcessorContextStateStoreTest > builder = org.apache.kafka.streams.state.internals.SessionStoreBuilder@79eeb469, timestamped = false, caching = false, logging = false STARTED
MockProcessorContextStateStoreTest > builder = org.apache.kafka.streams.state.internals.SessionStoreBuilder@79eeb469, timestamped = false, caching = false, logging = false PASSED
TestRecordTest > testConsumerRecord() STARTED
TestRecordTest > testConsumerRecord() PASSED
TestRecordTest > testToString() STARTED
TestRecordTest > testToString() PASSED
TestRecordTest > testInvalidRecords() STARTED
TestRecordTest > testInvalidRecords() PASSED
TestRecordTest > testPartialConstructorEquals() STARTED
TestRecordTest > testPartialConstructorEquals() PASSED
TestRecordTest > testMultiFieldMatcher() STARTED
TestRecordTest > testMultiFieldMatcher() PASSED
TestRecordTest > testFields() STARTED
TestRecordTest > testFields() PASSED
TestRecordTest > testProducerRecord() STARTED
TestRecordTest > testProducerRecord() PASSED
TestRecordTest > testEqualsAndHashCode() STARTED
TestRecordTest > testEqualsAndHashCode() PASSED
> Task :streams:upgrade-system-tests-0102:compileJava NO-SOURCE
> Task :streams:upgrade-system-tests-0102:processResources NO-SOURCE
> Task :streams:upgrade-system-tests-0102:classes UP-TO-DATE
> Task :streams:upgrade-system-tests-0102:checkstyleMain NO-SOURCE
> Task :streams:upgrade-system-tests-0102:compileTestJava
> Task :streams:upgrade-system-tests-0102:processTestResources NO-SOURCE
> Task :streams:upgrade-system-tests-0102:testClasses
> Task :streams:upgrade-system-tests-0102:checkstyleTest
> Task :streams:upgrade-system-tests-0102:spotbugsMain NO-SOURCE
> Task :streams:upgrade-system-tests-0102:test
> Task :streams:upgrade-system-tests-0110:compileJava NO-SOURCE
> Task :streams:upgrade-system-tests-0110:processResources NO-SOURCE
> Task :streams:upgrade-system-tests-0110:classes UP-TO-DATE
> Task :streams:upgrade-system-tests-0110:checkstyleMain NO-SOURCE
> Task :streams:upgrade-system-tests-0110:compileTestJava
> Task :streams:upgrade-system-tests-0110:processTestResources NO-SOURCE
> Task :streams:upgrade-system-tests-0110:testClasses
> Task :streams:upgrade-system-tests-0110:checkstyleTest
> Task :streams:upgrade-system-tests-0110:spotbugsMain NO-SOURCE
> Task :streams:upgrade-system-tests-0110:test
> Task :streams:upgrade-system-tests-10:compileJava NO-SOURCE
> Task :streams:upgrade-system-tests-10:processResources NO-SOURCE
> Task :streams:upgrade-system-tests-10:classes UP-TO-DATE
> Task :streams:upgrade-system-tests-10:checkstyleMain NO-SOURCE
> Task :streams:upgrade-system-tests-10:compileTestJava
> Task :streams:upgrade-system-tests-10:processTestResources NO-SOURCE
> Task :streams:upgrade-system-tests-10:testClasses
> Task :streams:upgrade-system-tests-10:checkstyleTest
> Task :streams:upgrade-system-tests-10:spotbugsMain NO-SOURCE
> Task :streams:upgrade-system-tests-10:test
> Task :streams:upgrade-system-tests-11:compileJava NO-SOURCE
> Task :streams:upgrade-system-tests-11:processResources NO-SOURCE
> Task :streams:upgrade-system-tests-11:classes UP-TO-DATE
> Task :streams:upgrade-system-tests-11:checkstyleMain NO-SOURCE
> Task :streams:upgrade-system-tests-11:compileTestJava
> Task :streams:upgrade-system-tests-11:processTestResources NO-SOURCE
> Task :streams:upgrade-system-tests-11:testClasses
> Task :streams:upgrade-system-tests-11:checkstyleTest
> Task :streams:upgrade-system-tests-11:spotbugsMain NO-SOURCE
> Task :streams:upgrade-system-tests-11:test
> Task :streams:upgrade-system-tests-20:compileJava NO-SOURCE
> Task :streams:upgrade-system-tests-20:processResources NO-SOURCE
> Task :streams:upgrade-system-tests-20:classes UP-TO-DATE
> Task :streams:upgrade-system-tests-20:checkstyleMain NO-SOURCE
> Task :streams:upgrade-system-tests-20:compileTestJava
> Task :streams:upgrade-system-tests-20:processTestResources NO-SOURCE
> Task :streams:upgrade-system-tests-20:testClasses
> Task :streams:upgrade-system-tests-20:checkstyleTest
> Task :streams:upgrade-system-tests-20:spotbugsMain NO-SOURCE
> Task :streams:upgrade-system-tests-20:test
> Task :streams:upgrade-system-tests-21:compileJava NO-SOURCE
> Task :streams:upgrade-system-tests-21:processResources NO-SOURCE
> Task :streams:upgrade-system-tests-21:classes UP-TO-DATE
> Task :streams:upgrade-system-tests-21:checkstyleMain NO-SOURCE
> Task :streams:upgrade-system-tests-21:compileTestJava
> Task :streams:upgrade-system-tests-21:processTestResources NO-SOURCE
> Task :streams:upgrade-system-tests-21:testClasses
> Task :streams:upgrade-system-tests-21:checkstyleTest
> Task :streams:upgrade-system-tests-21:spotbugsMain NO-SOURCE
> Task :streams:upgrade-system-tests-21:test
> Task :streams:upgrade-system-tests-22:compileJava NO-SOURCE
> Task :streams:upgrade-system-tests-22:processResources NO-SOURCE
> Task :streams:upgrade-system-tests-22:classes UP-TO-DATE
> Task :streams:upgrade-system-tests-22:checkstyleMain NO-SOURCE
> Task :streams:upgrade-system-tests-22:compileTestJava
> Task :streams:upgrade-system-tests-22:processTestResources NO-SOURCE
> Task :streams:upgrade-system-tests-22:testClasses
> Task :streams:upgrade-system-tests-22:checkstyleTest
> Task :streams:upgrade-system-tests-22:spotbugsMain NO-SOURCE
> Task :streams:upgrade-system-tests-22:test
> Task :streams:upgrade-system-tests-23:compileJava NO-SOURCE
> Task :streams:upgrade-system-tests-23:processResources NO-SOURCE
> Task :streams:upgrade-system-tests-23:classes UP-TO-DATE
> Task :streams:upgrade-system-tests-23:checkstyleMain NO-SOURCE
> Task :streams:upgrade-system-tests-23:compileTestJava
> Task :streams:upgrade-system-tests-23:processTestResources NO-SOURCE
> Task :streams:upgrade-system-tests-23:testClasses
> Task :streams:upgrade-system-tests-23:checkstyleTest
> Task :streams:upgrade-system-tests-23:spotbugsMain NO-SOURCE
> Task :streams:upgrade-system-tests-23:test
> Task :streams:upgrade-system-tests-24:compileJava NO-SOURCE
> Task :streams:upgrade-system-tests-24:processResources NO-SOURCE
> Task :streams:upgrade-system-tests-24:classes UP-TO-DATE
> Task :streams:upgrade-system-tests-24:checkstyleMain NO-SOURCE
> Task :streams:upgrade-system-tests-24:compileTestJava
> Task :streams:upgrade-system-tests-24:processTestResources NO-SOURCE
> Task :streams:upgrade-system-tests-24:testClasses
> Task :streams:upgrade-system-tests-24:checkstyleTest
> Task :streams:upgrade-system-tests-24:spotbugsMain NO-SOURCE
> Task :streams:upgrade-system-tests-24:test
> Task :streams:upgrade-system-tests-25:compileJava NO-SOURCE
> Task :streams:upgrade-system-tests-25:processResources NO-SOURCE
> Task :streams:upgrade-system-tests-25:classes UP-TO-DATE
> Task :streams:upgrade-system-tests-25:checkstyleMain NO-SOURCE
> Task :streams:upgrade-system-tests-25:compileTestJava
> Task :streams:upgrade-system-tests-25:processTestResources NO-SOURCE
> Task :streams:upgrade-system-tests-25:testClasses
> Task :streams:upgrade-system-tests-25:checkstyleTest
> Task :streams:upgrade-system-tests-25:spotbugsMain NO-SOURCE
> Task :streams:upgrade-system-tests-25:test
> Task :streams:upgrade-system-tests-26:compileJava NO-SOURCE
> Task :streams:upgrade-system-tests-26:processResources NO-SOURCE
> Task :streams:upgrade-system-tests-26:classes UP-TO-DATE
> Task :streams:upgrade-system-tests-26:checkstyleMain NO-SOURCE
> Task :streams:upgrade-system-tests-26:compileTestJava
> Task :streams:upgrade-system-tests-26:processTestResources NO-SOURCE
> Task :streams:upgrade-system-tests-26:testClasses
> Task :streams:upgrade-system-tests-26:checkstyleTest
> Task :streams:upgrade-system-tests-26:spotbugsMain NO-SOURCE
> Task :streams:upgrade-system-tests-26:test
> Task :streams:upgrade-system-tests-27:compileJava NO-SOURCE
> Task :streams:upgrade-system-tests-27:processResources NO-SOURCE
> Task :streams:upgrade-system-tests-27:classes UP-TO-DATE
> Task :streams:upgrade-system-tests-27:checkstyleMain NO-SOURCE
> Task :streams:upgrade-system-tests-27:compileTestJava
> Task :streams:upgrade-system-tests-27:processTestResources NO-SOURCE
> Task :streams:upgrade-system-tests-27:testClasses
> Task :streams:upgrade-system-tests-27:checkstyleTest
> Task :streams:upgrade-system-tests-27:spotbugsMain NO-SOURCE
> Task :streams:upgrade-system-tests-27:test
FAILURE: Build completed with 2 failures.
1: Task failed with an exception.
-----------
* What went wrong:
Execution failed for task ':core:test'.
> There were failing tests. See the report at: file://<https://ci-builds.apache.org/job/Kafka/job/kafka-trunk-jdk15/ws/core/build/reports/tests/test/index.html>
* Try:
Run with --stacktrace option to get the stack trace. Run with --info or --debug option to get more log output. Run with --scan to get full insights.
==============================================================================
2: Task failed with an exception.
-----------
* What went wrong:
Execution failed for task ':streams:test'.
> There were failing tests. See the report at: file://<https://ci-builds.apache.org/job/Kafka/job/kafka-trunk-jdk15/ws/streams/build/reports/tests/test/index.html>
* Try:
Run with --stacktrace option to get the stack trace. Run with --info or --debug option to get more log output. Run with --scan to get full insights.
==============================================================================
* Get more help at https://help.gradle.org
Deprecated Gradle features were used in this build, making it incompatible with Gradle 7.0.
Use '--warning-mode all' to show the individual deprecation warnings.
See https://docs.gradle.org/6.8/userguide/command_line_interface.html#sec:command_line_warnings
BUILD FAILED in 2h 47m 17s
250 actionable tasks: 214 executed, 36 up-to-date
Build step 'Execute shell' marked build as failure
Recording test results
Not sending mail to unregistered user github@hugo-hirsch.de
Build failed in Jenkins: Kafka » kafka-trunk-jdk15 #428
Posted by Apache Jenkins Server <je...@builds.apache.org>.
See <https://ci-builds.apache.org/job/Kafka/job/kafka-trunk-jdk15/428/display/redirect?page=changes>
Changes:
[github] KAFKA-12204; Implement DescribeCluster API in the broker (KIP-700) (#9903)
[github] KAFKA-10017: fix uncaucht-exception handling in EosBetaUpgradeIntegrationTest (#9733)
[github] KAFKA-12219: Add 'synchronized' keyword to InMemoryKeyValueStore#[reverseRange, reverseAll] (#9923)
------------------------------------------
[...truncated 3.57 MB...]
MockProcessorContextStateStoreTest > builder = org.apache.kafka.streams.state.internals.TimestampedWindowStoreBuilder@15109be3, timestamped = true, caching = false, logging = false PASSED
MockProcessorContextStateStoreTest > builder = org.apache.kafka.streams.state.internals.TimestampedWindowStoreBuilder@7b588efb, timestamped = true, caching = false, logging = false STARTED
MockProcessorContextStateStoreTest > builder = org.apache.kafka.streams.state.internals.TimestampedWindowStoreBuilder@7b588efb, timestamped = true, caching = false, logging = false PASSED
MockProcessorContextStateStoreTest > builder = org.apache.kafka.streams.state.internals.WindowStoreBuilder@51d97df9, timestamped = false, caching = true, logging = true STARTED
MockProcessorContextStateStoreTest > builder = org.apache.kafka.streams.state.internals.WindowStoreBuilder@51d97df9, timestamped = false, caching = true, logging = true PASSED
MockProcessorContextStateStoreTest > builder = org.apache.kafka.streams.state.internals.WindowStoreBuilder@1ed85310, timestamped = false, caching = true, logging = true STARTED
MockProcessorContextStateStoreTest > builder = org.apache.kafka.streams.state.internals.WindowStoreBuilder@1ed85310, timestamped = false, caching = true, logging = true PASSED
MockProcessorContextStateStoreTest > builder = org.apache.kafka.streams.state.internals.WindowStoreBuilder@7fddb7fd, timestamped = false, caching = true, logging = true STARTED
MockProcessorContextStateStoreTest > builder = org.apache.kafka.streams.state.internals.WindowStoreBuilder@7fddb7fd, timestamped = false, caching = true, logging = true PASSED
MockProcessorContextStateStoreTest > builder = org.apache.kafka.streams.state.internals.WindowStoreBuilder@68495ccd, timestamped = false, caching = true, logging = false STARTED
MockProcessorContextStateStoreTest > builder = org.apache.kafka.streams.state.internals.WindowStoreBuilder@68495ccd, timestamped = false, caching = true, logging = false PASSED
MockProcessorContextStateStoreTest > builder = org.apache.kafka.streams.state.internals.WindowStoreBuilder@f7297e9, timestamped = false, caching = true, logging = false STARTED
MockProcessorContextStateStoreTest > builder = org.apache.kafka.streams.state.internals.WindowStoreBuilder@f7297e9, timestamped = false, caching = true, logging = false PASSED
MockProcessorContextStateStoreTest > builder = org.apache.kafka.streams.state.internals.WindowStoreBuilder@2b217d75, timestamped = false, caching = true, logging = false STARTED
MockProcessorContextStateStoreTest > builder = org.apache.kafka.streams.state.internals.WindowStoreBuilder@2b217d75, timestamped = false, caching = true, logging = false PASSED
MockProcessorContextStateStoreTest > builder = org.apache.kafka.streams.state.internals.WindowStoreBuilder@2121bcb3, timestamped = false, caching = false, logging = true STARTED
MockProcessorContextStateStoreTest > builder = org.apache.kafka.streams.state.internals.WindowStoreBuilder@2121bcb3, timestamped = false, caching = false, logging = true PASSED
MockProcessorContextStateStoreTest > builder = org.apache.kafka.streams.state.internals.WindowStoreBuilder@38629315, timestamped = false, caching = false, logging = true STARTED
MockProcessorContextStateStoreTest > builder = org.apache.kafka.streams.state.internals.WindowStoreBuilder@38629315, timestamped = false, caching = false, logging = true PASSED
MockProcessorContextStateStoreTest > builder = org.apache.kafka.streams.state.internals.WindowStoreBuilder@28c9998e, timestamped = false, caching = false, logging = true STARTED
MockProcessorContextStateStoreTest > builder = org.apache.kafka.streams.state.internals.WindowStoreBuilder@28c9998e, timestamped = false, caching = false, logging = true PASSED
MockProcessorContextStateStoreTest > builder = org.apache.kafka.streams.state.internals.WindowStoreBuilder@69dc4de6, timestamped = false, caching = false, logging = false STARTED
MockProcessorContextStateStoreTest > builder = org.apache.kafka.streams.state.internals.WindowStoreBuilder@69dc4de6, timestamped = false, caching = false, logging = false PASSED
MockProcessorContextStateStoreTest > builder = org.apache.kafka.streams.state.internals.WindowStoreBuilder@2e0132b1, timestamped = false, caching = false, logging = false STARTED
MockProcessorContextStateStoreTest > builder = org.apache.kafka.streams.state.internals.WindowStoreBuilder@2e0132b1, timestamped = false, caching = false, logging = false PASSED
MockProcessorContextStateStoreTest > builder = org.apache.kafka.streams.state.internals.WindowStoreBuilder@29917374, timestamped = false, caching = false, logging = false STARTED
MockProcessorContextStateStoreTest > builder = org.apache.kafka.streams.state.internals.WindowStoreBuilder@29917374, timestamped = false, caching = false, logging = false PASSED
MockProcessorContextStateStoreTest > builder = org.apache.kafka.streams.state.internals.SessionStoreBuilder@723869e1, timestamped = false, caching = true, logging = true STARTED
MockProcessorContextStateStoreTest > builder = org.apache.kafka.streams.state.internals.SessionStoreBuilder@723869e1, timestamped = false, caching = true, logging = true PASSED
MockProcessorContextStateStoreTest > builder = org.apache.kafka.streams.state.internals.SessionStoreBuilder@9e3b4ff, timestamped = false, caching = true, logging = true STARTED
MockProcessorContextStateStoreTest > builder = org.apache.kafka.streams.state.internals.SessionStoreBuilder@9e3b4ff, timestamped = false, caching = true, logging = true PASSED
MockProcessorContextStateStoreTest > builder = org.apache.kafka.streams.state.internals.SessionStoreBuilder@767c3146, timestamped = false, caching = true, logging = false STARTED
MockProcessorContextStateStoreTest > builder = org.apache.kafka.streams.state.internals.SessionStoreBuilder@767c3146, timestamped = false, caching = true, logging = false PASSED
MockProcessorContextStateStoreTest > builder = org.apache.kafka.streams.state.internals.SessionStoreBuilder@4845e2b3, timestamped = false, caching = true, logging = false STARTED
MockProcessorContextStateStoreTest > builder = org.apache.kafka.streams.state.internals.SessionStoreBuilder@4845e2b3, timestamped = false, caching = true, logging = false PASSED
MockProcessorContextStateStoreTest > builder = org.apache.kafka.streams.state.internals.SessionStoreBuilder@41fc355f, timestamped = false, caching = false, logging = true STARTED
MockProcessorContextStateStoreTest > builder = org.apache.kafka.streams.state.internals.SessionStoreBuilder@41fc355f, timestamped = false, caching = false, logging = true PASSED
MockProcessorContextStateStoreTest > builder = org.apache.kafka.streams.state.internals.SessionStoreBuilder@694c756d, timestamped = false, caching = false, logging = true STARTED
MockProcessorContextStateStoreTest > builder = org.apache.kafka.streams.state.internals.SessionStoreBuilder@694c756d, timestamped = false, caching = false, logging = true PASSED
MockProcessorContextStateStoreTest > builder = org.apache.kafka.streams.state.internals.SessionStoreBuilder@542b0bfd, timestamped = false, caching = false, logging = false STARTED
MockProcessorContextStateStoreTest > builder = org.apache.kafka.streams.state.internals.SessionStoreBuilder@542b0bfd, timestamped = false, caching = false, logging = false PASSED
MockProcessorContextStateStoreTest > builder = org.apache.kafka.streams.state.internals.SessionStoreBuilder@79eeb469, timestamped = false, caching = false, logging = false STARTED
MockProcessorContextStateStoreTest > builder = org.apache.kafka.streams.state.internals.SessionStoreBuilder@79eeb469, timestamped = false, caching = false, logging = false PASSED
TestRecordTest > testConsumerRecord() STARTED
TestRecordTest > testConsumerRecord() PASSED
TestRecordTest > testToString() STARTED
TestRecordTest > testToString() PASSED
TestRecordTest > testInvalidRecords() STARTED
TestRecordTest > testInvalidRecords() PASSED
TestRecordTest > testPartialConstructorEquals() STARTED
TestRecordTest > testPartialConstructorEquals() PASSED
TestRecordTest > testMultiFieldMatcher() STARTED
TestRecordTest > testMultiFieldMatcher() PASSED
TestRecordTest > testFields() STARTED
TestRecordTest > testFields() PASSED
TestRecordTest > testProducerRecord() STARTED
TestRecordTest > testProducerRecord() PASSED
TestRecordTest > testEqualsAndHashCode() STARTED
TestRecordTest > testEqualsAndHashCode() PASSED
> Task :streams:upgrade-system-tests-0110:compileJava NO-SOURCE
> Task :streams:upgrade-system-tests-0110:processResources NO-SOURCE
> Task :streams:upgrade-system-tests-0110:classes UP-TO-DATE
> Task :streams:upgrade-system-tests-0110:checkstyleMain NO-SOURCE
> Task :streams:upgrade-system-tests-0110:compileTestJava
> Task :streams:upgrade-system-tests-0110:processTestResources NO-SOURCE
> Task :streams:upgrade-system-tests-0110:testClasses
> Task :streams:upgrade-system-tests-0110:checkstyleTest
> Task :streams:upgrade-system-tests-0110:spotbugsMain NO-SOURCE
> Task :streams:upgrade-system-tests-0110:test
> Task :streams:upgrade-system-tests-10:compileJava NO-SOURCE
> Task :streams:upgrade-system-tests-10:processResources NO-SOURCE
> Task :streams:upgrade-system-tests-10:classes UP-TO-DATE
> Task :streams:upgrade-system-tests-10:checkstyleMain NO-SOURCE
> Task :streams:upgrade-system-tests-10:compileTestJava
> Task :streams:upgrade-system-tests-10:processTestResources NO-SOURCE
> Task :streams:upgrade-system-tests-10:testClasses
> Task :streams:upgrade-system-tests-10:checkstyleTest
> Task :streams:upgrade-system-tests-10:spotbugsMain NO-SOURCE
> Task :streams:upgrade-system-tests-10:test
> Task :streams:upgrade-system-tests-11:compileJava NO-SOURCE
> Task :streams:upgrade-system-tests-11:processResources NO-SOURCE
> Task :streams:upgrade-system-tests-11:classes UP-TO-DATE
> Task :streams:upgrade-system-tests-11:checkstyleMain NO-SOURCE
> Task :streams:upgrade-system-tests-11:compileTestJava
> Task :streams:upgrade-system-tests-11:processTestResources NO-SOURCE
> Task :streams:upgrade-system-tests-11:testClasses
> Task :streams:upgrade-system-tests-11:checkstyleTest
> Task :streams:upgrade-system-tests-11:spotbugsMain NO-SOURCE
> Task :streams:upgrade-system-tests-11:test
> Task :streams:upgrade-system-tests-20:compileJava NO-SOURCE
> Task :streams:upgrade-system-tests-20:processResources NO-SOURCE
> Task :streams:upgrade-system-tests-20:classes UP-TO-DATE
> Task :streams:upgrade-system-tests-20:checkstyleMain NO-SOURCE
> Task :streams:upgrade-system-tests-20:compileTestJava
> Task :streams:upgrade-system-tests-20:processTestResources NO-SOURCE
> Task :streams:upgrade-system-tests-20:testClasses
> Task :streams:upgrade-system-tests-20:checkstyleTest
> Task :streams:upgrade-system-tests-20:spotbugsMain NO-SOURCE
> Task :streams:upgrade-system-tests-20:test
> Task :streams:upgrade-system-tests-21:compileJava NO-SOURCE
> Task :streams:upgrade-system-tests-21:processResources NO-SOURCE
> Task :streams:upgrade-system-tests-21:classes UP-TO-DATE
> Task :streams:upgrade-system-tests-21:checkstyleMain NO-SOURCE
> Task :streams:upgrade-system-tests-21:compileTestJava
> Task :streams:upgrade-system-tests-21:processTestResources NO-SOURCE
> Task :streams:upgrade-system-tests-21:testClasses
> Task :streams:upgrade-system-tests-21:checkstyleTest
> Task :streams:upgrade-system-tests-21:spotbugsMain NO-SOURCE
> Task :streams:upgrade-system-tests-21:test
> Task :streams:upgrade-system-tests-22:compileJava NO-SOURCE
> Task :streams:upgrade-system-tests-22:processResources NO-SOURCE
> Task :streams:upgrade-system-tests-22:classes UP-TO-DATE
> Task :streams:upgrade-system-tests-22:checkstyleMain NO-SOURCE
> Task :streams:upgrade-system-tests-22:compileTestJava
> Task :streams:upgrade-system-tests-22:processTestResources NO-SOURCE
> Task :streams:upgrade-system-tests-22:testClasses
> Task :streams:upgrade-system-tests-22:checkstyleTest
> Task :streams:upgrade-system-tests-22:spotbugsMain NO-SOURCE
> Task :streams:upgrade-system-tests-22:test
> Task :streams:upgrade-system-tests-23:compileJava NO-SOURCE
> Task :streams:upgrade-system-tests-23:processResources NO-SOURCE
> Task :streams:upgrade-system-tests-23:classes UP-TO-DATE
> Task :streams:upgrade-system-tests-23:checkstyleMain NO-SOURCE
> Task :streams:upgrade-system-tests-23:compileTestJava
> Task :streams:upgrade-system-tests-23:processTestResources NO-SOURCE
> Task :streams:upgrade-system-tests-23:testClasses
> Task :streams:upgrade-system-tests-23:checkstyleTest
> Task :streams:upgrade-system-tests-23:spotbugsMain NO-SOURCE
> Task :streams:upgrade-system-tests-23:test
> Task :streams:upgrade-system-tests-24:compileJava NO-SOURCE
> Task :streams:upgrade-system-tests-24:processResources NO-SOURCE
> Task :streams:upgrade-system-tests-24:classes UP-TO-DATE
> Task :streams:upgrade-system-tests-24:checkstyleMain NO-SOURCE
> Task :streams:upgrade-system-tests-24:compileTestJava
> Task :streams:upgrade-system-tests-24:processTestResources NO-SOURCE
> Task :streams:upgrade-system-tests-24:testClasses
> Task :streams:upgrade-system-tests-24:checkstyleTest
> Task :streams:upgrade-system-tests-24:spotbugsMain NO-SOURCE
> Task :streams:upgrade-system-tests-24:test
> Task :streams:upgrade-system-tests-25:compileJava NO-SOURCE
> Task :streams:upgrade-system-tests-25:processResources NO-SOURCE
> Task :streams:upgrade-system-tests-25:classes UP-TO-DATE
> Task :streams:upgrade-system-tests-25:checkstyleMain NO-SOURCE
> Task :streams:upgrade-system-tests-25:compileTestJava
> Task :streams:upgrade-system-tests-25:processTestResources NO-SOURCE
> Task :streams:upgrade-system-tests-25:testClasses
> Task :streams:upgrade-system-tests-25:checkstyleTest
> Task :streams:upgrade-system-tests-25:spotbugsMain NO-SOURCE
> Task :streams:upgrade-system-tests-25:test
> Task :streams:upgrade-system-tests-26:compileJava NO-SOURCE
> Task :streams:upgrade-system-tests-26:processResources NO-SOURCE
> Task :streams:upgrade-system-tests-26:classes UP-TO-DATE
> Task :streams:upgrade-system-tests-26:checkstyleMain NO-SOURCE
> Task :streams:upgrade-system-tests-26:compileTestJava
> Task :streams:upgrade-system-tests-26:processTestResources NO-SOURCE
> Task :streams:upgrade-system-tests-26:testClasses
> Task :streams:upgrade-system-tests-26:checkstyleTest
> Task :streams:upgrade-system-tests-26:spotbugsMain NO-SOURCE
> Task :streams:upgrade-system-tests-26:test
> Task :streams:upgrade-system-tests-27:compileJava NO-SOURCE
> Task :streams:upgrade-system-tests-27:processResources NO-SOURCE
> Task :streams:upgrade-system-tests-27:classes UP-TO-DATE
> Task :streams:upgrade-system-tests-27:checkstyleMain NO-SOURCE
> Task :streams:upgrade-system-tests-27:compileTestJava
> Task :streams:upgrade-system-tests-27:processTestResources NO-SOURCE
> Task :streams:upgrade-system-tests-27:testClasses
> Task :streams:upgrade-system-tests-27:checkstyleTest
> Task :streams:upgrade-system-tests-27:spotbugsMain NO-SOURCE
> Task :streams:upgrade-system-tests-27:test
FAILURE: Build failed with an exception.
* What went wrong:
Execution failed for task ':core:test'.
> There were failing tests. See the report at: file://<https://ci-builds.apache.org/job/Kafka/job/kafka-trunk-jdk15/ws/core/build/reports/tests/test/index.html>
* Try:
Run with --stacktrace option to get the stack trace. Run with --info or --debug option to get more log output. Run with --scan to get full insights.
* Get more help at https://help.gradle.org
Deprecated Gradle features were used in this build, making it incompatible with Gradle 7.0.
Use '--warning-mode all' to show the individual deprecation warnings.
See https://docs.gradle.org/6.8/userguide/command_line_interface.html#sec:command_line_warnings
BUILD FAILED in 2h 41m 40s
250 actionable tasks: 214 executed, 36 up-to-date
Build step 'Execute shell' marked build as failure
Recording test results
Not sending mail to unregistered user github@hugo-hirsch.de
Build failed in Jenkins: Kafka » kafka-trunk-jdk15 #427
Posted by Apache Jenkins Server <je...@builds.apache.org>.
See <https://ci-builds.apache.org/job/Kafka/job/kafka-trunk-jdk15/427/display/redirect?page=changes>
Changes:
[github] MINOR: Ensure compile and runtime classpaths have consistent versions (#9921)
[github] MINOR: Exclude junit 3 transitive dependency from jfreechart (#9928)
[github] MINOR: Replace ApiVersion by auto-generated protocol (#9746)
------------------------------------------
[...truncated 3.59 MB...]
TestTopicsTest > shouldNotAllowToCreateWithNullDriver() PASSED
TestTopicsTest > testDuration() STARTED
TestTopicsTest > testDuration() PASSED
TestTopicsTest > testOutputToString() STARTED
TestTopicsTest > testOutputToString() PASSED
TestTopicsTest > testValue() STARTED
TestTopicsTest > testValue() PASSED
TestTopicsTest > testTimestampAutoAdvance() STARTED
TestTopicsTest > testTimestampAutoAdvance() PASSED
TestTopicsTest > testOutputWrongSerde() STARTED
TestTopicsTest > testOutputWrongSerde() PASSED
TestTopicsTest > shouldNotAllowToCreateOutputTopicWithNullTopicName() STARTED
TestTopicsTest > shouldNotAllowToCreateOutputTopicWithNullTopicName() PASSED
TestTopicsTest > testWrongSerde() STARTED
TestTopicsTest > testWrongSerde() PASSED
TestTopicsTest > testKeyValuesToMapWithNull() STARTED
TestTopicsTest > testKeyValuesToMapWithNull() PASSED
TestTopicsTest > testNonExistingOutputTopic() STARTED
TestTopicsTest > testNonExistingOutputTopic() PASSED
TestTopicsTest > testMultipleTopics() STARTED
TestTopicsTest > testMultipleTopics() PASSED
TestTopicsTest > testKeyValueList() STARTED
TestTopicsTest > testKeyValueList() PASSED
TestTopicsTest > shouldNotAllowToCreateOutputWithNullDriver() STARTED
TestTopicsTest > shouldNotAllowToCreateOutputWithNullDriver() PASSED
TestTopicsTest > testValueList() STARTED
TestTopicsTest > testValueList() PASSED
TestTopicsTest > testRecordList() STARTED
TestTopicsTest > testRecordList() PASSED
TestTopicsTest > testNonExistingInputTopic() STARTED
TestTopicsTest > testNonExistingInputTopic() PASSED
TestTopicsTest > testKeyValuesToMap() STARTED
TestTopicsTest > testKeyValuesToMap() PASSED
TestTopicsTest > testRecordsToList() STARTED
TestTopicsTest > testRecordsToList() PASSED
TestTopicsTest > testKeyValueListDuration() STARTED
TestTopicsTest > testKeyValueListDuration() PASSED
TestTopicsTest > testInputToString() STARTED
TestTopicsTest > testInputToString() PASSED
TestTopicsTest > testTimestamp() STARTED
TestTopicsTest > testTimestamp() PASSED
TestTopicsTest > testWithHeaders() STARTED
TestTopicsTest > testWithHeaders() PASSED
TestTopicsTest > testKeyValue() STARTED
TestTopicsTest > testKeyValue() PASSED
TestTopicsTest > shouldNotAllowToCreateTopicWithNullTopicName() STARTED
TestTopicsTest > shouldNotAllowToCreateTopicWithNullTopicName() PASSED
> Task :streams:upgrade-system-tests-0102:compileJava NO-SOURCE
> Task :streams:upgrade-system-tests-0102:processResources NO-SOURCE
> Task :streams:upgrade-system-tests-0102:classes UP-TO-DATE
> Task :streams:upgrade-system-tests-0102:checkstyleMain NO-SOURCE
> Task :streams:upgrade-system-tests-0102:compileTestJava
> Task :streams:upgrade-system-tests-0102:processTestResources NO-SOURCE
> Task :streams:upgrade-system-tests-0102:testClasses
> Task :streams:upgrade-system-tests-0102:checkstyleTest
> Task :streams:upgrade-system-tests-0102:spotbugsMain NO-SOURCE
> Task :streams:upgrade-system-tests-0102:test
> Task :streams:upgrade-system-tests-0110:compileJava NO-SOURCE
> Task :streams:upgrade-system-tests-0110:processResources NO-SOURCE
> Task :streams:upgrade-system-tests-0110:classes UP-TO-DATE
> Task :streams:upgrade-system-tests-0110:checkstyleMain NO-SOURCE
> Task :streams:upgrade-system-tests-0110:compileTestJava
> Task :streams:upgrade-system-tests-0110:processTestResources NO-SOURCE
> Task :streams:upgrade-system-tests-0110:testClasses
> Task :streams:upgrade-system-tests-0110:checkstyleTest
> Task :streams:upgrade-system-tests-0110:spotbugsMain NO-SOURCE
> Task :streams:upgrade-system-tests-0110:test
> Task :streams:upgrade-system-tests-10:compileJava NO-SOURCE
> Task :streams:upgrade-system-tests-10:processResources NO-SOURCE
> Task :streams:upgrade-system-tests-10:classes UP-TO-DATE
> Task :streams:upgrade-system-tests-10:checkstyleMain NO-SOURCE
> Task :streams:upgrade-system-tests-10:compileTestJava
> Task :streams:upgrade-system-tests-10:processTestResources NO-SOURCE
> Task :streams:upgrade-system-tests-10:testClasses
> Task :streams:upgrade-system-tests-10:checkstyleTest
> Task :streams:upgrade-system-tests-10:spotbugsMain NO-SOURCE
> Task :streams:upgrade-system-tests-10:test
> Task :streams:upgrade-system-tests-11:compileJava NO-SOURCE
> Task :streams:upgrade-system-tests-11:processResources NO-SOURCE
> Task :streams:upgrade-system-tests-11:classes UP-TO-DATE
> Task :streams:upgrade-system-tests-11:checkstyleMain NO-SOURCE
> Task :streams:upgrade-system-tests-11:compileTestJava
> Task :streams:upgrade-system-tests-11:processTestResources NO-SOURCE
> Task :streams:upgrade-system-tests-11:testClasses
> Task :streams:upgrade-system-tests-11:checkstyleTest
> Task :streams:upgrade-system-tests-11:spotbugsMain NO-SOURCE
> Task :streams:upgrade-system-tests-11:test
> Task :streams:upgrade-system-tests-20:compileJava NO-SOURCE
> Task :streams:upgrade-system-tests-20:processResources NO-SOURCE
> Task :streams:upgrade-system-tests-20:classes UP-TO-DATE
> Task :streams:upgrade-system-tests-20:checkstyleMain NO-SOURCE
> Task :streams:upgrade-system-tests-20:compileTestJava
> Task :streams:upgrade-system-tests-20:processTestResources NO-SOURCE
> Task :streams:upgrade-system-tests-20:testClasses
> Task :streams:upgrade-system-tests-20:checkstyleTest
> Task :streams:upgrade-system-tests-20:spotbugsMain NO-SOURCE
> Task :streams:upgrade-system-tests-20:test
> Task :streams:upgrade-system-tests-21:compileJava NO-SOURCE
> Task :streams:upgrade-system-tests-21:processResources NO-SOURCE
> Task :streams:upgrade-system-tests-21:classes UP-TO-DATE
> Task :streams:upgrade-system-tests-21:checkstyleMain NO-SOURCE
> Task :streams:upgrade-system-tests-21:compileTestJava
> Task :streams:upgrade-system-tests-21:processTestResources NO-SOURCE
> Task :streams:upgrade-system-tests-21:testClasses
> Task :streams:upgrade-system-tests-21:checkstyleTest
> Task :streams:upgrade-system-tests-21:spotbugsMain NO-SOURCE
> Task :streams:upgrade-system-tests-21:test
> Task :streams:upgrade-system-tests-22:compileJava NO-SOURCE
> Task :streams:upgrade-system-tests-22:processResources NO-SOURCE
> Task :streams:upgrade-system-tests-22:classes UP-TO-DATE
> Task :streams:upgrade-system-tests-22:checkstyleMain NO-SOURCE
> Task :streams:upgrade-system-tests-22:compileTestJava
> Task :streams:upgrade-system-tests-22:processTestResources NO-SOURCE
> Task :streams:upgrade-system-tests-22:testClasses
> Task :streams:upgrade-system-tests-22:checkstyleTest
> Task :streams:upgrade-system-tests-22:spotbugsMain NO-SOURCE
> Task :streams:upgrade-system-tests-22:test
> Task :streams:upgrade-system-tests-23:compileJava NO-SOURCE
> Task :streams:upgrade-system-tests-23:processResources NO-SOURCE
> Task :streams:upgrade-system-tests-23:classes UP-TO-DATE
> Task :streams:upgrade-system-tests-23:checkstyleMain NO-SOURCE
> Task :streams:upgrade-system-tests-23:compileTestJava
> Task :streams:upgrade-system-tests-23:processTestResources NO-SOURCE
> Task :streams:upgrade-system-tests-23:testClasses
> Task :streams:upgrade-system-tests-23:checkstyleTest
> Task :streams:upgrade-system-tests-23:spotbugsMain NO-SOURCE
> Task :streams:upgrade-system-tests-23:test
> Task :streams:upgrade-system-tests-24:compileJava NO-SOURCE
> Task :streams:upgrade-system-tests-24:processResources NO-SOURCE
> Task :streams:upgrade-system-tests-24:classes UP-TO-DATE
> Task :streams:upgrade-system-tests-24:checkstyleMain NO-SOURCE
> Task :streams:upgrade-system-tests-24:compileTestJava
> Task :streams:upgrade-system-tests-24:processTestResources NO-SOURCE
> Task :streams:upgrade-system-tests-24:testClasses
> Task :streams:upgrade-system-tests-24:checkstyleTest
> Task :streams:upgrade-system-tests-24:spotbugsMain NO-SOURCE
> Task :streams:upgrade-system-tests-24:test
> Task :streams:upgrade-system-tests-25:compileJava NO-SOURCE
> Task :streams:upgrade-system-tests-25:processResources NO-SOURCE
> Task :streams:upgrade-system-tests-25:classes UP-TO-DATE
> Task :streams:upgrade-system-tests-25:checkstyleMain NO-SOURCE
> Task :streams:upgrade-system-tests-25:compileTestJava
> Task :streams:upgrade-system-tests-25:processTestResources NO-SOURCE
> Task :streams:upgrade-system-tests-25:testClasses
> Task :streams:upgrade-system-tests-25:checkstyleTest
> Task :streams:upgrade-system-tests-25:spotbugsMain NO-SOURCE
> Task :streams:upgrade-system-tests-25:test
> Task :streams:upgrade-system-tests-26:compileJava NO-SOURCE
> Task :streams:upgrade-system-tests-26:processResources NO-SOURCE
> Task :streams:upgrade-system-tests-26:classes UP-TO-DATE
> Task :streams:upgrade-system-tests-26:checkstyleMain NO-SOURCE
> Task :streams:upgrade-system-tests-26:compileTestJava
> Task :streams:upgrade-system-tests-26:processTestResources NO-SOURCE
> Task :streams:upgrade-system-tests-26:testClasses
> Task :streams:upgrade-system-tests-26:checkstyleTest
> Task :streams:upgrade-system-tests-26:spotbugsMain NO-SOURCE
> Task :streams:upgrade-system-tests-26:test
> Task :streams:upgrade-system-tests-27:compileJava NO-SOURCE
> Task :streams:upgrade-system-tests-27:processResources NO-SOURCE
> Task :streams:upgrade-system-tests-27:classes UP-TO-DATE
> Task :streams:upgrade-system-tests-27:checkstyleMain NO-SOURCE
> Task :streams:upgrade-system-tests-27:compileTestJava
> Task :streams:upgrade-system-tests-27:processTestResources NO-SOURCE
> Task :streams:upgrade-system-tests-27:testClasses
> Task :streams:upgrade-system-tests-27:checkstyleTest
> Task :streams:upgrade-system-tests-27:spotbugsMain NO-SOURCE
> Task :streams:upgrade-system-tests-27:test
FAILURE: Build completed with 2 failures.
1: Task failed with an exception.
-----------
* What went wrong:
Execution failed for task ':clients:test'.
> There were failing tests. See the report at: file://<https://ci-builds.apache.org/job/Kafka/job/kafka-trunk-jdk15/ws/clients/build/reports/tests/test/index.html>
* Try:
Run with --stacktrace option to get the stack trace. Run with --info or --debug option to get more log output. Run with --scan to get full insights.
==============================================================================
2: Task failed with an exception.
-----------
* What went wrong:
Execution failed for task ':connect:mirror:test'.
> There were failing tests. See the report at: file://<https://ci-builds.apache.org/job/Kafka/job/kafka-trunk-jdk15/ws/connect/mirror/build/reports/tests/test/index.html>
* Try:
Run with --stacktrace option to get the stack trace. Run with --info or --debug option to get more log output. Run with --scan to get full insights.
==============================================================================
* Get more help at https://help.gradle.org
Deprecated Gradle features were used in this build, making it incompatible with Gradle 7.0.
Use '--warning-mode all' to show the individual deprecation warnings.
See https://docs.gradle.org/6.8/userguide/command_line_interface.html#sec:command_line_warnings
BUILD FAILED in 2h 50m 45s
250 actionable tasks: 214 executed, 36 up-to-date
Build step 'Execute shell' marked build as failure
Recording test results
Not sending mail to unregistered user github@hugo-hirsch.de
Build failed in Jenkins: Kafka » kafka-trunk-jdk15 #426
Posted by Apache Jenkins Server <je...@builds.apache.org>.
See <https://ci-builds.apache.org/job/Kafka/job/kafka-trunk-jdk15/426/display/redirect?page=changes>
Changes:
[github] KAFKA-12195 Fix synchronization issue happening in KafkaStreams (#9887)
------------------------------------------
[...truncated 3.57 MB...]
MockProcessorContextStateStoreTest > builder = org.apache.kafka.streams.state.internals.WindowStoreBuilder@68495ccd, timestamped = false, caching = true, logging = false PASSED
MockProcessorContextStateStoreTest > builder = org.apache.kafka.streams.state.internals.WindowStoreBuilder@f7297e9, timestamped = false, caching = true, logging = false STARTED
MockProcessorContextStateStoreTest > builder = org.apache.kafka.streams.state.internals.WindowStoreBuilder@f7297e9, timestamped = false, caching = true, logging = false PASSED
MockProcessorContextStateStoreTest > builder = org.apache.kafka.streams.state.internals.WindowStoreBuilder@2b217d75, timestamped = false, caching = true, logging = false STARTED
MockProcessorContextStateStoreTest > builder = org.apache.kafka.streams.state.internals.WindowStoreBuilder@2b217d75, timestamped = false, caching = true, logging = false PASSED
MockProcessorContextStateStoreTest > builder = org.apache.kafka.streams.state.internals.WindowStoreBuilder@2121bcb3, timestamped = false, caching = false, logging = true STARTED
MockProcessorContextStateStoreTest > builder = org.apache.kafka.streams.state.internals.WindowStoreBuilder@2121bcb3, timestamped = false, caching = false, logging = true PASSED
MockProcessorContextStateStoreTest > builder = org.apache.kafka.streams.state.internals.WindowStoreBuilder@38629315, timestamped = false, caching = false, logging = true STARTED
MockProcessorContextStateStoreTest > builder = org.apache.kafka.streams.state.internals.WindowStoreBuilder@38629315, timestamped = false, caching = false, logging = true PASSED
MockProcessorContextStateStoreTest > builder = org.apache.kafka.streams.state.internals.WindowStoreBuilder@28c9998e, timestamped = false, caching = false, logging = true STARTED
MockProcessorContextStateStoreTest > builder = org.apache.kafka.streams.state.internals.WindowStoreBuilder@28c9998e, timestamped = false, caching = false, logging = true PASSED
MockProcessorContextStateStoreTest > builder = org.apache.kafka.streams.state.internals.WindowStoreBuilder@69dc4de6, timestamped = false, caching = false, logging = false STARTED
MockProcessorContextStateStoreTest > builder = org.apache.kafka.streams.state.internals.WindowStoreBuilder@69dc4de6, timestamped = false, caching = false, logging = false PASSED
MockProcessorContextStateStoreTest > builder = org.apache.kafka.streams.state.internals.WindowStoreBuilder@2e0132b1, timestamped = false, caching = false, logging = false STARTED
MockProcessorContextStateStoreTest > builder = org.apache.kafka.streams.state.internals.WindowStoreBuilder@2e0132b1, timestamped = false, caching = false, logging = false PASSED
MockProcessorContextStateStoreTest > builder = org.apache.kafka.streams.state.internals.WindowStoreBuilder@29917374, timestamped = false, caching = false, logging = false STARTED
MockProcessorContextStateStoreTest > builder = org.apache.kafka.streams.state.internals.WindowStoreBuilder@29917374, timestamped = false, caching = false, logging = false PASSED
MockProcessorContextStateStoreTest > builder = org.apache.kafka.streams.state.internals.SessionStoreBuilder@723869e1, timestamped = false, caching = true, logging = true STARTED
MockProcessorContextStateStoreTest > builder = org.apache.kafka.streams.state.internals.SessionStoreBuilder@723869e1, timestamped = false, caching = true, logging = true PASSED
MockProcessorContextStateStoreTest > builder = org.apache.kafka.streams.state.internals.SessionStoreBuilder@9e3b4ff, timestamped = false, caching = true, logging = true STARTED
MockProcessorContextStateStoreTest > builder = org.apache.kafka.streams.state.internals.SessionStoreBuilder@9e3b4ff, timestamped = false, caching = true, logging = true PASSED
MockProcessorContextStateStoreTest > builder = org.apache.kafka.streams.state.internals.SessionStoreBuilder@767c3146, timestamped = false, caching = true, logging = false STARTED
MockProcessorContextStateStoreTest > builder = org.apache.kafka.streams.state.internals.SessionStoreBuilder@767c3146, timestamped = false, caching = true, logging = false PASSED
MockProcessorContextStateStoreTest > builder = org.apache.kafka.streams.state.internals.SessionStoreBuilder@4845e2b3, timestamped = false, caching = true, logging = false STARTED
MockProcessorContextStateStoreTest > builder = org.apache.kafka.streams.state.internals.SessionStoreBuilder@4845e2b3, timestamped = false, caching = true, logging = false PASSED
MockProcessorContextStateStoreTest > builder = org.apache.kafka.streams.state.internals.SessionStoreBuilder@41fc355f, timestamped = false, caching = false, logging = true STARTED
MockProcessorContextStateStoreTest > builder = org.apache.kafka.streams.state.internals.SessionStoreBuilder@41fc355f, timestamped = false, caching = false, logging = true PASSED
MockProcessorContextStateStoreTest > builder = org.apache.kafka.streams.state.internals.SessionStoreBuilder@694c756d, timestamped = false, caching = false, logging = true STARTED
MockProcessorContextStateStoreTest > builder = org.apache.kafka.streams.state.internals.SessionStoreBuilder@694c756d, timestamped = false, caching = false, logging = true PASSED
MockProcessorContextStateStoreTest > builder = org.apache.kafka.streams.state.internals.SessionStoreBuilder@542b0bfd, timestamped = false, caching = false, logging = false STARTED
MockProcessorContextStateStoreTest > builder = org.apache.kafka.streams.state.internals.SessionStoreBuilder@542b0bfd, timestamped = false, caching = false, logging = false PASSED
MockProcessorContextStateStoreTest > builder = org.apache.kafka.streams.state.internals.SessionStoreBuilder@79eeb469, timestamped = false, caching = false, logging = false STARTED
MockProcessorContextStateStoreTest > builder = org.apache.kafka.streams.state.internals.SessionStoreBuilder@79eeb469, timestamped = false, caching = false, logging = false PASSED
TestRecordTest > testConsumerRecord() STARTED
TestRecordTest > testConsumerRecord() PASSED
TestRecordTest > testToString() STARTED
TestRecordTest > testToString() PASSED
TestRecordTest > testInvalidRecords() STARTED
TestRecordTest > testInvalidRecords() PASSED
TestRecordTest > testPartialConstructorEquals() STARTED
TestRecordTest > testPartialConstructorEquals() PASSED
TestRecordTest > testMultiFieldMatcher() STARTED
TestRecordTest > testMultiFieldMatcher() PASSED
TestRecordTest > testFields() STARTED
TestRecordTest > testFields() PASSED
TestRecordTest > testProducerRecord() STARTED
TestRecordTest > testProducerRecord() PASSED
TestRecordTest > testEqualsAndHashCode() STARTED
TestRecordTest > testEqualsAndHashCode() PASSED
> Task :streams:upgrade-system-tests-0101:compileJava NO-SOURCE
> Task :streams:upgrade-system-tests-0101:processResources NO-SOURCE
> Task :streams:upgrade-system-tests-0101:classes UP-TO-DATE
> Task :streams:upgrade-system-tests-0101:checkstyleMain NO-SOURCE
> Task :streams:upgrade-system-tests-0101:compileTestJava
> Task :streams:upgrade-system-tests-0101:processTestResources NO-SOURCE
> Task :streams:upgrade-system-tests-0101:testClasses
> Task :streams:upgrade-system-tests-0101:checkstyleTest
> Task :streams:upgrade-system-tests-0101:spotbugsMain NO-SOURCE
> Task :streams:upgrade-system-tests-0101:test
> Task :streams:upgrade-system-tests-0102:compileJava NO-SOURCE
> Task :streams:upgrade-system-tests-0102:processResources NO-SOURCE
> Task :streams:upgrade-system-tests-0102:classes UP-TO-DATE
> Task :streams:upgrade-system-tests-0102:checkstyleMain NO-SOURCE
> Task :streams:upgrade-system-tests-0102:compileTestJava
> Task :streams:upgrade-system-tests-0102:processTestResources NO-SOURCE
> Task :streams:upgrade-system-tests-0102:testClasses
> Task :streams:upgrade-system-tests-0102:checkstyleTest
> Task :streams:upgrade-system-tests-0102:spotbugsMain NO-SOURCE
> Task :streams:upgrade-system-tests-0102:test
> Task :streams:upgrade-system-tests-0110:compileJava NO-SOURCE
> Task :streams:upgrade-system-tests-0110:processResources NO-SOURCE
> Task :streams:upgrade-system-tests-0110:classes UP-TO-DATE
> Task :streams:upgrade-system-tests-0110:checkstyleMain NO-SOURCE
> Task :streams:upgrade-system-tests-0110:compileTestJava
> Task :streams:upgrade-system-tests-0110:processTestResources NO-SOURCE
> Task :streams:upgrade-system-tests-0110:testClasses
> Task :streams:upgrade-system-tests-0110:checkstyleTest
> Task :streams:upgrade-system-tests-0110:spotbugsMain NO-SOURCE
> Task :streams:upgrade-system-tests-0110:test
> Task :streams:upgrade-system-tests-10:compileJava NO-SOURCE
> Task :streams:upgrade-system-tests-10:processResources NO-SOURCE
> Task :streams:upgrade-system-tests-10:classes UP-TO-DATE
> Task :streams:upgrade-system-tests-10:checkstyleMain NO-SOURCE
> Task :streams:upgrade-system-tests-10:compileTestJava
> Task :streams:upgrade-system-tests-10:processTestResources NO-SOURCE
> Task :streams:upgrade-system-tests-10:testClasses
> Task :streams:upgrade-system-tests-10:checkstyleTest
> Task :streams:upgrade-system-tests-10:spotbugsMain NO-SOURCE
> Task :streams:upgrade-system-tests-10:test
> Task :streams:upgrade-system-tests-11:compileJava NO-SOURCE
> Task :streams:upgrade-system-tests-11:processResources NO-SOURCE
> Task :streams:upgrade-system-tests-11:classes UP-TO-DATE
> Task :streams:upgrade-system-tests-11:checkstyleMain NO-SOURCE
> Task :streams:upgrade-system-tests-11:compileTestJava
> Task :streams:upgrade-system-tests-11:processTestResources NO-SOURCE
> Task :streams:upgrade-system-tests-11:testClasses
> Task :streams:upgrade-system-tests-11:checkstyleTest
> Task :streams:upgrade-system-tests-11:spotbugsMain NO-SOURCE
> Task :streams:upgrade-system-tests-11:test
> Task :streams:upgrade-system-tests-20:compileJava NO-SOURCE
> Task :streams:upgrade-system-tests-20:processResources NO-SOURCE
> Task :streams:upgrade-system-tests-20:classes UP-TO-DATE
> Task :streams:upgrade-system-tests-20:checkstyleMain NO-SOURCE
> Task :streams:upgrade-system-tests-20:compileTestJava
> Task :streams:upgrade-system-tests-20:processTestResources NO-SOURCE
> Task :streams:upgrade-system-tests-20:testClasses
> Task :streams:upgrade-system-tests-20:checkstyleTest
> Task :streams:upgrade-system-tests-20:spotbugsMain NO-SOURCE
> Task :streams:upgrade-system-tests-20:test
> Task :streams:upgrade-system-tests-21:compileJava NO-SOURCE
> Task :streams:upgrade-system-tests-21:processResources NO-SOURCE
> Task :streams:upgrade-system-tests-21:classes UP-TO-DATE
> Task :streams:upgrade-system-tests-21:checkstyleMain NO-SOURCE
> Task :streams:upgrade-system-tests-21:compileTestJava
> Task :streams:upgrade-system-tests-21:processTestResources NO-SOURCE
> Task :streams:upgrade-system-tests-21:testClasses
> Task :streams:upgrade-system-tests-21:checkstyleTest
> Task :streams:upgrade-system-tests-21:spotbugsMain NO-SOURCE
> Task :streams:upgrade-system-tests-21:test
> Task :streams:upgrade-system-tests-22:compileJava NO-SOURCE
> Task :streams:upgrade-system-tests-22:processResources NO-SOURCE
> Task :streams:upgrade-system-tests-22:classes UP-TO-DATE
> Task :streams:upgrade-system-tests-22:checkstyleMain NO-SOURCE
> Task :streams:upgrade-system-tests-22:compileTestJava
> Task :streams:upgrade-system-tests-22:processTestResources NO-SOURCE
> Task :streams:upgrade-system-tests-22:testClasses
> Task :streams:upgrade-system-tests-22:checkstyleTest
> Task :streams:upgrade-system-tests-22:spotbugsMain NO-SOURCE
> Task :streams:upgrade-system-tests-22:test
> Task :streams:upgrade-system-tests-23:compileJava NO-SOURCE
> Task :streams:upgrade-system-tests-23:processResources NO-SOURCE
> Task :streams:upgrade-system-tests-23:classes UP-TO-DATE
> Task :streams:upgrade-system-tests-23:checkstyleMain NO-SOURCE
> Task :streams:upgrade-system-tests-23:compileTestJava
> Task :streams:upgrade-system-tests-23:processTestResources NO-SOURCE
> Task :streams:upgrade-system-tests-23:testClasses
> Task :streams:upgrade-system-tests-23:checkstyleTest
> Task :streams:upgrade-system-tests-23:spotbugsMain NO-SOURCE
> Task :streams:upgrade-system-tests-23:test
> Task :streams:upgrade-system-tests-24:compileJava NO-SOURCE
> Task :streams:upgrade-system-tests-24:processResources NO-SOURCE
> Task :streams:upgrade-system-tests-24:classes UP-TO-DATE
> Task :streams:upgrade-system-tests-24:checkstyleMain NO-SOURCE
> Task :streams:upgrade-system-tests-24:compileTestJava
> Task :streams:upgrade-system-tests-24:processTestResources NO-SOURCE
> Task :streams:upgrade-system-tests-24:testClasses
> Task :streams:upgrade-system-tests-24:checkstyleTest
> Task :streams:upgrade-system-tests-24:spotbugsMain NO-SOURCE
> Task :streams:upgrade-system-tests-24:test
> Task :streams:upgrade-system-tests-25:compileJava NO-SOURCE
> Task :streams:upgrade-system-tests-25:processResources NO-SOURCE
> Task :streams:upgrade-system-tests-25:classes UP-TO-DATE
> Task :streams:upgrade-system-tests-25:checkstyleMain NO-SOURCE
> Task :streams:upgrade-system-tests-25:compileTestJava
> Task :streams:upgrade-system-tests-25:processTestResources NO-SOURCE
> Task :streams:upgrade-system-tests-25:testClasses
> Task :streams:upgrade-system-tests-25:checkstyleTest
> Task :streams:upgrade-system-tests-25:spotbugsMain NO-SOURCE
> Task :streams:upgrade-system-tests-25:test
> Task :streams:upgrade-system-tests-26:compileJava NO-SOURCE
> Task :streams:upgrade-system-tests-26:processResources NO-SOURCE
> Task :streams:upgrade-system-tests-26:classes UP-TO-DATE
> Task :streams:upgrade-system-tests-26:checkstyleMain NO-SOURCE
> Task :streams:upgrade-system-tests-26:compileTestJava
> Task :streams:upgrade-system-tests-26:processTestResources NO-SOURCE
> Task :streams:upgrade-system-tests-26:testClasses
> Task :streams:upgrade-system-tests-26:checkstyleTest
> Task :streams:upgrade-system-tests-26:spotbugsMain NO-SOURCE
> Task :streams:upgrade-system-tests-26:test
> Task :streams:upgrade-system-tests-27:compileJava NO-SOURCE
> Task :streams:upgrade-system-tests-27:processResources NO-SOURCE
> Task :streams:upgrade-system-tests-27:classes UP-TO-DATE
> Task :streams:upgrade-system-tests-27:checkstyleMain NO-SOURCE
> Task :streams:upgrade-system-tests-27:compileTestJava
> Task :streams:upgrade-system-tests-27:processTestResources NO-SOURCE
> Task :streams:upgrade-system-tests-27:testClasses
> Task :streams:upgrade-system-tests-27:checkstyleTest
> Task :streams:upgrade-system-tests-27:spotbugsMain NO-SOURCE
> Task :streams:upgrade-system-tests-27:test
FAILURE: Build failed with an exception.
* What went wrong:
Execution failed for task ':core:test'.
> There were failing tests. See the report at: file://<https://ci-builds.apache.org/job/Kafka/job/kafka-trunk-jdk15/ws/core/build/reports/tests/test/index.html>
* Try:
Run with --stacktrace option to get the stack trace. Run with --info or --debug option to get more log output. Run with --scan to get full insights.
* Get more help at https://help.gradle.org
Deprecated Gradle features were used in this build, making it incompatible with Gradle 7.0.
Use '--warning-mode all' to show the individual deprecation warnings.
See https://docs.gradle.org/6.8/userguide/command_line_interface.html#sec:command_line_warnings
BUILD FAILED in 2h 33m 46s
250 actionable tasks: 214 executed, 36 up-to-date
Build step 'Execute shell' marked build as failure
Recording test results
Not sending mail to unregistered user github@hugo-hirsch.de
Build failed in Jenkins: Kafka » kafka-trunk-jdk15 #425
Posted by Apache Jenkins Server <je...@builds.apache.org>.
See <https://ci-builds.apache.org/job/Kafka/job/kafka-trunk-jdk15/425/display/redirect?page=changes>
Changes:
[github] KAFKA-12194: use stateListener to catch each state change (#9888)
------------------------------------------
[...truncated 3.57 MB...]
TopologyTestDriverEosTest > shouldPassRecordHeadersIntoSerializersAndDeserializers() STARTED
TopologyTestDriverEosTest > shouldPassRecordHeadersIntoSerializersAndDeserializers() PASSED
TopologyTestDriverEosTest > shouldProcessConsumerRecordList() STARTED
TopologyTestDriverEosTest > shouldProcessConsumerRecordList() PASSED
TopologyTestDriverEosTest > shouldUseSinkSpecificSerializers() STARTED
TopologyTestDriverEosTest > shouldUseSinkSpecificSerializers() PASSED
TopologyTestDriverEosTest > shouldFlushStoreForFirstInput() STARTED
TopologyTestDriverEosTest > shouldFlushStoreForFirstInput() PASSED
TopologyTestDriverEosTest > shouldProcessFromSourceThatMatchPattern() STARTED
TopologyTestDriverEosTest > shouldProcessFromSourceThatMatchPattern() PASSED
TopologyTestDriverEosTest > shouldCaptureSinkTopicNamesIfWrittenInto() STARTED
TopologyTestDriverEosTest > shouldCaptureSinkTopicNamesIfWrittenInto() PASSED
TopologyTestDriverEosTest > shouldUpdateStoreForNewKey() STARTED
TopologyTestDriverEosTest > shouldUpdateStoreForNewKey() PASSED
TopologyTestDriverEosTest > shouldSendRecordViaCorrectSourceTopicDeprecated() STARTED
TopologyTestDriverEosTest > shouldSendRecordViaCorrectSourceTopicDeprecated() PASSED
TopologyTestDriverEosTest > shouldPunctuateOnWallClockTime() STARTED
TopologyTestDriverEosTest > shouldPunctuateOnWallClockTime() PASSED
TopologyTestDriverEosTest > shouldSetRecordMetadata() STARTED
TopologyTestDriverEosTest > shouldSetRecordMetadata() PASSED
TopologyTestDriverEosTest > shouldNotUpdateStoreForLargerValue() STARTED
TopologyTestDriverEosTest > shouldNotUpdateStoreForLargerValue() PASSED
TopologyTestDriverEosTest > shouldReturnCorrectInMemoryStoreTypeOnly() STARTED
TopologyTestDriverEosTest > shouldReturnCorrectInMemoryStoreTypeOnly() PASSED
TopologyTestDriverEosTest > shouldThrowForMissingTime() STARTED
TopologyTestDriverEosTest > shouldThrowForMissingTime() PASSED
TopologyTestDriverEosTest > shouldCaptureInternalTopicNamesIfWrittenInto() STARTED
TopologyTestDriverEosTest > shouldCaptureInternalTopicNamesIfWrittenInto() PASSED
TopologyTestDriverEosTest > shouldPunctuateOnWallClockTimeDeprecated() STARTED
TopologyTestDriverEosTest > shouldPunctuateOnWallClockTimeDeprecated() PASSED
TopologyTestDriverEosTest > shouldProcessRecordForTopic() STARTED
TopologyTestDriverEosTest > shouldProcessRecordForTopic() PASSED
TopologyTestDriverEosTest > shouldForwardRecordsFromSubtopologyToSubtopology() STARTED
TopologyTestDriverEosTest > shouldForwardRecordsFromSubtopologyToSubtopology() PASSED
TopologyTestDriverEosTest > shouldNotUpdateStoreForSmallerValue() STARTED
TopologyTestDriverEosTest > shouldNotUpdateStoreForSmallerValue() PASSED
TopologyTestDriverEosTest > shouldCreateStateDirectoryForStatefulTopology() STARTED
TopologyTestDriverEosTest > shouldCreateStateDirectoryForStatefulTopology() PASSED
TopologyTestDriverEosTest > shouldNotRequireParameters() STARTED
TopologyTestDriverEosTest > shouldNotRequireParameters() PASSED
TopologyTestDriverEosTest > shouldPunctuateIfWallClockTimeAdvances() STARTED
TopologyTestDriverEosTest > shouldPunctuateIfWallClockTimeAdvances() PASSED
> Task :streams:upgrade-system-tests-0101:compileJava NO-SOURCE
> Task :streams:upgrade-system-tests-0101:processResources NO-SOURCE
> Task :streams:upgrade-system-tests-0101:classes UP-TO-DATE
> Task :streams:upgrade-system-tests-0101:checkstyleMain NO-SOURCE
> Task :streams:upgrade-system-tests-0101:compileTestJava
> Task :streams:upgrade-system-tests-0101:processTestResources NO-SOURCE
> Task :streams:upgrade-system-tests-0101:testClasses
> Task :streams:upgrade-system-tests-0101:checkstyleTest
> Task :streams:upgrade-system-tests-0101:spotbugsMain NO-SOURCE
> Task :streams:upgrade-system-tests-0101:test
> Task :streams:upgrade-system-tests-0102:compileJava NO-SOURCE
> Task :streams:upgrade-system-tests-0102:processResources NO-SOURCE
> Task :streams:upgrade-system-tests-0102:classes UP-TO-DATE
> Task :streams:upgrade-system-tests-0102:checkstyleMain NO-SOURCE
> Task :streams:upgrade-system-tests-0102:compileTestJava
> Task :streams:upgrade-system-tests-0102:processTestResources NO-SOURCE
> Task :streams:upgrade-system-tests-0102:testClasses
> Task :streams:upgrade-system-tests-0102:checkstyleTest
> Task :streams:upgrade-system-tests-0102:spotbugsMain NO-SOURCE
> Task :streams:upgrade-system-tests-0102:test
> Task :streams:upgrade-system-tests-0110:compileJava NO-SOURCE
> Task :streams:upgrade-system-tests-0110:processResources NO-SOURCE
> Task :streams:upgrade-system-tests-0110:classes UP-TO-DATE
> Task :streams:upgrade-system-tests-0110:checkstyleMain NO-SOURCE
> Task :streams:upgrade-system-tests-0110:compileTestJava
> Task :streams:upgrade-system-tests-0110:processTestResources NO-SOURCE
> Task :streams:upgrade-system-tests-0110:testClasses
> Task :streams:upgrade-system-tests-0110:checkstyleTest
> Task :streams:upgrade-system-tests-0110:spotbugsMain NO-SOURCE
> Task :streams:upgrade-system-tests-0110:test
> Task :streams:upgrade-system-tests-10:compileJava NO-SOURCE
> Task :streams:upgrade-system-tests-10:processResources NO-SOURCE
> Task :streams:upgrade-system-tests-10:classes UP-TO-DATE
> Task :streams:upgrade-system-tests-10:checkstyleMain NO-SOURCE
> Task :streams:upgrade-system-tests-10:compileTestJava
> Task :streams:upgrade-system-tests-10:processTestResources NO-SOURCE
> Task :streams:upgrade-system-tests-10:testClasses
> Task :streams:upgrade-system-tests-10:checkstyleTest
> Task :streams:upgrade-system-tests-10:spotbugsMain NO-SOURCE
> Task :streams:upgrade-system-tests-10:test
> Task :streams:upgrade-system-tests-11:compileJava NO-SOURCE
> Task :streams:upgrade-system-tests-11:processResources NO-SOURCE
> Task :streams:upgrade-system-tests-11:classes UP-TO-DATE
> Task :streams:upgrade-system-tests-11:checkstyleMain NO-SOURCE
> Task :streams:upgrade-system-tests-11:compileTestJava
> Task :streams:upgrade-system-tests-11:processTestResources NO-SOURCE
> Task :streams:upgrade-system-tests-11:testClasses
> Task :streams:upgrade-system-tests-11:checkstyleTest
> Task :streams:upgrade-system-tests-11:spotbugsMain NO-SOURCE
> Task :streams:upgrade-system-tests-11:test
> Task :streams:upgrade-system-tests-20:compileJava NO-SOURCE
> Task :streams:upgrade-system-tests-20:processResources NO-SOURCE
> Task :streams:upgrade-system-tests-20:classes UP-TO-DATE
> Task :streams:upgrade-system-tests-20:checkstyleMain NO-SOURCE
> Task :streams:upgrade-system-tests-20:compileTestJava
> Task :streams:upgrade-system-tests-20:processTestResources NO-SOURCE
> Task :streams:upgrade-system-tests-20:testClasses
> Task :streams:upgrade-system-tests-20:checkstyleTest
> Task :streams:upgrade-system-tests-20:spotbugsMain NO-SOURCE
> Task :streams:upgrade-system-tests-20:test
> Task :streams:upgrade-system-tests-21:compileJava NO-SOURCE
> Task :streams:upgrade-system-tests-21:processResources NO-SOURCE
> Task :streams:upgrade-system-tests-21:classes UP-TO-DATE
> Task :streams:upgrade-system-tests-21:checkstyleMain NO-SOURCE
> Task :streams:upgrade-system-tests-21:compileTestJava
> Task :streams:upgrade-system-tests-21:processTestResources NO-SOURCE
> Task :streams:upgrade-system-tests-21:testClasses
> Task :streams:upgrade-system-tests-21:checkstyleTest
> Task :streams:upgrade-system-tests-21:spotbugsMain NO-SOURCE
> Task :streams:upgrade-system-tests-21:test
> Task :streams:upgrade-system-tests-22:compileJava NO-SOURCE
> Task :streams:upgrade-system-tests-22:processResources NO-SOURCE
> Task :streams:upgrade-system-tests-22:classes UP-TO-DATE
> Task :streams:upgrade-system-tests-22:checkstyleMain NO-SOURCE
> Task :streams:upgrade-system-tests-22:compileTestJava
> Task :streams:upgrade-system-tests-22:processTestResources NO-SOURCE
> Task :streams:upgrade-system-tests-22:testClasses
> Task :streams:upgrade-system-tests-22:checkstyleTest
> Task :streams:upgrade-system-tests-22:spotbugsMain NO-SOURCE
> Task :streams:upgrade-system-tests-22:test
> Task :streams:upgrade-system-tests-23:compileJava NO-SOURCE
> Task :streams:upgrade-system-tests-23:processResources NO-SOURCE
> Task :streams:upgrade-system-tests-23:classes UP-TO-DATE
> Task :streams:upgrade-system-tests-23:checkstyleMain NO-SOURCE
> Task :streams:upgrade-system-tests-23:compileTestJava
> Task :streams:upgrade-system-tests-23:processTestResources NO-SOURCE
> Task :streams:upgrade-system-tests-23:testClasses
> Task :streams:upgrade-system-tests-23:checkstyleTest
> Task :streams:upgrade-system-tests-23:spotbugsMain NO-SOURCE
> Task :streams:upgrade-system-tests-23:test
> Task :streams:upgrade-system-tests-24:compileJava NO-SOURCE
> Task :streams:upgrade-system-tests-24:processResources NO-SOURCE
> Task :streams:upgrade-system-tests-24:classes UP-TO-DATE
> Task :streams:upgrade-system-tests-24:checkstyleMain NO-SOURCE
> Task :streams:upgrade-system-tests-24:compileTestJava
> Task :streams:upgrade-system-tests-24:processTestResources NO-SOURCE
> Task :streams:upgrade-system-tests-24:testClasses
> Task :streams:upgrade-system-tests-24:checkstyleTest
> Task :streams:upgrade-system-tests-24:spotbugsMain NO-SOURCE
> Task :streams:upgrade-system-tests-24:test
> Task :streams:upgrade-system-tests-25:compileJava NO-SOURCE
> Task :streams:upgrade-system-tests-25:processResources NO-SOURCE
> Task :streams:upgrade-system-tests-25:classes UP-TO-DATE
> Task :streams:upgrade-system-tests-25:checkstyleMain NO-SOURCE
> Task :streams:upgrade-system-tests-25:compileTestJava
> Task :streams:upgrade-system-tests-25:processTestResources NO-SOURCE
> Task :streams:upgrade-system-tests-25:testClasses
> Task :streams:upgrade-system-tests-25:checkstyleTest
> Task :streams:upgrade-system-tests-25:spotbugsMain NO-SOURCE
> Task :streams:upgrade-system-tests-25:test
> Task :streams:upgrade-system-tests-26:compileJava NO-SOURCE
> Task :streams:upgrade-system-tests-26:processResources NO-SOURCE
> Task :streams:upgrade-system-tests-26:classes UP-TO-DATE
> Task :streams:upgrade-system-tests-26:checkstyleMain NO-SOURCE
> Task :streams:upgrade-system-tests-26:compileTestJava
> Task :streams:upgrade-system-tests-26:processTestResources NO-SOURCE
> Task :streams:upgrade-system-tests-26:testClasses
> Task :streams:upgrade-system-tests-26:checkstyleTest
> Task :streams:upgrade-system-tests-26:spotbugsMain NO-SOURCE
> Task :streams:upgrade-system-tests-26:test
> Task :streams:upgrade-system-tests-27:compileJava NO-SOURCE
> Task :streams:upgrade-system-tests-27:processResources NO-SOURCE
> Task :streams:upgrade-system-tests-27:classes UP-TO-DATE
> Task :streams:upgrade-system-tests-27:checkstyleMain NO-SOURCE
> Task :streams:upgrade-system-tests-27:compileTestJava
> Task :streams:upgrade-system-tests-27:processTestResources NO-SOURCE
> Task :streams:upgrade-system-tests-27:testClasses
> Task :streams:upgrade-system-tests-27:checkstyleTest
> Task :streams:upgrade-system-tests-27:spotbugsMain NO-SOURCE
> Task :streams:upgrade-system-tests-27:test
FAILURE: Build completed with 2 failures.
1: Task failed with an exception.
-----------
* What went wrong:
Execution failed for task ':core:test'.
> There were failing tests. See the report at: file://<https://ci-builds.apache.org/job/Kafka/job/kafka-trunk-jdk15/ws/core/build/reports/tests/test/index.html>
* Try:
Run with --stacktrace option to get the stack trace. Run with --info or --debug option to get more log output. Run with --scan to get full insights.
==============================================================================
2: Task failed with an exception.
-----------
* What went wrong:
Execution failed for task ':streams:test'.
> There were failing tests. See the report at: file://<https://ci-builds.apache.org/job/Kafka/job/kafka-trunk-jdk15/ws/streams/build/reports/tests/test/index.html>
* Try:
Run with --stacktrace option to get the stack trace. Run with --info or --debug option to get more log output. Run with --scan to get full insights.
==============================================================================
* Get more help at https://help.gradle.org
Deprecated Gradle features were used in this build, making it incompatible with Gradle 7.0.
Use '--warning-mode all' to show the individual deprecation warnings.
See https://docs.gradle.org/6.8/userguide/command_line_interface.html#sec:command_line_warnings
BUILD FAILED in 3h 11m 46s
250 actionable tasks: 214 executed, 36 up-to-date
Build step 'Execute shell' marked build as failure
Recording test results
Not sending mail to unregistered user github@hugo-hirsch.de
Build failed in Jenkins: Kafka » kafka-trunk-jdk15 #424
Posted by Apache Jenkins Server <je...@builds.apache.org>.
See <https://ci-builds.apache.org/job/Kafka/job/kafka-trunk-jdk15/424/display/redirect?page=changes>
Changes:
[github] KAFKA-10841: Extract conversion from LogReadResult to FetchPartitionData (#9743)
------------------------------------------
[...truncated 3.58 MB...]
ConsumerRecordFactoryTest > shouldNotAllowToCreateTopicWithNullHeaders() PASSED
ConsumerRecordFactoryTest > shouldNotAllowToCreateTopicWithNullTopicNameWithDefaultTimestamp() STARTED
ConsumerRecordFactoryTest > shouldNotAllowToCreateTopicWithNullTopicNameWithDefaultTimestamp() PASSED
ConsumerRecordFactoryTest > shouldRequireCustomTopicNameIfNotDefaultFactoryTopicName() STARTED
ConsumerRecordFactoryTest > shouldRequireCustomTopicNameIfNotDefaultFactoryTopicName() PASSED
ConsumerRecordFactoryTest > shouldRequireCustomTopicNameIfNotDefaultFactoryTopicNameWithNullKey() STARTED
ConsumerRecordFactoryTest > shouldRequireCustomTopicNameIfNotDefaultFactoryTopicNameWithNullKey() PASSED
ConsumerRecordFactoryTest > shouldCreateConsumerRecord() STARTED
ConsumerRecordFactoryTest > shouldCreateConsumerRecord() PASSED
ConsumerRecordFactoryTest > shouldCreateNullKeyConsumerRecord() STARTED
ConsumerRecordFactoryTest > shouldCreateNullKeyConsumerRecord() PASSED
ConsumerRecordFactoryTest > shouldCreateConsumerRecordWithOtherTopicName() STARTED
ConsumerRecordFactoryTest > shouldCreateConsumerRecordWithOtherTopicName() PASSED
ConsumerRecordFactoryTest > shouldAdvanceTime() STARTED
ConsumerRecordFactoryTest > shouldAdvanceTime() PASSED
ConsumerRecordFactoryTest > shouldNotAllowToCreateTopicWithNullTopicNameWithKeyValuePairs() STARTED
ConsumerRecordFactoryTest > shouldNotAllowToCreateTopicWithNullTopicNameWithKeyValuePairs() PASSED
ConsumerRecordFactoryTest > shouldRequireCustomTopicNameIfNotDefaultFactoryTopicNameWithKeyValuePairsAndCustomTimestamps() STARTED
ConsumerRecordFactoryTest > shouldRequireCustomTopicNameIfNotDefaultFactoryTopicNameWithKeyValuePairsAndCustomTimestamps() PASSED
ConsumerRecordFactoryTest > shouldRequireCustomTopicNameIfNotDefaultFactoryTopicNameWithKeyValuePairs() STARTED
ConsumerRecordFactoryTest > shouldRequireCustomTopicNameIfNotDefaultFactoryTopicNameWithKeyValuePairs() PASSED
ConsumerRecordFactoryTest > shouldCreateConsumerRecordWithOtherTopicNameAndTimestamp() STARTED
ConsumerRecordFactoryTest > shouldCreateConsumerRecordWithOtherTopicNameAndTimestamp() PASSED
ConsumerRecordFactoryTest > shouldNotAllowToCreateTopicWithNullTopicNameWithKeyValuePairsAndCustomTimestamps() STARTED
ConsumerRecordFactoryTest > shouldNotAllowToCreateTopicWithNullTopicNameWithKeyValuePairsAndCustomTimestamps() PASSED
ConsumerRecordFactoryTest > shouldNotAllowToCreateTopicWithNullTopicName() STARTED
ConsumerRecordFactoryTest > shouldNotAllowToCreateTopicWithNullTopicName() PASSED
ConsumerRecordFactoryTest > shouldCreateConsumerRecordsFromKeyValuePairsWithCustomTimestampAndIncrementsAndNotAdvanceTime() STARTED
ConsumerRecordFactoryTest > shouldCreateConsumerRecordsFromKeyValuePairsWithCustomTimestampAndIncrementsAndNotAdvanceTime() PASSED
ConsumerRecordFactoryTest > shouldCreateNullKeyConsumerRecordWithTimestampWithTimestamp() STARTED
ConsumerRecordFactoryTest > shouldCreateNullKeyConsumerRecordWithTimestampWithTimestamp() PASSED
ConsumerRecordFactoryTest > shouldRequireCustomTopicNameIfNotDefaultFactoryTopicNameWithNullKeyAndDefaultTimestamp() STARTED
ConsumerRecordFactoryTest > shouldRequireCustomTopicNameIfNotDefaultFactoryTopicNameWithNullKeyAndDefaultTimestamp() PASSED
ConsumerRecordFactoryTest > shouldCreateConsumerRecordsFromKeyValuePairsWithTimestampAndIncrements() STARTED
ConsumerRecordFactoryTest > shouldCreateConsumerRecordsFromKeyValuePairsWithTimestampAndIncrements() PASSED
> Task :streams:upgrade-system-tests-0100:processTestResources NO-SOURCE
> Task :streams:upgrade-system-tests-0100:testClasses
> Task :streams:upgrade-system-tests-0100:checkstyleTest
> Task :streams:upgrade-system-tests-0100:spotbugsMain NO-SOURCE
> Task :streams:upgrade-system-tests-0100:test
> Task :streams:upgrade-system-tests-0101:compileJava NO-SOURCE
> Task :streams:upgrade-system-tests-0101:processResources NO-SOURCE
> Task :streams:upgrade-system-tests-0101:classes UP-TO-DATE
> Task :streams:upgrade-system-tests-0101:checkstyleMain NO-SOURCE
> Task :streams:upgrade-system-tests-0101:compileTestJava
> Task :streams:upgrade-system-tests-0101:processTestResources NO-SOURCE
> Task :streams:upgrade-system-tests-0101:testClasses
> Task :streams:upgrade-system-tests-0101:checkstyleTest
> Task :streams:upgrade-system-tests-0101:spotbugsMain NO-SOURCE
> Task :streams:upgrade-system-tests-0101:test
> Task :streams:upgrade-system-tests-0102:compileJava NO-SOURCE
> Task :streams:upgrade-system-tests-0102:processResources NO-SOURCE
> Task :streams:upgrade-system-tests-0102:classes UP-TO-DATE
> Task :streams:upgrade-system-tests-0102:checkstyleMain NO-SOURCE
> Task :streams:upgrade-system-tests-0102:compileTestJava
> Task :streams:upgrade-system-tests-0102:processTestResources NO-SOURCE
> Task :streams:upgrade-system-tests-0102:testClasses
> Task :streams:upgrade-system-tests-0102:checkstyleTest
> Task :streams:upgrade-system-tests-0102:spotbugsMain NO-SOURCE
> Task :streams:upgrade-system-tests-0102:test
> Task :streams:upgrade-system-tests-0110:compileJava NO-SOURCE
> Task :streams:upgrade-system-tests-0110:processResources NO-SOURCE
> Task :streams:upgrade-system-tests-0110:classes UP-TO-DATE
> Task :streams:upgrade-system-tests-0110:checkstyleMain NO-SOURCE
> Task :streams:upgrade-system-tests-0110:compileTestJava
> Task :streams:upgrade-system-tests-0110:processTestResources NO-SOURCE
> Task :streams:upgrade-system-tests-0110:testClasses
> Task :streams:upgrade-system-tests-0110:checkstyleTest
> Task :streams:upgrade-system-tests-0110:spotbugsMain NO-SOURCE
> Task :streams:upgrade-system-tests-0110:test
> Task :streams:upgrade-system-tests-10:compileJava NO-SOURCE
> Task :streams:upgrade-system-tests-10:processResources NO-SOURCE
> Task :streams:upgrade-system-tests-10:classes UP-TO-DATE
> Task :streams:upgrade-system-tests-10:checkstyleMain NO-SOURCE
> Task :streams:upgrade-system-tests-10:compileTestJava
> Task :streams:upgrade-system-tests-10:processTestResources NO-SOURCE
> Task :streams:upgrade-system-tests-10:testClasses
> Task :streams:upgrade-system-tests-10:checkstyleTest
> Task :streams:upgrade-system-tests-10:spotbugsMain NO-SOURCE
> Task :streams:upgrade-system-tests-10:test
> Task :streams:upgrade-system-tests-11:compileJava NO-SOURCE
> Task :streams:upgrade-system-tests-11:processResources NO-SOURCE
> Task :streams:upgrade-system-tests-11:classes UP-TO-DATE
> Task :streams:upgrade-system-tests-11:checkstyleMain NO-SOURCE
> Task :streams:upgrade-system-tests-11:compileTestJava
> Task :streams:upgrade-system-tests-11:processTestResources NO-SOURCE
> Task :streams:upgrade-system-tests-11:testClasses
> Task :streams:upgrade-system-tests-11:checkstyleTest
> Task :streams:upgrade-system-tests-11:spotbugsMain NO-SOURCE
> Task :streams:upgrade-system-tests-11:test
> Task :streams:upgrade-system-tests-20:compileJava NO-SOURCE
> Task :streams:upgrade-system-tests-20:processResources NO-SOURCE
> Task :streams:upgrade-system-tests-20:classes UP-TO-DATE
> Task :streams:upgrade-system-tests-20:checkstyleMain NO-SOURCE
> Task :streams:upgrade-system-tests-20:compileTestJava
> Task :streams:upgrade-system-tests-20:processTestResources NO-SOURCE
> Task :streams:upgrade-system-tests-20:testClasses
> Task :streams:upgrade-system-tests-20:checkstyleTest
> Task :streams:upgrade-system-tests-20:spotbugsMain NO-SOURCE
> Task :streams:upgrade-system-tests-20:test
> Task :streams:upgrade-system-tests-21:compileJava NO-SOURCE
> Task :streams:upgrade-system-tests-21:processResources NO-SOURCE
> Task :streams:upgrade-system-tests-21:classes UP-TO-DATE
> Task :streams:upgrade-system-tests-21:checkstyleMain NO-SOURCE
> Task :streams:upgrade-system-tests-21:compileTestJava
> Task :streams:upgrade-system-tests-21:processTestResources NO-SOURCE
> Task :streams:upgrade-system-tests-21:testClasses
> Task :streams:upgrade-system-tests-21:checkstyleTest
> Task :streams:upgrade-system-tests-21:spotbugsMain NO-SOURCE
> Task :streams:upgrade-system-tests-21:test
> Task :streams:upgrade-system-tests-22:compileJava NO-SOURCE
> Task :streams:upgrade-system-tests-22:processResources NO-SOURCE
> Task :streams:upgrade-system-tests-22:classes UP-TO-DATE
> Task :streams:upgrade-system-tests-22:checkstyleMain NO-SOURCE
> Task :streams:upgrade-system-tests-22:compileTestJava
> Task :streams:upgrade-system-tests-22:processTestResources NO-SOURCE
> Task :streams:upgrade-system-tests-22:testClasses
> Task :streams:upgrade-system-tests-22:checkstyleTest
> Task :streams:upgrade-system-tests-22:spotbugsMain NO-SOURCE
> Task :streams:upgrade-system-tests-22:test
> Task :streams:upgrade-system-tests-23:compileJava NO-SOURCE
> Task :streams:upgrade-system-tests-23:processResources NO-SOURCE
> Task :streams:upgrade-system-tests-23:classes UP-TO-DATE
> Task :streams:upgrade-system-tests-23:checkstyleMain NO-SOURCE
> Task :streams:upgrade-system-tests-23:compileTestJava
> Task :streams:upgrade-system-tests-23:processTestResources NO-SOURCE
> Task :streams:upgrade-system-tests-23:testClasses
> Task :streams:upgrade-system-tests-23:checkstyleTest
> Task :streams:upgrade-system-tests-23:spotbugsMain NO-SOURCE
> Task :streams:upgrade-system-tests-23:test
> Task :streams:upgrade-system-tests-24:compileJava NO-SOURCE
> Task :streams:upgrade-system-tests-24:processResources NO-SOURCE
> Task :streams:upgrade-system-tests-24:classes UP-TO-DATE
> Task :streams:upgrade-system-tests-24:checkstyleMain NO-SOURCE
> Task :streams:upgrade-system-tests-24:compileTestJava
> Task :streams:upgrade-system-tests-24:processTestResources NO-SOURCE
> Task :streams:upgrade-system-tests-24:testClasses
> Task :streams:upgrade-system-tests-24:checkstyleTest
> Task :streams:upgrade-system-tests-24:spotbugsMain NO-SOURCE
> Task :streams:upgrade-system-tests-24:test
> Task :streams:upgrade-system-tests-25:compileJava NO-SOURCE
> Task :streams:upgrade-system-tests-25:processResources NO-SOURCE
> Task :streams:upgrade-system-tests-25:classes UP-TO-DATE
> Task :streams:upgrade-system-tests-25:checkstyleMain NO-SOURCE
> Task :streams:upgrade-system-tests-25:compileTestJava
> Task :streams:upgrade-system-tests-25:processTestResources NO-SOURCE
> Task :streams:upgrade-system-tests-25:testClasses
> Task :streams:upgrade-system-tests-25:checkstyleTest
> Task :streams:upgrade-system-tests-25:spotbugsMain NO-SOURCE
> Task :streams:upgrade-system-tests-25:test
> Task :streams:upgrade-system-tests-26:compileJava NO-SOURCE
> Task :streams:upgrade-system-tests-26:processResources NO-SOURCE
> Task :streams:upgrade-system-tests-26:classes UP-TO-DATE
> Task :streams:upgrade-system-tests-26:checkstyleMain NO-SOURCE
> Task :streams:upgrade-system-tests-26:compileTestJava
> Task :streams:upgrade-system-tests-26:processTestResources NO-SOURCE
> Task :streams:upgrade-system-tests-26:testClasses
> Task :streams:upgrade-system-tests-26:checkstyleTest
> Task :streams:upgrade-system-tests-26:spotbugsMain NO-SOURCE
> Task :streams:upgrade-system-tests-26:test
> Task :streams:upgrade-system-tests-27:compileJava NO-SOURCE
> Task :streams:upgrade-system-tests-27:processResources NO-SOURCE
> Task :streams:upgrade-system-tests-27:classes UP-TO-DATE
> Task :streams:upgrade-system-tests-27:checkstyleMain NO-SOURCE
> Task :streams:upgrade-system-tests-27:compileTestJava
> Task :streams:upgrade-system-tests-27:processTestResources NO-SOURCE
> Task :streams:upgrade-system-tests-27:testClasses
> Task :streams:upgrade-system-tests-27:checkstyleTest
> Task :streams:upgrade-system-tests-27:spotbugsMain NO-SOURCE
> Task :streams:upgrade-system-tests-27:test
FAILURE: Build completed with 3 failures.
1: Task failed with an exception.
-----------
* What went wrong:
Execution failed for task ':clients:test'.
> There were failing tests. See the report at: file://<https://ci-builds.apache.org/job/Kafka/job/kafka-trunk-jdk15/ws/clients/build/reports/tests/test/index.html>
* Try:
Run with --stacktrace option to get the stack trace. Run with --info or --debug option to get more log output. Run with --scan to get full insights.
==============================================================================
2: Task failed with an exception.
-----------
* What went wrong:
Execution failed for task ':streams:test'.
> There were failing tests. See the report at: file://<https://ci-builds.apache.org/job/Kafka/job/kafka-trunk-jdk15/ws/streams/build/reports/tests/test/index.html>
* Try:
Run with --stacktrace option to get the stack trace. Run with --info or --debug option to get more log output. Run with --scan to get full insights.
==============================================================================
3: Task failed with an exception.
-----------
* What went wrong:
Execution failed for task ':connect:mirror:test'.
> There were failing tests. See the report at: file://<https://ci-builds.apache.org/job/Kafka/job/kafka-trunk-jdk15/ws/connect/mirror/build/reports/tests/test/index.html>
* Try:
Run with --stacktrace option to get the stack trace. Run with --info or --debug option to get more log output. Run with --scan to get full insights.
==============================================================================
* Get more help at https://help.gradle.org
Deprecated Gradle features were used in this build, making it incompatible with Gradle 7.0.
Use '--warning-mode all' to show the individual deprecation warnings.
See https://docs.gradle.org/6.8/userguide/command_line_interface.html#sec:command_line_warnings
BUILD FAILED in 2h 21m 19s
250 actionable tasks: 214 executed, 36 up-to-date
Build step 'Execute shell' marked build as failure
Recording test results
Not sending mail to unregistered user github@hugo-hirsch.de
Build failed in Jenkins: Kafka » kafka-trunk-jdk15 #423
Posted by Apache Jenkins Server <je...@builds.apache.org>.
See <https://ci-builds.apache.org/job/Kafka/job/kafka-trunk-jdk15/423/display/redirect?page=changes>
Changes:
[github] MINOR: Use Gradle's JUnitPlatform for upgrade-system-tests modules (#9922)
[github] MINOR: Upgrade gradle to 6.8 and test retry plugin to 1.2.0 (#9849)
------------------------------------------
[...truncated 3.58 MB...]
TestTopicsTest > testValue() STARTED
TestTopicsTest > testValue() PASSED
TestTopicsTest > testTimestampAutoAdvance() STARTED
TestTopicsTest > testTimestampAutoAdvance() PASSED
TestTopicsTest > testOutputWrongSerde() STARTED
TestTopicsTest > testOutputWrongSerde() PASSED
TestTopicsTest > shouldNotAllowToCreateOutputTopicWithNullTopicName() STARTED
TestTopicsTest > shouldNotAllowToCreateOutputTopicWithNullTopicName() PASSED
TestTopicsTest > testWrongSerde() STARTED
TestTopicsTest > testWrongSerde() PASSED
TestTopicsTest > testKeyValuesToMapWithNull() STARTED
TestTopicsTest > testKeyValuesToMapWithNull() PASSED
TestTopicsTest > testNonExistingOutputTopic() STARTED
TestTopicsTest > testNonExistingOutputTopic() PASSED
TestTopicsTest > testMultipleTopics() STARTED
TestTopicsTest > testMultipleTopics() PASSED
TestTopicsTest > testKeyValueList() STARTED
TestTopicsTest > testKeyValueList() PASSED
TestTopicsTest > shouldNotAllowToCreateOutputWithNullDriver() STARTED
TestTopicsTest > shouldNotAllowToCreateOutputWithNullDriver() PASSED
TestTopicsTest > testValueList() STARTED
TestTopicsTest > testValueList() PASSED
TestTopicsTest > testRecordList() STARTED
TestTopicsTest > testRecordList() PASSED
TestTopicsTest > testNonExistingInputTopic() STARTED
TestTopicsTest > testNonExistingInputTopic() PASSED
TestTopicsTest > testKeyValuesToMap() STARTED
TestTopicsTest > testKeyValuesToMap() PASSED
TestTopicsTest > testRecordsToList() STARTED
TestTopicsTest > testRecordsToList() PASSED
TestTopicsTest > testKeyValueListDuration() STARTED
TestTopicsTest > testKeyValueListDuration() PASSED
TestTopicsTest > testInputToString() STARTED
TestTopicsTest > testInputToString() PASSED
TestTopicsTest > testTimestamp() STARTED
TestTopicsTest > testTimestamp() PASSED
TestTopicsTest > testWithHeaders() STARTED
TestTopicsTest > testWithHeaders() PASSED
TestTopicsTest > testKeyValue() STARTED
TestTopicsTest > testKeyValue() PASSED
TestTopicsTest > shouldNotAllowToCreateTopicWithNullTopicName() STARTED
TestTopicsTest > shouldNotAllowToCreateTopicWithNullTopicName() PASSED
> Task :streams:upgrade-system-tests-0102:compileJava NO-SOURCE
> Task :streams:upgrade-system-tests-0102:processResources NO-SOURCE
> Task :streams:upgrade-system-tests-0102:classes UP-TO-DATE
> Task :streams:upgrade-system-tests-0102:checkstyleMain NO-SOURCE
> Task :streams:upgrade-system-tests-0102:compileTestJava
> Task :streams:upgrade-system-tests-0102:processTestResources NO-SOURCE
> Task :streams:upgrade-system-tests-0102:testClasses
> Task :streams:upgrade-system-tests-0102:checkstyleTest
> Task :streams:upgrade-system-tests-0102:spotbugsMain NO-SOURCE
> Task :streams:upgrade-system-tests-0102:test
> Task :streams:upgrade-system-tests-0110:compileJava NO-SOURCE
> Task :streams:upgrade-system-tests-0110:processResources NO-SOURCE
> Task :streams:upgrade-system-tests-0110:classes UP-TO-DATE
> Task :streams:upgrade-system-tests-0110:checkstyleMain NO-SOURCE
> Task :streams:upgrade-system-tests-0110:compileTestJava
> Task :streams:upgrade-system-tests-0110:processTestResources NO-SOURCE
> Task :streams:upgrade-system-tests-0110:testClasses
> Task :streams:upgrade-system-tests-0110:checkstyleTest
> Task :streams:upgrade-system-tests-0110:spotbugsMain NO-SOURCE
> Task :streams:upgrade-system-tests-0110:test
> Task :streams:upgrade-system-tests-10:compileJava NO-SOURCE
> Task :streams:upgrade-system-tests-10:processResources NO-SOURCE
> Task :streams:upgrade-system-tests-10:classes UP-TO-DATE
> Task :streams:upgrade-system-tests-10:checkstyleMain NO-SOURCE
> Task :streams:upgrade-system-tests-10:compileTestJava
> Task :streams:upgrade-system-tests-10:processTestResources NO-SOURCE
> Task :streams:upgrade-system-tests-10:testClasses
> Task :streams:upgrade-system-tests-10:checkstyleTest
> Task :streams:upgrade-system-tests-10:spotbugsMain NO-SOURCE
> Task :streams:upgrade-system-tests-10:test
> Task :streams:upgrade-system-tests-11:compileJava NO-SOURCE
> Task :streams:upgrade-system-tests-11:processResources NO-SOURCE
> Task :streams:upgrade-system-tests-11:classes UP-TO-DATE
> Task :streams:upgrade-system-tests-11:checkstyleMain NO-SOURCE
> Task :streams:upgrade-system-tests-11:compileTestJava
> Task :streams:upgrade-system-tests-11:processTestResources NO-SOURCE
> Task :streams:upgrade-system-tests-11:testClasses
> Task :streams:upgrade-system-tests-11:checkstyleTest
> Task :streams:upgrade-system-tests-11:spotbugsMain NO-SOURCE
> Task :streams:upgrade-system-tests-11:test
> Task :streams:upgrade-system-tests-20:compileJava NO-SOURCE
> Task :streams:upgrade-system-tests-20:processResources NO-SOURCE
> Task :streams:upgrade-system-tests-20:classes UP-TO-DATE
> Task :streams:upgrade-system-tests-20:checkstyleMain NO-SOURCE
> Task :streams:upgrade-system-tests-20:compileTestJava
> Task :streams:upgrade-system-tests-20:processTestResources NO-SOURCE
> Task :streams:upgrade-system-tests-20:testClasses
> Task :streams:upgrade-system-tests-20:checkstyleTest
> Task :streams:upgrade-system-tests-20:spotbugsMain NO-SOURCE
> Task :streams:upgrade-system-tests-20:test
> Task :streams:upgrade-system-tests-21:compileJava NO-SOURCE
> Task :streams:upgrade-system-tests-21:processResources NO-SOURCE
> Task :streams:upgrade-system-tests-21:classes UP-TO-DATE
> Task :streams:upgrade-system-tests-21:checkstyleMain NO-SOURCE
> Task :streams:upgrade-system-tests-21:compileTestJava
> Task :streams:upgrade-system-tests-21:processTestResources NO-SOURCE
> Task :streams:upgrade-system-tests-21:testClasses
> Task :streams:upgrade-system-tests-21:checkstyleTest
> Task :streams:upgrade-system-tests-21:spotbugsMain NO-SOURCE
> Task :streams:upgrade-system-tests-21:test
> Task :streams:upgrade-system-tests-22:compileJava NO-SOURCE
> Task :streams:upgrade-system-tests-22:processResources NO-SOURCE
> Task :streams:upgrade-system-tests-22:classes UP-TO-DATE
> Task :streams:upgrade-system-tests-22:checkstyleMain NO-SOURCE
> Task :streams:upgrade-system-tests-22:compileTestJava
> Task :streams:upgrade-system-tests-22:processTestResources NO-SOURCE
> Task :streams:upgrade-system-tests-22:testClasses
> Task :streams:upgrade-system-tests-22:checkstyleTest
> Task :streams:upgrade-system-tests-22:spotbugsMain NO-SOURCE
> Task :streams:upgrade-system-tests-22:test
> Task :streams:upgrade-system-tests-23:compileJava NO-SOURCE
> Task :streams:upgrade-system-tests-23:processResources NO-SOURCE
> Task :streams:upgrade-system-tests-23:classes UP-TO-DATE
> Task :streams:upgrade-system-tests-23:checkstyleMain NO-SOURCE
> Task :streams:upgrade-system-tests-23:compileTestJava
> Task :streams:upgrade-system-tests-23:processTestResources NO-SOURCE
> Task :streams:upgrade-system-tests-23:testClasses
> Task :streams:upgrade-system-tests-23:checkstyleTest
> Task :streams:upgrade-system-tests-23:spotbugsMain NO-SOURCE
> Task :streams:upgrade-system-tests-23:test
> Task :streams:upgrade-system-tests-24:compileJava NO-SOURCE
> Task :streams:upgrade-system-tests-24:processResources NO-SOURCE
> Task :streams:upgrade-system-tests-24:classes UP-TO-DATE
> Task :streams:upgrade-system-tests-24:checkstyleMain NO-SOURCE
> Task :streams:upgrade-system-tests-24:compileTestJava
> Task :streams:upgrade-system-tests-24:processTestResources NO-SOURCE
> Task :streams:upgrade-system-tests-24:testClasses
> Task :streams:upgrade-system-tests-24:checkstyleTest
> Task :streams:upgrade-system-tests-24:spotbugsMain NO-SOURCE
> Task :streams:upgrade-system-tests-24:test
> Task :streams:upgrade-system-tests-25:compileJava NO-SOURCE
> Task :streams:upgrade-system-tests-25:processResources NO-SOURCE
> Task :streams:upgrade-system-tests-25:classes UP-TO-DATE
> Task :streams:upgrade-system-tests-25:checkstyleMain NO-SOURCE
> Task :streams:upgrade-system-tests-25:compileTestJava
> Task :streams:upgrade-system-tests-25:processTestResources NO-SOURCE
> Task :streams:upgrade-system-tests-25:testClasses
> Task :streams:upgrade-system-tests-25:checkstyleTest
> Task :streams:upgrade-system-tests-25:spotbugsMain NO-SOURCE
> Task :streams:upgrade-system-tests-25:test
> Task :streams:upgrade-system-tests-26:compileJava NO-SOURCE
> Task :streams:upgrade-system-tests-26:processResources NO-SOURCE
> Task :streams:upgrade-system-tests-26:classes UP-TO-DATE
> Task :streams:upgrade-system-tests-26:checkstyleMain NO-SOURCE
> Task :streams:upgrade-system-tests-26:compileTestJava
> Task :streams:upgrade-system-tests-26:processTestResources NO-SOURCE
> Task :streams:upgrade-system-tests-26:testClasses
> Task :streams:upgrade-system-tests-26:checkstyleTest
> Task :streams:upgrade-system-tests-26:spotbugsMain NO-SOURCE
> Task :streams:upgrade-system-tests-26:test
> Task :streams:upgrade-system-tests-27:compileJava NO-SOURCE
> Task :streams:upgrade-system-tests-27:processResources NO-SOURCE
> Task :streams:upgrade-system-tests-27:classes UP-TO-DATE
> Task :streams:upgrade-system-tests-27:checkstyleMain NO-SOURCE
> Task :streams:upgrade-system-tests-27:compileTestJava
> Task :streams:upgrade-system-tests-27:processTestResources NO-SOURCE
> Task :streams:upgrade-system-tests-27:testClasses
> Task :streams:upgrade-system-tests-27:checkstyleTest
> Task :streams:upgrade-system-tests-27:spotbugsMain NO-SOURCE
> Task :streams:upgrade-system-tests-27:test
FAILURE: Build completed with 3 failures.
1: Task failed with an exception.
-----------
* What went wrong:
Execution failed for task ':core:test'.
> There were failing tests. See the report at: file://<https://ci-builds.apache.org/job/Kafka/job/kafka-trunk-jdk15/ws/core/build/reports/tests/test/index.html>
* Try:
Run with --stacktrace option to get the stack trace. Run with --info or --debug option to get more log output. Run with --scan to get full insights.
==============================================================================
2: Task failed with an exception.
-----------
* What went wrong:
Execution failed for task ':streams:test'.
> There were failing tests. See the report at: file://<https://ci-builds.apache.org/job/Kafka/job/kafka-trunk-jdk15/ws/streams/build/reports/tests/test/index.html>
* Try:
Run with --stacktrace option to get the stack trace. Run with --info or --debug option to get more log output. Run with --scan to get full insights.
==============================================================================
3: Task failed with an exception.
-----------
* What went wrong:
Execution failed for task ':connect:mirror:test'.
> There were failing tests. See the report at: file://<https://ci-builds.apache.org/job/Kafka/job/kafka-trunk-jdk15/ws/connect/mirror/build/reports/tests/test/index.html>
* Try:
Run with --stacktrace option to get the stack trace. Run with --info or --debug option to get more log output. Run with --scan to get full insights.
==============================================================================
* Get more help at https://help.gradle.org
Deprecated Gradle features were used in this build, making it incompatible with Gradle 7.0.
Use '--warning-mode all' to show the individual deprecation warnings.
See https://docs.gradle.org/6.8/userguide/command_line_interface.html#sec:command_line_warnings
BUILD FAILED in 2h 18m 6s
250 actionable tasks: 214 executed, 36 up-to-date
Build step 'Execute shell' marked build as failure
Recording test results
Not sending mail to unregistered user github@hugo-hirsch.de
Build failed in Jenkins: Kafka » kafka-trunk-jdk15 #422
Posted by Apache Jenkins Server <je...@builds.apache.org>.
See <https://ci-builds.apache.org/job/Kafka/job/kafka-trunk-jdk15/422/display/redirect?page=changes>
Changes:
[github] KAFKA-7341 Migrate core module to JUnit 5 (#9855)
[github] KAFKA-12221 remove PowerMock from connect-json module and connect-transforms module (#9924)
------------------------------------------
[...truncated 3.58 MB...]
TopologyTestDriverAtLeastOnceTest > shouldPunctuateOnWallClockTimeDeprecated() STARTED
TopologyTestDriverAtLeastOnceTest > shouldPunctuateOnWallClockTimeDeprecated() PASSED
TopologyTestDriverAtLeastOnceTest > shouldProcessRecordForTopic() STARTED
TopologyTestDriverAtLeastOnceTest > shouldProcessRecordForTopic() PASSED
TopologyTestDriverAtLeastOnceTest > shouldForwardRecordsFromSubtopologyToSubtopology() STARTED
TopologyTestDriverAtLeastOnceTest > shouldForwardRecordsFromSubtopologyToSubtopology() PASSED
TopologyTestDriverAtLeastOnceTest > shouldNotUpdateStoreForSmallerValue() STARTED
TopologyTestDriverAtLeastOnceTest > shouldNotUpdateStoreForSmallerValue() PASSED
TopologyTestDriverAtLeastOnceTest > shouldCreateStateDirectoryForStatefulTopology() STARTED
TopologyTestDriverAtLeastOnceTest > shouldCreateStateDirectoryForStatefulTopology() PASSED
TopologyTestDriverAtLeastOnceTest > shouldNotRequireParameters() STARTED
TopologyTestDriverAtLeastOnceTest > shouldNotRequireParameters() PASSED
TopologyTestDriverAtLeastOnceTest > shouldPunctuateIfWallClockTimeAdvances() STARTED
TopologyTestDriverAtLeastOnceTest > shouldPunctuateIfWallClockTimeAdvances() PASSED
TestTopicsTest > testNonUsedOutputTopic() STARTED
TestTopicsTest > testNonUsedOutputTopic() PASSED
TestTopicsTest > testEmptyTopic() STARTED
TestTopicsTest > testEmptyTopic() PASSED
TestTopicsTest > testStartTimestamp() STARTED
TestTopicsTest > testStartTimestamp() PASSED
TestTopicsTest > testNegativeAdvance() STARTED
TestTopicsTest > testNegativeAdvance() PASSED
TestTopicsTest > shouldNotAllowToCreateWithNullDriver() STARTED
TestTopicsTest > shouldNotAllowToCreateWithNullDriver() PASSED
TestTopicsTest > testDuration() STARTED
TestTopicsTest > testDuration() PASSED
TestTopicsTest > testOutputToString() STARTED
TestTopicsTest > testOutputToString() PASSED
TestTopicsTest > testValue() STARTED
TestTopicsTest > testValue() PASSED
TestTopicsTest > testTimestampAutoAdvance() STARTED
TestTopicsTest > testTimestampAutoAdvance() PASSED
TestTopicsTest > testOutputWrongSerde() STARTED
TestTopicsTest > testOutputWrongSerde() PASSED
TestTopicsTest > shouldNotAllowToCreateOutputTopicWithNullTopicName() STARTED
TestTopicsTest > shouldNotAllowToCreateOutputTopicWithNullTopicName() PASSED
TestTopicsTest > testWrongSerde() STARTED
TestTopicsTest > testWrongSerde() PASSED
TestTopicsTest > testKeyValuesToMapWithNull() STARTED
TestTopicsTest > testKeyValuesToMapWithNull() PASSED
TestTopicsTest > testNonExistingOutputTopic() STARTED
TestTopicsTest > testNonExistingOutputTopic() PASSED
TestTopicsTest > testMultipleTopics() STARTED
TestTopicsTest > testMultipleTopics() PASSED
TestTopicsTest > testKeyValueList() STARTED
TestTopicsTest > testKeyValueList() PASSED
TestTopicsTest > shouldNotAllowToCreateOutputWithNullDriver() STARTED
TestTopicsTest > shouldNotAllowToCreateOutputWithNullDriver() PASSED
TestTopicsTest > testValueList() STARTED
TestTopicsTest > testValueList() PASSED
TestTopicsTest > testRecordList() STARTED
TestTopicsTest > testRecordList() PASSED
TestTopicsTest > testNonExistingInputTopic() STARTED
TestTopicsTest > testNonExistingInputTopic() PASSED
TestTopicsTest > testKeyValuesToMap() STARTED
TestTopicsTest > testKeyValuesToMap() PASSED
TestTopicsTest > testRecordsToList() STARTED
TestTopicsTest > testRecordsToList() PASSED
TestTopicsTest > testKeyValueListDuration() STARTED
TestTopicsTest > testKeyValueListDuration() PASSED
TestTopicsTest > testInputToString() STARTED
TestTopicsTest > testInputToString() PASSED
TestTopicsTest > testTimestamp() STARTED
TestTopicsTest > testTimestamp() PASSED
TestTopicsTest > testWithHeaders() STARTED
TestTopicsTest > testWithHeaders() PASSED
TestTopicsTest > testKeyValue() STARTED
TestTopicsTest > testKeyValue() PASSED
TestTopicsTest > shouldNotAllowToCreateTopicWithNullTopicName() STARTED
TestTopicsTest > shouldNotAllowToCreateTopicWithNullTopicName() PASSED
> Task :streams:upgrade-system-tests-21:processTestResources NO-SOURCE
> Task :streams:upgrade-system-tests-21:testClasses
> Task :streams:upgrade-system-tests-21:checkstyleTest
> Task :streams:upgrade-system-tests-21:spotbugsMain NO-SOURCE
> Task :streams:upgrade-system-tests-21:test
> Task :streams:upgrade-system-tests-22:compileJava NO-SOURCE
> Task :streams:upgrade-system-tests-22:processResources NO-SOURCE
> Task :streams:upgrade-system-tests-22:classes UP-TO-DATE
> Task :streams:upgrade-system-tests-22:checkstyleMain NO-SOURCE
> Task :streams:upgrade-system-tests-22:compileTestJava
> Task :streams:upgrade-system-tests-22:processTestResources NO-SOURCE
> Task :streams:upgrade-system-tests-22:testClasses
> Task :streams:upgrade-system-tests-22:checkstyleTest
> Task :streams:upgrade-system-tests-22:spotbugsMain NO-SOURCE
> Task :streams:upgrade-system-tests-22:test
> Task :streams:upgrade-system-tests-23:compileJava NO-SOURCE
> Task :streams:upgrade-system-tests-23:processResources NO-SOURCE
> Task :streams:upgrade-system-tests-23:classes UP-TO-DATE
> Task :streams:upgrade-system-tests-23:checkstyleMain NO-SOURCE
> Task :streams:upgrade-system-tests-23:compileTestJava
> Task :streams:upgrade-system-tests-23:processTestResources NO-SOURCE
> Task :streams:upgrade-system-tests-23:testClasses
> Task :streams:upgrade-system-tests-23:checkstyleTest
> Task :streams:upgrade-system-tests-23:spotbugsMain NO-SOURCE
> Task :streams:upgrade-system-tests-23:test
> Task :streams:upgrade-system-tests-24:compileJava NO-SOURCE
> Task :streams:upgrade-system-tests-24:processResources NO-SOURCE
> Task :streams:upgrade-system-tests-24:classes UP-TO-DATE
> Task :streams:upgrade-system-tests-24:checkstyleMain NO-SOURCE
> Task :streams:upgrade-system-tests-24:compileTestJava
> Task :streams:upgrade-system-tests-24:processTestResources NO-SOURCE
> Task :streams:upgrade-system-tests-24:testClasses
> Task :streams:upgrade-system-tests-24:checkstyleTest
> Task :streams:upgrade-system-tests-24:spotbugsMain NO-SOURCE
> Task :streams:upgrade-system-tests-24:test
> Task :streams:upgrade-system-tests-25:compileJava NO-SOURCE
> Task :streams:upgrade-system-tests-25:processResources NO-SOURCE
> Task :streams:upgrade-system-tests-25:classes UP-TO-DATE
> Task :streams:upgrade-system-tests-25:checkstyleMain NO-SOURCE
> Task :streams:upgrade-system-tests-25:compileTestJava
> Task :streams:upgrade-system-tests-25:processTestResources NO-SOURCE
> Task :streams:upgrade-system-tests-25:testClasses
> Task :streams:upgrade-system-tests-25:checkstyleTest
> Task :streams:upgrade-system-tests-25:spotbugsMain NO-SOURCE
> Task :streams:upgrade-system-tests-25:test
> Task :streams:upgrade-system-tests-26:compileJava NO-SOURCE
> Task :streams:upgrade-system-tests-26:processResources NO-SOURCE
> Task :streams:upgrade-system-tests-26:classes UP-TO-DATE
> Task :streams:upgrade-system-tests-26:checkstyleMain NO-SOURCE
> Task :streams:upgrade-system-tests-26:compileTestJava
> Task :streams:upgrade-system-tests-26:processTestResources NO-SOURCE
> Task :streams:upgrade-system-tests-26:testClasses
> Task :streams:upgrade-system-tests-26:checkstyleTest
> Task :streams:upgrade-system-tests-26:spotbugsMain NO-SOURCE
> Task :streams:upgrade-system-tests-26:test
> Task :streams:upgrade-system-tests-27:compileJava NO-SOURCE
> Task :streams:upgrade-system-tests-27:processResources NO-SOURCE
> Task :streams:upgrade-system-tests-27:classes UP-TO-DATE
> Task :streams:upgrade-system-tests-27:checkstyleMain NO-SOURCE
> Task :streams:upgrade-system-tests-27:compileTestJava
> Task :streams:upgrade-system-tests-27:processTestResources NO-SOURCE
> Task :streams:upgrade-system-tests-27:testClasses
> Task :streams:upgrade-system-tests-27:checkstyleTest
> Task :streams:upgrade-system-tests-27:spotbugsMain NO-SOURCE
> Task :streams:upgrade-system-tests-27:test
FAILURE: Build completed with 3 failures.
1: Task failed with an exception.
-----------
* What went wrong:
Execution failed for task ':clients:test'.
> There were failing tests. See the report at: file://<https://ci-builds.apache.org/job/Kafka/job/kafka-trunk-jdk15/ws/clients/build/reports/tests/test/index.html>
* Try:
Run with --stacktrace option to get the stack trace. Run with --info or --debug option to get more log output. Run with --scan to get full insights.
==============================================================================
2: Task failed with an exception.
-----------
* What went wrong:
Execution failed for task ':streams:test'.
> There were failing tests. See the report at: file://<https://ci-builds.apache.org/job/Kafka/job/kafka-trunk-jdk15/ws/streams/build/reports/tests/test/index.html>
* Try:
Run with --stacktrace option to get the stack trace. Run with --info or --debug option to get more log output. Run with --scan to get full insights.
==============================================================================
3: Task failed with an exception.
-----------
* What went wrong:
Execution failed for task ':connect:mirror:test'.
> There were failing tests. See the report at: file://<https://ci-builds.apache.org/job/Kafka/job/kafka-trunk-jdk15/ws/connect/mirror/build/reports/tests/test/index.html>
* Try:
Run with --stacktrace option to get the stack trace. Run with --info or --debug option to get more log output. Run with --scan to get full insights.
==============================================================================
* Get more help at https://help.gradle.org
Deprecated Gradle features were used in this build, making it incompatible with Gradle 7.0.
Use '--warning-mode all' to show the individual deprecation warnings.
See https://docs.gradle.org/6.7.1/userguide/command_line_interface.html#sec:command_line_warnings
BUILD FAILED in 2h 49m 37s
250 actionable tasks: 214 executed, 36 up-to-date
Build step 'Execute shell' marked build as failure
Recording test results
Not sending mail to unregistered user github@hugo-hirsch.de
Build failed in Jenkins: Kafka » kafka-trunk-jdk15 #421
Posted by Apache Jenkins Server <je...@builds.apache.org>.
See <https://ci-builds.apache.org/job/Kafka/job/kafka-trunk-jdk15/421/display/redirect?page=changes>
Changes:
[github] MINOR: Make data in FetchSnapshotRequest and FetchSnapshotRespponse private (#9820)
------------------------------------------
[...truncated 3.64 MB...]
MockProcessorContextStateStoreTest > builder = org.apache.kafka.streams.state.internals.WindowStoreBuilder@3c92629c, timestamped = false, caching = false, logging = true STARTED
MockProcessorContextStateStoreTest > builder = org.apache.kafka.streams.state.internals.WindowStoreBuilder@3c92629c, timestamped = false, caching = false, logging = true PASSED
MockProcessorContextStateStoreTest > builder = org.apache.kafka.streams.state.internals.WindowStoreBuilder@21fb80d8, timestamped = false, caching = false, logging = true STARTED
MockProcessorContextStateStoreTest > builder = org.apache.kafka.streams.state.internals.WindowStoreBuilder@21fb80d8, timestamped = false, caching = false, logging = true PASSED
MockProcessorContextStateStoreTest > builder = org.apache.kafka.streams.state.internals.WindowStoreBuilder@44682e2c, timestamped = false, caching = false, logging = true STARTED
MockProcessorContextStateStoreTest > builder = org.apache.kafka.streams.state.internals.WindowStoreBuilder@44682e2c, timestamped = false, caching = false, logging = true PASSED
MockProcessorContextStateStoreTest > builder = org.apache.kafka.streams.state.internals.WindowStoreBuilder@2da79b0e, timestamped = false, caching = false, logging = false STARTED
MockProcessorContextStateStoreTest > builder = org.apache.kafka.streams.state.internals.WindowStoreBuilder@2da79b0e, timestamped = false, caching = false, logging = false PASSED
MockProcessorContextStateStoreTest > builder = org.apache.kafka.streams.state.internals.WindowStoreBuilder@1d589526, timestamped = false, caching = false, logging = false STARTED
MockProcessorContextStateStoreTest > builder = org.apache.kafka.streams.state.internals.WindowStoreBuilder@1d589526, timestamped = false, caching = false, logging = false PASSED
MockProcessorContextStateStoreTest > builder = org.apache.kafka.streams.state.internals.WindowStoreBuilder@5e13ec8a, timestamped = false, caching = false, logging = false STARTED
MockProcessorContextStateStoreTest > builder = org.apache.kafka.streams.state.internals.WindowStoreBuilder@5e13ec8a, timestamped = false, caching = false, logging = false PASSED
MockProcessorContextStateStoreTest > builder = org.apache.kafka.streams.state.internals.SessionStoreBuilder@bd9b7db, timestamped = false, caching = true, logging = true STARTED
MockProcessorContextStateStoreTest > builder = org.apache.kafka.streams.state.internals.SessionStoreBuilder@bd9b7db, timestamped = false, caching = true, logging = true PASSED
MockProcessorContextStateStoreTest > builder = org.apache.kafka.streams.state.internals.SessionStoreBuilder@7d431e9c, timestamped = false, caching = true, logging = true STARTED
MockProcessorContextStateStoreTest > builder = org.apache.kafka.streams.state.internals.SessionStoreBuilder@7d431e9c, timestamped = false, caching = true, logging = true PASSED
MockProcessorContextStateStoreTest > builder = org.apache.kafka.streams.state.internals.SessionStoreBuilder@6180ad61, timestamped = false, caching = true, logging = false STARTED
MockProcessorContextStateStoreTest > builder = org.apache.kafka.streams.state.internals.SessionStoreBuilder@6180ad61, timestamped = false, caching = true, logging = false PASSED
MockProcessorContextStateStoreTest > builder = org.apache.kafka.streams.state.internals.SessionStoreBuilder@670bb84a, timestamped = false, caching = true, logging = false STARTED
MockProcessorContextStateStoreTest > builder = org.apache.kafka.streams.state.internals.SessionStoreBuilder@670bb84a, timestamped = false, caching = true, logging = false PASSED
MockProcessorContextStateStoreTest > builder = org.apache.kafka.streams.state.internals.SessionStoreBuilder@76728727, timestamped = false, caching = false, logging = true STARTED
MockProcessorContextStateStoreTest > builder = org.apache.kafka.streams.state.internals.SessionStoreBuilder@76728727, timestamped = false, caching = false, logging = true PASSED
MockProcessorContextStateStoreTest > builder = org.apache.kafka.streams.state.internals.SessionStoreBuilder@e520f0d, timestamped = false, caching = false, logging = true STARTED
MockProcessorContextStateStoreTest > builder = org.apache.kafka.streams.state.internals.SessionStoreBuilder@e520f0d, timestamped = false, caching = false, logging = true PASSED
MockProcessorContextStateStoreTest > builder = org.apache.kafka.streams.state.internals.SessionStoreBuilder@22127cf1, timestamped = false, caching = false, logging = false STARTED
MockProcessorContextStateStoreTest > builder = org.apache.kafka.streams.state.internals.SessionStoreBuilder@22127cf1, timestamped = false, caching = false, logging = false PASSED
MockProcessorContextStateStoreTest > builder = org.apache.kafka.streams.state.internals.SessionStoreBuilder@514da1ab, timestamped = false, caching = false, logging = false STARTED
MockProcessorContextStateStoreTest > builder = org.apache.kafka.streams.state.internals.SessionStoreBuilder@514da1ab, timestamped = false, caching = false, logging = false PASSED
WindowedWordCountProcessorTest > shouldWorkWithInMemoryStore() STARTED
WindowedWordCountProcessorTest > shouldWorkWithInMemoryStore() PASSED
WindowedWordCountProcessorTest > shouldWorkWithPersistentStore() STARTED
WindowedWordCountProcessorTest > shouldWorkWithPersistentStore() PASSED
ConsumerRecordFactoryTest > shouldCreateConsumerRecordsFromKeyValuePairs() STARTED
ConsumerRecordFactoryTest > shouldCreateConsumerRecordsFromKeyValuePairs() PASSED
ConsumerRecordFactoryTest > shouldNotAllowToCreateTopicWithNullTopicNameWithNullKeyAndDefaultTimestamp() STARTED
ConsumerRecordFactoryTest > shouldNotAllowToCreateTopicWithNullTopicNameWithNullKeyAndDefaultTimestamp() PASSED
ConsumerRecordFactoryTest > shouldRequireCustomTopicNameIfNotDefaultFactoryTopicNameWithDefaultTimestamp() STARTED
ConsumerRecordFactoryTest > shouldRequireCustomTopicNameIfNotDefaultFactoryTopicNameWithDefaultTimestamp() PASSED
ConsumerRecordFactoryTest > shouldNotAllowToCreateTopicWithNullTopicNameWithNullKey() STARTED
ConsumerRecordFactoryTest > shouldNotAllowToCreateTopicWithNullTopicNameWithNullKey() PASSED
ConsumerRecordFactoryTest > shouldCreateNullKeyConsumerRecordWithOtherTopicNameAndTimestampWithTimetamp() STARTED
ConsumerRecordFactoryTest > shouldCreateNullKeyConsumerRecordWithOtherTopicNameAndTimestampWithTimetamp() PASSED
ConsumerRecordFactoryTest > shouldCreateConsumerRecordWithTimestamp() STARTED
ConsumerRecordFactoryTest > shouldCreateConsumerRecordWithTimestamp() PASSED
ConsumerRecordFactoryTest > shouldNotAllowToCreateTopicWithNullHeaders() STARTED
ConsumerRecordFactoryTest > shouldNotAllowToCreateTopicWithNullHeaders() PASSED
ConsumerRecordFactoryTest > shouldNotAllowToCreateTopicWithNullTopicNameWithDefaultTimestamp() STARTED
ConsumerRecordFactoryTest > shouldNotAllowToCreateTopicWithNullTopicNameWithDefaultTimestamp() PASSED
ConsumerRecordFactoryTest > shouldRequireCustomTopicNameIfNotDefaultFactoryTopicName() STARTED
ConsumerRecordFactoryTest > shouldRequireCustomTopicNameIfNotDefaultFactoryTopicName() PASSED
ConsumerRecordFactoryTest > shouldRequireCustomTopicNameIfNotDefaultFactoryTopicNameWithNullKey() STARTED
ConsumerRecordFactoryTest > shouldRequireCustomTopicNameIfNotDefaultFactoryTopicNameWithNullKey() PASSED
ConsumerRecordFactoryTest > shouldCreateConsumerRecord() STARTED
ConsumerRecordFactoryTest > shouldCreateConsumerRecord() PASSED
ConsumerRecordFactoryTest > shouldCreateNullKeyConsumerRecord() STARTED
ConsumerRecordFactoryTest > shouldCreateNullKeyConsumerRecord() PASSED
ConsumerRecordFactoryTest > shouldCreateConsumerRecordWithOtherTopicName() STARTED
ConsumerRecordFactoryTest > shouldCreateConsumerRecordWithOtherTopicName() PASSED
ConsumerRecordFactoryTest > shouldAdvanceTime() STARTED
ConsumerRecordFactoryTest > shouldAdvanceTime() PASSED
ConsumerRecordFactoryTest > shouldNotAllowToCreateTopicWithNullTopicNameWithKeyValuePairs() STARTED
ConsumerRecordFactoryTest > shouldNotAllowToCreateTopicWithNullTopicNameWithKeyValuePairs() PASSED
ConsumerRecordFactoryTest > shouldRequireCustomTopicNameIfNotDefaultFactoryTopicNameWithKeyValuePairsAndCustomTimestamps() STARTED
ConsumerRecordFactoryTest > shouldRequireCustomTopicNameIfNotDefaultFactoryTopicNameWithKeyValuePairsAndCustomTimestamps() PASSED
ConsumerRecordFactoryTest > shouldRequireCustomTopicNameIfNotDefaultFactoryTopicNameWithKeyValuePairs() STARTED
ConsumerRecordFactoryTest > shouldRequireCustomTopicNameIfNotDefaultFactoryTopicNameWithKeyValuePairs() PASSED
ConsumerRecordFactoryTest > shouldCreateConsumerRecordWithOtherTopicNameAndTimestamp() STARTED
ConsumerRecordFactoryTest > shouldCreateConsumerRecordWithOtherTopicNameAndTimestamp() PASSED
ConsumerRecordFactoryTest > shouldNotAllowToCreateTopicWithNullTopicNameWithKeyValuePairsAndCustomTimestamps() STARTED
ConsumerRecordFactoryTest > shouldNotAllowToCreateTopicWithNullTopicNameWithKeyValuePairsAndCustomTimestamps() PASSED
ConsumerRecordFactoryTest > shouldNotAllowToCreateTopicWithNullTopicName() STARTED
ConsumerRecordFactoryTest > shouldNotAllowToCreateTopicWithNullTopicName() PASSED
ConsumerRecordFactoryTest > shouldCreateConsumerRecordsFromKeyValuePairsWithCustomTimestampAndIncrementsAndNotAdvanceTime() STARTED
ConsumerRecordFactoryTest > shouldCreateConsumerRecordsFromKeyValuePairsWithCustomTimestampAndIncrementsAndNotAdvanceTime() PASSED
ConsumerRecordFactoryTest > shouldCreateNullKeyConsumerRecordWithTimestampWithTimestamp() STARTED
ConsumerRecordFactoryTest > shouldCreateNullKeyConsumerRecordWithTimestampWithTimestamp() PASSED
ConsumerRecordFactoryTest > shouldRequireCustomTopicNameIfNotDefaultFactoryTopicNameWithNullKeyAndDefaultTimestamp() STARTED
ConsumerRecordFactoryTest > shouldRequireCustomTopicNameIfNotDefaultFactoryTopicNameWithNullKeyAndDefaultTimestamp() PASSED
ConsumerRecordFactoryTest > shouldCreateConsumerRecordsFromKeyValuePairsWithTimestampAndIncrements() STARTED
ConsumerRecordFactoryTest > shouldCreateConsumerRecordsFromKeyValuePairsWithTimestampAndIncrements() PASSED
> Task :streams:upgrade-system-tests-22:processTestResources NO-SOURCE
> Task :streams:upgrade-system-tests-22:testClasses
> Task :streams:upgrade-system-tests-22:checkstyleTest
> Task :streams:upgrade-system-tests-22:spotbugsMain NO-SOURCE
> Task :streams:upgrade-system-tests-22:test
> Task :streams:upgrade-system-tests-23:compileJava NO-SOURCE
> Task :streams:upgrade-system-tests-23:processResources NO-SOURCE
> Task :streams:upgrade-system-tests-23:classes UP-TO-DATE
> Task :streams:upgrade-system-tests-23:checkstyleMain NO-SOURCE
> Task :streams:upgrade-system-tests-23:compileTestJava
> Task :streams:upgrade-system-tests-23:processTestResources NO-SOURCE
> Task :streams:upgrade-system-tests-23:testClasses
> Task :streams:upgrade-system-tests-23:checkstyleTest
> Task :streams:upgrade-system-tests-23:spotbugsMain NO-SOURCE
> Task :streams:upgrade-system-tests-23:test
> Task :streams:upgrade-system-tests-24:compileJava NO-SOURCE
> Task :streams:upgrade-system-tests-24:processResources NO-SOURCE
> Task :streams:upgrade-system-tests-24:classes UP-TO-DATE
> Task :streams:upgrade-system-tests-24:checkstyleMain NO-SOURCE
> Task :streams:upgrade-system-tests-24:compileTestJava
> Task :streams:upgrade-system-tests-24:processTestResources NO-SOURCE
> Task :streams:upgrade-system-tests-24:testClasses
> Task :streams:upgrade-system-tests-24:checkstyleTest
> Task :streams:upgrade-system-tests-24:spotbugsMain NO-SOURCE
> Task :streams:upgrade-system-tests-24:test
> Task :streams:upgrade-system-tests-25:compileJava NO-SOURCE
> Task :streams:upgrade-system-tests-25:processResources NO-SOURCE
> Task :streams:upgrade-system-tests-25:classes UP-TO-DATE
> Task :streams:upgrade-system-tests-25:checkstyleMain NO-SOURCE
> Task :streams:upgrade-system-tests-25:compileTestJava
> Task :streams:upgrade-system-tests-25:processTestResources NO-SOURCE
> Task :streams:upgrade-system-tests-25:testClasses
> Task :streams:upgrade-system-tests-25:checkstyleTest
> Task :streams:upgrade-system-tests-25:spotbugsMain NO-SOURCE
> Task :streams:upgrade-system-tests-25:test
> Task :streams:upgrade-system-tests-26:compileJava NO-SOURCE
> Task :streams:upgrade-system-tests-26:processResources NO-SOURCE
> Task :streams:upgrade-system-tests-26:classes UP-TO-DATE
> Task :streams:upgrade-system-tests-26:checkstyleMain NO-SOURCE
> Task :streams:upgrade-system-tests-26:compileTestJava
> Task :streams:upgrade-system-tests-26:processTestResources NO-SOURCE
> Task :streams:upgrade-system-tests-26:testClasses
> Task :streams:upgrade-system-tests-26:checkstyleTest
> Task :streams:upgrade-system-tests-26:spotbugsMain NO-SOURCE
> Task :streams:upgrade-system-tests-26:test
> Task :streams:upgrade-system-tests-27:compileJava NO-SOURCE
> Task :streams:upgrade-system-tests-27:processResources NO-SOURCE
> Task :streams:upgrade-system-tests-27:classes UP-TO-DATE
> Task :streams:upgrade-system-tests-27:checkstyleMain NO-SOURCE
> Task :streams:upgrade-system-tests-27:compileTestJava
> Task :streams:upgrade-system-tests-27:processTestResources NO-SOURCE
> Task :streams:upgrade-system-tests-27:testClasses
> Task :streams:upgrade-system-tests-27:checkstyleTest
> Task :streams:upgrade-system-tests-27:spotbugsMain NO-SOURCE
> Task :streams:upgrade-system-tests-27:test
FAILURE: Build completed with 2 failures.
1: Task failed with an exception.
-----------
* What went wrong:
Execution failed for task ':clients:test'.
> There were failing tests. See the report at: file://<https://ci-builds.apache.org/job/Kafka/job/kafka-trunk-jdk15/ws/clients/build/reports/tests/test/index.html>
* Try:
Run with --stacktrace option to get the stack trace. Run with --info or --debug option to get more log output. Run with --scan to get full insights.
==============================================================================
2: Task failed with an exception.
-----------
* What went wrong:
Execution failed for task ':connect:mirror:test'.
> There were failing tests. See the report at: file://<https://ci-builds.apache.org/job/Kafka/job/kafka-trunk-jdk15/ws/connect/mirror/build/reports/tests/test/index.html>
* Try:
Run with --stacktrace option to get the stack trace. Run with --info or --debug option to get more log output. Run with --scan to get full insights.
==============================================================================
* Get more help at https://help.gradle.org
Deprecated Gradle features were used in this build, making it incompatible with Gradle 7.0.
Use '--warning-mode all' to show the individual deprecation warnings.
See https://docs.gradle.org/6.7.1/userguide/command_line_interface.html#sec:command_line_warnings
BUILD FAILED in 2h 16m 12s
250 actionable tasks: 214 executed, 36 up-to-date
Build step 'Execute shell' marked build as failure
Recording test results
Not sending mail to unregistered user github@hugo-hirsch.de
Build failed in Jenkins: Kafka » kafka-trunk-jdk15 #420
Posted by Apache Jenkins Server <je...@builds.apache.org>.
See <https://ci-builds.apache.org/job/Kafka/job/kafka-trunk-jdk15/420/display/redirect?page=changes>
Changes:
[github] KAFKA-12196: Migrate connect:api module to JUnit 5 (#9909)
------------------------------------------
[...truncated 3.62 MB...]
MockProcessorContextStateStoreTest > builder = org.apache.kafka.streams.state.internals.TimestampedWindowStoreBuilder@6436cd0d, timestamped = true, caching = true, logging = false PASSED
MockProcessorContextStateStoreTest > builder = org.apache.kafka.streams.state.internals.TimestampedWindowStoreBuilder@155f8278, timestamped = true, caching = true, logging = false STARTED
MockProcessorContextStateStoreTest > builder = org.apache.kafka.streams.state.internals.TimestampedWindowStoreBuilder@155f8278, timestamped = true, caching = true, logging = false PASSED
MockProcessorContextStateStoreTest > builder = org.apache.kafka.streams.state.internals.TimestampedWindowStoreBuilder@70782fde, timestamped = true, caching = true, logging = false STARTED
MockProcessorContextStateStoreTest > builder = org.apache.kafka.streams.state.internals.TimestampedWindowStoreBuilder@70782fde, timestamped = true, caching = true, logging = false PASSED
MockProcessorContextStateStoreTest > builder = org.apache.kafka.streams.state.internals.TimestampedWindowStoreBuilder@4a5e5dd, timestamped = true, caching = false, logging = true STARTED
MockProcessorContextStateStoreTest > builder = org.apache.kafka.streams.state.internals.TimestampedWindowStoreBuilder@4a5e5dd, timestamped = true, caching = false, logging = true PASSED
MockProcessorContextStateStoreTest > builder = org.apache.kafka.streams.state.internals.TimestampedWindowStoreBuilder@3673293b, timestamped = true, caching = false, logging = true STARTED
MockProcessorContextStateStoreTest > builder = org.apache.kafka.streams.state.internals.TimestampedWindowStoreBuilder@3673293b, timestamped = true, caching = false, logging = true PASSED
MockProcessorContextStateStoreTest > builder = org.apache.kafka.streams.state.internals.TimestampedWindowStoreBuilder@1d19cd64, timestamped = true, caching = false, logging = true STARTED
MockProcessorContextStateStoreTest > builder = org.apache.kafka.streams.state.internals.TimestampedWindowStoreBuilder@1d19cd64, timestamped = true, caching = false, logging = true PASSED
MockProcessorContextStateStoreTest > builder = org.apache.kafka.streams.state.internals.TimestampedWindowStoreBuilder@755f8ced, timestamped = true, caching = false, logging = false STARTED
MockProcessorContextStateStoreTest > builder = org.apache.kafka.streams.state.internals.TimestampedWindowStoreBuilder@755f8ced, timestamped = true, caching = false, logging = false PASSED
MockProcessorContextStateStoreTest > builder = org.apache.kafka.streams.state.internals.TimestampedWindowStoreBuilder@29ab64de, timestamped = true, caching = false, logging = false STARTED
MockProcessorContextStateStoreTest > builder = org.apache.kafka.streams.state.internals.TimestampedWindowStoreBuilder@29ab64de, timestamped = true, caching = false, logging = false PASSED
MockProcessorContextStateStoreTest > builder = org.apache.kafka.streams.state.internals.TimestampedWindowStoreBuilder@3dc3a570, timestamped = true, caching = false, logging = false STARTED
MockProcessorContextStateStoreTest > builder = org.apache.kafka.streams.state.internals.TimestampedWindowStoreBuilder@3dc3a570, timestamped = true, caching = false, logging = false PASSED
MockProcessorContextStateStoreTest > builder = org.apache.kafka.streams.state.internals.WindowStoreBuilder@2c482d4d, timestamped = false, caching = true, logging = true STARTED
MockProcessorContextStateStoreTest > builder = org.apache.kafka.streams.state.internals.WindowStoreBuilder@2c482d4d, timestamped = false, caching = true, logging = true PASSED
MockProcessorContextStateStoreTest > builder = org.apache.kafka.streams.state.internals.WindowStoreBuilder@26cb30e3, timestamped = false, caching = true, logging = true STARTED
MockProcessorContextStateStoreTest > builder = org.apache.kafka.streams.state.internals.WindowStoreBuilder@26cb30e3, timestamped = false, caching = true, logging = true PASSED
MockProcessorContextStateStoreTest > builder = org.apache.kafka.streams.state.internals.WindowStoreBuilder@4207e1c9, timestamped = false, caching = true, logging = true STARTED
MockProcessorContextStateStoreTest > builder = org.apache.kafka.streams.state.internals.WindowStoreBuilder@4207e1c9, timestamped = false, caching = true, logging = true PASSED
MockProcessorContextStateStoreTest > builder = org.apache.kafka.streams.state.internals.WindowStoreBuilder@2385583a, timestamped = false, caching = true, logging = false STARTED
MockProcessorContextStateStoreTest > builder = org.apache.kafka.streams.state.internals.WindowStoreBuilder@2385583a, timestamped = false, caching = true, logging = false PASSED
MockProcessorContextStateStoreTest > builder = org.apache.kafka.streams.state.internals.WindowStoreBuilder@4bdf61c9, timestamped = false, caching = true, logging = false STARTED
MockProcessorContextStateStoreTest > builder = org.apache.kafka.streams.state.internals.WindowStoreBuilder@4bdf61c9, timestamped = false, caching = true, logging = false PASSED
MockProcessorContextStateStoreTest > builder = org.apache.kafka.streams.state.internals.WindowStoreBuilder@3393e4a3, timestamped = false, caching = true, logging = false STARTED
MockProcessorContextStateStoreTest > builder = org.apache.kafka.streams.state.internals.WindowStoreBuilder@3393e4a3, timestamped = false, caching = true, logging = false PASSED
MockProcessorContextStateStoreTest > builder = org.apache.kafka.streams.state.internals.WindowStoreBuilder@6b52b06f, timestamped = false, caching = false, logging = true STARTED
MockProcessorContextStateStoreTest > builder = org.apache.kafka.streams.state.internals.WindowStoreBuilder@6b52b06f, timestamped = false, caching = false, logging = true PASSED
MockProcessorContextStateStoreTest > builder = org.apache.kafka.streams.state.internals.WindowStoreBuilder@23d05ff4, timestamped = false, caching = false, logging = true STARTED
MockProcessorContextStateStoreTest > builder = org.apache.kafka.streams.state.internals.WindowStoreBuilder@23d05ff4, timestamped = false, caching = false, logging = true PASSED
MockProcessorContextStateStoreTest > builder = org.apache.kafka.streams.state.internals.WindowStoreBuilder@4f48f2e5, timestamped = false, caching = false, logging = true STARTED
MockProcessorContextStateStoreTest > builder = org.apache.kafka.streams.state.internals.WindowStoreBuilder@4f48f2e5, timestamped = false, caching = false, logging = true PASSED
MockProcessorContextStateStoreTest > builder = org.apache.kafka.streams.state.internals.WindowStoreBuilder@6a2f400e, timestamped = false, caching = false, logging = false STARTED
MockProcessorContextStateStoreTest > builder = org.apache.kafka.streams.state.internals.WindowStoreBuilder@6a2f400e, timestamped = false, caching = false, logging = false PASSED
MockProcessorContextStateStoreTest > builder = org.apache.kafka.streams.state.internals.WindowStoreBuilder@74257e5d, timestamped = false, caching = false, logging = false STARTED
MockProcessorContextStateStoreTest > builder = org.apache.kafka.streams.state.internals.WindowStoreBuilder@74257e5d, timestamped = false, caching = false, logging = false PASSED
MockProcessorContextStateStoreTest > builder = org.apache.kafka.streams.state.internals.WindowStoreBuilder@154022ab, timestamped = false, caching = false, logging = false STARTED
MockProcessorContextStateStoreTest > builder = org.apache.kafka.streams.state.internals.WindowStoreBuilder@154022ab, timestamped = false, caching = false, logging = false PASSED
MockProcessorContextStateStoreTest > builder = org.apache.kafka.streams.state.internals.SessionStoreBuilder@37681333, timestamped = false, caching = true, logging = true STARTED
MockProcessorContextStateStoreTest > builder = org.apache.kafka.streams.state.internals.SessionStoreBuilder@37681333, timestamped = false, caching = true, logging = true PASSED
MockProcessorContextStateStoreTest > builder = org.apache.kafka.streams.state.internals.SessionStoreBuilder@6cc4063d, timestamped = false, caching = true, logging = true STARTED
MockProcessorContextStateStoreTest > builder = org.apache.kafka.streams.state.internals.SessionStoreBuilder@6cc4063d, timestamped = false, caching = true, logging = true PASSED
MockProcessorContextStateStoreTest > builder = org.apache.kafka.streams.state.internals.SessionStoreBuilder@7a4ca735, timestamped = false, caching = true, logging = false STARTED
MockProcessorContextStateStoreTest > builder = org.apache.kafka.streams.state.internals.SessionStoreBuilder@7a4ca735, timestamped = false, caching = true, logging = false PASSED
MockProcessorContextStateStoreTest > builder = org.apache.kafka.streams.state.internals.SessionStoreBuilder@70567e4b, timestamped = false, caching = true, logging = false STARTED
MockProcessorContextStateStoreTest > builder = org.apache.kafka.streams.state.internals.SessionStoreBuilder@70567e4b, timestamped = false, caching = true, logging = false PASSED
MockProcessorContextStateStoreTest > builder = org.apache.kafka.streams.state.internals.SessionStoreBuilder@1f742195, timestamped = false, caching = false, logging = true STARTED
MockProcessorContextStateStoreTest > builder = org.apache.kafka.streams.state.internals.SessionStoreBuilder@1f742195, timestamped = false, caching = false, logging = true PASSED
MockProcessorContextStateStoreTest > builder = org.apache.kafka.streams.state.internals.SessionStoreBuilder@22018cd3, timestamped = false, caching = false, logging = true STARTED
MockProcessorContextStateStoreTest > builder = org.apache.kafka.streams.state.internals.SessionStoreBuilder@22018cd3, timestamped = false, caching = false, logging = true PASSED
MockProcessorContextStateStoreTest > builder = org.apache.kafka.streams.state.internals.SessionStoreBuilder@5bc19e0c, timestamped = false, caching = false, logging = false STARTED
MockProcessorContextStateStoreTest > builder = org.apache.kafka.streams.state.internals.SessionStoreBuilder@5bc19e0c, timestamped = false, caching = false, logging = false PASSED
MockProcessorContextStateStoreTest > builder = org.apache.kafka.streams.state.internals.SessionStoreBuilder@130a63eb, timestamped = false, caching = false, logging = false STARTED
MockProcessorContextStateStoreTest > builder = org.apache.kafka.streams.state.internals.SessionStoreBuilder@130a63eb, timestamped = false, caching = false, logging = false PASSED
TestRecordTest > testConsumerRecord() STARTED
TestRecordTest > testConsumerRecord() PASSED
TestRecordTest > testToString() STARTED
TestRecordTest > testToString() PASSED
TestRecordTest > testInvalidRecords() STARTED
TestRecordTest > testInvalidRecords() PASSED
TestRecordTest > testPartialConstructorEquals() STARTED
TestRecordTest > testPartialConstructorEquals() PASSED
TestRecordTest > testMultiFieldMatcher() STARTED
TestRecordTest > testMultiFieldMatcher() PASSED
TestRecordTest > testFields() STARTED
TestRecordTest > testFields() PASSED
TestRecordTest > testProducerRecord() STARTED
TestRecordTest > testProducerRecord() PASSED
TestRecordTest > testEqualsAndHashCode() STARTED
TestRecordTest > testEqualsAndHashCode() PASSED
> Task :streams:upgrade-system-tests-11:test
> Task :streams:upgrade-system-tests-20:compileJava NO-SOURCE
> Task :streams:upgrade-system-tests-20:processResources NO-SOURCE
> Task :streams:upgrade-system-tests-20:classes UP-TO-DATE
> Task :streams:upgrade-system-tests-20:checkstyleMain NO-SOURCE
> Task :streams:upgrade-system-tests-20:compileTestJava
> Task :streams:upgrade-system-tests-20:processTestResources NO-SOURCE
> Task :streams:upgrade-system-tests-20:testClasses
> Task :streams:upgrade-system-tests-20:checkstyleTest
> Task :streams:upgrade-system-tests-20:spotbugsMain NO-SOURCE
> Task :streams:upgrade-system-tests-20:test
> Task :streams:upgrade-system-tests-21:compileJava NO-SOURCE
> Task :streams:upgrade-system-tests-21:processResources NO-SOURCE
> Task :streams:upgrade-system-tests-21:classes UP-TO-DATE
> Task :streams:upgrade-system-tests-21:checkstyleMain NO-SOURCE
> Task :streams:upgrade-system-tests-21:compileTestJava
> Task :streams:upgrade-system-tests-21:processTestResources NO-SOURCE
> Task :streams:upgrade-system-tests-21:testClasses
> Task :streams:upgrade-system-tests-21:checkstyleTest
> Task :streams:upgrade-system-tests-21:spotbugsMain NO-SOURCE
> Task :streams:upgrade-system-tests-21:test
> Task :streams:upgrade-system-tests-22:compileJava NO-SOURCE
> Task :streams:upgrade-system-tests-22:processResources NO-SOURCE
> Task :streams:upgrade-system-tests-22:classes UP-TO-DATE
> Task :streams:upgrade-system-tests-22:checkstyleMain NO-SOURCE
> Task :streams:upgrade-system-tests-22:compileTestJava
> Task :streams:upgrade-system-tests-22:processTestResources NO-SOURCE
> Task :streams:upgrade-system-tests-22:testClasses
> Task :streams:upgrade-system-tests-22:checkstyleTest
> Task :streams:upgrade-system-tests-22:spotbugsMain NO-SOURCE
> Task :streams:upgrade-system-tests-22:test
> Task :streams:upgrade-system-tests-23:compileJava NO-SOURCE
> Task :streams:upgrade-system-tests-23:processResources NO-SOURCE
> Task :streams:upgrade-system-tests-23:classes UP-TO-DATE
> Task :streams:upgrade-system-tests-23:checkstyleMain NO-SOURCE
> Task :streams:upgrade-system-tests-23:compileTestJava
> Task :streams:upgrade-system-tests-23:processTestResources NO-SOURCE
> Task :streams:upgrade-system-tests-23:testClasses
> Task :streams:upgrade-system-tests-23:checkstyleTest
> Task :streams:upgrade-system-tests-23:spotbugsMain NO-SOURCE
> Task :streams:upgrade-system-tests-23:test
> Task :streams:upgrade-system-tests-24:compileJava NO-SOURCE
> Task :streams:upgrade-system-tests-24:processResources NO-SOURCE
> Task :streams:upgrade-system-tests-24:classes UP-TO-DATE
> Task :streams:upgrade-system-tests-24:checkstyleMain NO-SOURCE
> Task :streams:upgrade-system-tests-24:compileTestJava
> Task :streams:upgrade-system-tests-24:processTestResources NO-SOURCE
> Task :streams:upgrade-system-tests-24:testClasses
> Task :streams:upgrade-system-tests-24:checkstyleTest
> Task :streams:upgrade-system-tests-24:spotbugsMain NO-SOURCE
> Task :streams:upgrade-system-tests-24:test
> Task :streams:upgrade-system-tests-25:compileJava NO-SOURCE
> Task :streams:upgrade-system-tests-25:processResources NO-SOURCE
> Task :streams:upgrade-system-tests-25:classes UP-TO-DATE
> Task :streams:upgrade-system-tests-25:checkstyleMain NO-SOURCE
> Task :streams:upgrade-system-tests-25:compileTestJava
> Task :streams:upgrade-system-tests-25:processTestResources NO-SOURCE
> Task :streams:upgrade-system-tests-25:testClasses
> Task :streams:upgrade-system-tests-25:checkstyleTest
> Task :streams:upgrade-system-tests-25:spotbugsMain NO-SOURCE
> Task :streams:upgrade-system-tests-25:test
> Task :streams:upgrade-system-tests-26:compileJava NO-SOURCE
> Task :streams:upgrade-system-tests-26:processResources NO-SOURCE
> Task :streams:upgrade-system-tests-26:classes UP-TO-DATE
> Task :streams:upgrade-system-tests-26:checkstyleMain NO-SOURCE
> Task :streams:upgrade-system-tests-26:compileTestJava
> Task :streams:upgrade-system-tests-26:processTestResources NO-SOURCE
> Task :streams:upgrade-system-tests-26:testClasses
> Task :streams:upgrade-system-tests-26:checkstyleTest
> Task :streams:upgrade-system-tests-26:spotbugsMain NO-SOURCE
> Task :streams:upgrade-system-tests-26:test
> Task :streams:upgrade-system-tests-27:compileJava NO-SOURCE
> Task :streams:upgrade-system-tests-27:processResources NO-SOURCE
> Task :streams:upgrade-system-tests-27:classes UP-TO-DATE
> Task :streams:upgrade-system-tests-27:checkstyleMain NO-SOURCE
> Task :streams:upgrade-system-tests-27:compileTestJava
> Task :streams:upgrade-system-tests-27:processTestResources NO-SOURCE
> Task :streams:upgrade-system-tests-27:testClasses
> Task :streams:upgrade-system-tests-27:checkstyleTest
> Task :streams:upgrade-system-tests-27:spotbugsMain NO-SOURCE
> Task :streams:upgrade-system-tests-27:test
FAILURE: Build failed with an exception.
* What went wrong:
Execution failed for task ':streams:test'.
> There were failing tests. See the report at: file://<https://ci-builds.apache.org/job/Kafka/job/kafka-trunk-jdk15/ws/streams/build/reports/tests/test/index.html>
* Try:
Run with --stacktrace option to get the stack trace. Run with --info or --debug option to get more log output. Run with --scan to get full insights.
* Get more help at https://help.gradle.org
Deprecated Gradle features were used in this build, making it incompatible with Gradle 7.0.
Use '--warning-mode all' to show the individual deprecation warnings.
See https://docs.gradle.org/6.7.1/userguide/command_line_interface.html#sec:command_line_warnings
BUILD FAILED in 2h 24m 23s
250 actionable tasks: 214 executed, 36 up-to-date
Build step 'Execute shell' marked build as failure
Recording test results
Not sending mail to unregistered user github@hugo-hirsch.de