You are viewing a plain text version of this content. The canonical link for it is here.
Posted to commits@phoenix.apache.org by Apache Jenkins Server <je...@builds.apache.org> on 2020/02/13 22:39:21 UTC
Build failed in Jenkins: Phoenix-4.x-HBase-1.5 #273
See <https://builds.apache.org/job/Phoenix-4.x-HBase-1.5/273/display/redirect?page=changes>
Changes:
[chinmayskulkarni] PHOENIX-5714 Upgrade to 4.16 throwing ColumnNotFoundException
------------------------------------------
[...truncated 919.58 KB...]
[INFO] Installing <https://builds.apache.org/job/Phoenix-4.x-HBase-1.5/ws/phoenix-assembly/pom.xml> to /home/jenkins/.m2/repository/org/apache/phoenix/phoenix-assembly/4.16.0-HBase-1.5-SNAPSHOT/phoenix-assembly-4.16.0-HBase-1.5-SNAPSHOT.pom
[INFO]
[INFO] -------------< org.apache.phoenix:phoenix-tracing-webapp >--------------
[INFO] Building Phoenix - Tracing Web Application 4.16.0-HBase-1.5-SNAPSHOT [7/7]
[INFO] --------------------------------[ jar ]---------------------------------
Downloading from central: https://repo.maven.apache.org/maven2/com/github/searls/jasmine-maven-plugin/1.3.1.6/jasmine-maven-plugin-1.3.1.6.pom
Progress (1): 2.2/21 kBProgress (1): 5.0/21 kBProgress (1): 7.8/21 kBProgress (1): 11/21 kB Progress (1): 13/21 kBProgress (1): 16/21 kBProgress (1): 19/21 kBProgress (1): 21 kB Downloaded from central: https://repo.maven.apache.org/maven2/com/github/searls/jasmine-maven-plugin/1.3.1.6/jasmine-maven-plugin-1.3.1.6.pom (21 kB at 113 kB/s)
Downloading from central: https://repo.maven.apache.org/maven2/com/github/searls/jasmine-maven-plugin/1.3.1.6/jasmine-maven-plugin-1.3.1.6.jar
Progress (1): 2.2/156 kBProgress (1): 5.0/156 kBProgress (1): 7.8/156 kBProgress (1): 11/156 kB Progress (1): 13/156 kBProgress (1): 16/156 kBProgress (1): 19/156 kBProgress (1): 21/156 kBProgress (1): 24/156 kBProgress (1): 27/156 kBProgress (1): 30/156 kBProgress (1): 32/156 kBProgress (1): 36/156 kBProgress (1): 40/156 kBProgress (1): 45/156 kBProgress (1): 49/156 kBProgress (1): 53/156 kBProgress (1): 57/156 kBProgress (1): 61/156 kBProgress (1): 65/156 kBProgress (1): 69/156 kBProgress (1): 73/156 kBProgress (1): 77/156 kBProgress (1): 81/156 kBProgress (1): 86/156 kBProgress (1): 90/156 kBProgress (1): 94/156 kBProgress (1): 98/156 kBProgress (1): 102/156 kBProgress (1): 106/156 kBProgress (1): 110/156 kBProgress (1): 114/156 kBProgress (1): 118/156 kBProgress (1): 122/156 kBProgress (1): 126/156 kBProgress (1): 131/156 kBProgress (1): 135/156 kBProgress (1): 139/156 kBProgress (1): 143/156 kBProgress (1): 147/156 kBProgress (1): 151/156 kBProgress (1): 155/156 kBProgress (1): 156 kB Downloaded from central: https://repo.maven.apache.org/maven2/com/github/searls/jasmine-maven-plugin/1.3.1.6/jasmine-maven-plugin-1.3.1.6.jar (156 kB at 368 kB/s)
Downloading from apache release: https://repository.apache.org/content/repositories/releases/org/eclipse/jetty/jetty-server/8.1.7.v20120910/jetty-server-8.1.7.v20120910.pom
Downloading from Nexus: http://repository.apache.org/snapshots/org/eclipse/jetty/jetty-server/8.1.7.v20120910/jetty-server-8.1.7.v20120910.pom
Downloading from central: https://repo.maven.apache.org/maven2/org/eclipse/jetty/jetty-server/8.1.7.v20120910/jetty-server-8.1.7.v20120910.pom
Progress (1): 3.7 kB Downloaded from central: https://repo.maven.apache.org/maven2/org/eclipse/jetty/jetty-server/8.1.7.v20120910/jetty-server-8.1.7.v20120910.pom (3.7 kB at 287 kB/s)
Downloading from apache release: https://repository.apache.org/content/repositories/releases/org/eclipse/jetty/jetty-project/8.1.7.v20120910/jetty-project-8.1.7.v20120910.pom
Downloading from Nexus: http://repository.apache.org/snapshots/org/eclipse/jetty/jetty-project/8.1.7.v20120910/jetty-project-8.1.7.v20120910.pom
Downloading from central: https://repo.maven.apache.org/maven2/org/eclipse/jetty/jetty-project/8.1.7.v20120910/jetty-project-8.1.7.v20120910.pom
Progress (1): 2.2/27 kBProgress (1): 5.0/27 kBProgress (1): 7.8/27 kBProgress (1): 11/27 kB Progress (1): 13/27 kBProgress (1): 16/27 kBProgress (1): 19/27 kBProgress (1): 21/27 kBProgress (1): 24/27 kBProgress (1): 27/27 kBProgress (1): 27 kB Downloaded from central: https://repo.maven.apache.org/maven2/org/eclipse/jetty/jetty-project/8.1.7.v20120910/jetty-project-8.1.7.v20120910.pom (27 kB at 1.5 MB/s)
Downloading from apache release: https://repository.apache.org/content/repositories/releases/org/eclipse/jetty/jetty-continuation/8.1.7.v20120910/jetty-continuation-8.1.7.v20120910.pom
Downloading from Nexus: http://repository.apache.org/snapshots/org/eclipse/jetty/jetty-continuation/8.1.7.v20120910/jetty-continuation-8.1.7.v20120910.pom
Downloading from central: https://repo.maven.apache.org/maven2/org/eclipse/jetty/jetty-continuation/8.1.7.v20120910/jetty-continuation-8.1.7.v20120910.pom
Progress (1): 2.3/2.7 kBProgress (1): 2.7 kB Downloaded from central: https://repo.maven.apache.org/maven2/org/eclipse/jetty/jetty-continuation/8.1.7.v20120910/jetty-continuation-8.1.7.v20120910.pom (2.7 kB at 14 kB/s)
Downloading from apache release: https://repository.apache.org/content/repositories/releases/org/eclipse/jetty/jetty-http/8.1.7.v20120910/jetty-http-8.1.7.v20120910.pom
Downloading from Nexus: http://repository.apache.org/snapshots/org/eclipse/jetty/jetty-http/8.1.7.v20120910/jetty-http-8.1.7.v20120910.pom
Downloading from central: https://repo.maven.apache.org/maven2/org/eclipse/jetty/jetty-http/8.1.7.v20120910/jetty-http-8.1.7.v20120910.pom
Progress (1): 2.3/2.6 kBProgress (1): 2.6 kB Downloaded from central: https://repo.maven.apache.org/maven2/org/eclipse/jetty/jetty-http/8.1.7.v20120910/jetty-http-8.1.7.v20120910.pom (2.6 kB at 12 kB/s)
Downloading from apache release: https://repository.apache.org/content/repositories/releases/org/eclipse/jetty/jetty-io/8.1.7.v20120910/jetty-io-8.1.7.v20120910.pom
Downloading from Nexus: http://repository.apache.org/snapshots/org/eclipse/jetty/jetty-io/8.1.7.v20120910/jetty-io-8.1.7.v20120910.pom
Downloading from central: https://repo.maven.apache.org/maven2/org/eclipse/jetty/jetty-io/8.1.7.v20120910/jetty-io-8.1.7.v20120910.pom
Progress (1): 2.1 kB Downloaded from central: https://repo.maven.apache.org/maven2/org/eclipse/jetty/jetty-io/8.1.7.v20120910/jetty-io-8.1.7.v20120910.pom (2.1 kB at 150 kB/s)
Downloading from apache release: https://repository.apache.org/content/repositories/releases/org/eclipse/jetty/jetty-util/8.1.7.v20120910/jetty-util-8.1.7.v20120910.pom
Downloading from Nexus: http://repository.apache.org/snapshots/org/eclipse/jetty/jetty-util/8.1.7.v20120910/jetty-util-8.1.7.v20120910.pom
Downloading from central: https://repo.maven.apache.org/maven2/org/eclipse/jetty/jetty-util/8.1.7.v20120910/jetty-util-8.1.7.v20120910.pom
Progress (1): 2.3/3.4 kBProgress (1): 3.4 kB Downloaded from central: https://repo.maven.apache.org/maven2/org/eclipse/jetty/jetty-util/8.1.7.v20120910/jetty-util-8.1.7.v20120910.pom (3.4 kB at 199 kB/s)
Downloading from apache release: https://repository.apache.org/content/repositories/releases/org/eclipse/jetty/jetty-webapp/8.1.7.v20120910/jetty-webapp-8.1.7.v20120910.pom
Downloading from Nexus: http://repository.apache.org/snapshots/org/eclipse/jetty/jetty-webapp/8.1.7.v20120910/jetty-webapp-8.1.7.v20120910.pom
Downloading from central: https://repo.maven.apache.org/maven2/org/eclipse/jetty/jetty-webapp/8.1.7.v20120910/jetty-webapp-8.1.7.v20120910.pom
Progress (1): 2.3/3.5 kBProgress (1): 3.5 kB Downloaded from central: https://repo.maven.apache.org/maven2/org/eclipse/jetty/jetty-webapp/8.1.7.v20120910/jetty-webapp-8.1.7.v20120910.pom (3.5 kB at 17 kB/s)
Downloading from apache release: https://repository.apache.org/content/repositories/releases/org/eclipse/jetty/jetty-xml/8.1.7.v20120910/jetty-xml-8.1.7.v20120910.pom
Downloading from Nexus: http://repository.apache.org/snapshots/org/eclipse/jetty/jetty-xml/8.1.7.v20120910/jetty-xml-8.1.7.v20120910.pom
Downloading from central: https://repo.maven.apache.org/maven2/org/eclipse/jetty/jetty-xml/8.1.7.v20120910/jetty-xml-8.1.7.v20120910.pom
Progress (1): 1.9 kB Downloaded from central: https://repo.maven.apache.org/maven2/org/eclipse/jetty/jetty-xml/8.1.7.v20120910/jetty-xml-8.1.7.v20120910.pom (1.9 kB at 5.2 kB/s)
Downloading from apache release: https://repository.apache.org/content/repositories/releases/org/eclipse/jetty/jetty-servlet/8.1.7.v20120910/jetty-servlet-8.1.7.v20120910.pom
Downloading from Nexus: http://repository.apache.org/snapshots/org/eclipse/jetty/jetty-servlet/8.1.7.v20120910/jetty-servlet-8.1.7.v20120910.pom
Downloading from central: https://repo.maven.apache.org/maven2/org/eclipse/jetty/jetty-servlet/8.1.7.v20120910/jetty-servlet-8.1.7.v20120910.pom
Progress (1): 2.3/2.7 kBProgress (1): 2.7 kB Downloaded from central: https://repo.maven.apache.org/maven2/org/eclipse/jetty/jetty-servlet/8.1.7.v20120910/jetty-servlet-8.1.7.v20120910.pom (2.7 kB at 9.7 kB/s)
Downloading from apache release: https://repository.apache.org/content/repositories/releases/org/eclipse/jetty/jetty-security/8.1.7.v20120910/jetty-security-8.1.7.v20120910.pom
Downloading from Nexus: http://repository.apache.org/snapshots/org/eclipse/jetty/jetty-security/8.1.7.v20120910/jetty-security-8.1.7.v20120910.pom
Downloading from central: https://repo.maven.apache.org/maven2/org/eclipse/jetty/jetty-security/8.1.7.v20120910/jetty-security-8.1.7.v20120910.pom
Progress (1): 2.2/2.7 kBProgress (1): 2.7 kB Downloaded from central: https://repo.maven.apache.org/maven2/org/eclipse/jetty/jetty-security/8.1.7.v20120910/jetty-security-8.1.7.v20120910.pom (2.7 kB at 192 kB/s)
Downloading from apache release: https://repository.apache.org/content/repositories/releases/org/eclipse/jetty/jetty-server/8.1.7.v20120910/jetty-server-8.1.7.v20120910.jar
Downloading from apache release: https://repository.apache.org/content/repositories/releases/org/eclipse/jetty/jetty-io/8.1.7.v20120910/jetty-io-8.1.7.v20120910.jar
Downloading from apache release: https://repository.apache.org/content/repositories/releases/org/eclipse/jetty/jetty-http/8.1.7.v20120910/jetty-http-8.1.7.v20120910.jar
Downloading from apache release: https://repository.apache.org/content/repositories/releases/org/eclipse/jetty/jetty-continuation/8.1.7.v20120910/jetty-continuation-8.1.7.v20120910.jar
Downloading from apache release: https://repository.apache.org/content/repositories/releases/org/eclipse/jetty/jetty-webapp/8.1.7.v20120910/jetty-webapp-8.1.7.v20120910.jar
Downloading from apache release: https://repository.apache.org/content/repositories/releases/org/eclipse/jetty/jetty-xml/8.1.7.v20120910/jetty-xml-8.1.7.v20120910.jar
Downloading from apache release: https://repository.apache.org/content/repositories/releases/org/eclipse/jetty/jetty-util/8.1.7.v20120910/jetty-util-8.1.7.v20120910.jar
Downloading from apache release: https://repository.apache.org/content/repositories/releases/org/eclipse/jetty/jetty-servlet/8.1.7.v20120910/jetty-servlet-8.1.7.v20120910.jar
Downloading from apache release: https://repository.apache.org/content/repositories/releases/org/eclipse/jetty/jetty-security/8.1.7.v20120910/jetty-security-8.1.7.v20120910.jar
Downloading from apache release: https://repository.apache.org/content/repositories/releases/org/apache/httpcomponents/httpclient/4.1.2/httpclient-4.1.2.jar
Progress (1): 4.1/352 kBProgress (1): 7.7/352 kB Progress (1): 12/352 kBProgress (1): 16/352 kBProgress (1): 20/352 kBProgress (1): 24/352 kBProgress (1): 28/352 kBProgress (1): 32/352 kBProgress (1): 36/352 kBProgress (1): 40/352 kBProgress (1): 44/352 kBProgress (1): 48/352 kBProgress (1): 52/352 kBProgress (1): 56/352 kBProgress (1): 60/352 kBProgress (1): 64/352 kBProgress (1): 69/352 kBProgress (1): 73/352 kBProgress (1): 77/352 kBProgress (1): 81/352 kBProgress (1): 85/352 kBProgress (1): 89/352 kBProgress (1): 93/352 kBProgress (1): 97/352 kBProgress (1): 101/352 kBProgress (1): 105/352 kBProgress (1): 109/352 kBProgress (1): 114/352 kBProgress (1): 118/352 kBProgress (1): 122/352 kBProgress (1): 126/352 kBProgress (1): 130/352 kBProgress (1): 134/352 kBProgress (1): 138/352 kBProgress (1): 142/352 kBProgress (1): 146/352 kBProgress (1): 150/352 kBProgress (1): 155/352 kBProgress (1): 159/352 kBProgress (1): 163/352 kBProgress (1): 167/352 kBProgress (1): 171/352 kBProgress (1): 175/352 kBProgress (1): 179/352 kBProgress (1): 183/352 kBProgress (1): 187/352 kBProgress (1): 191/352 kBProgress (1): 195/352 kBProgress (1): 199/352 kBProgress (1): 203/352 kBProgress (1): 207/352 kBProgress (1): 211/352 kBProgress (1): 215/352 kBProgress (1): 219/352 kBProgress (1): 221/352 kBProgress (1): 225/352 kBProgress (1): 229/352 kBProgress (1): 233/352 kBProgress (1): 238/352 kBProgress (1): 242/352 kBProgress (1): 246/352 kBProgress (1): 250/352 kBProgress (1): 254/352 kBProgress (1): 258/352 kBProgress (1): 262/352 kBProgress (1): 266/352 kBProgress (1): 270/352 kBProgress (1): 274/352 kBProgress (1): 279/352 kBProgress (1): 283/352 kBProgress (1): 287/352 kBProgress (1): 291/352 kBProgress (1): 295/352 kBProgress (1): 299/352 kBProgress (1): 303/352 kBProgress (1): 307/352 kBProgress (1): 311/352 kBProgress (1): 315/352 kBProgress (1): 319/352 kBProgress (1): 323/352 kBProgress (1): 327/352 kBProgress (1): 331/352 kBProgress (1): 335/352 kBProgress (1): 339/352 kBProgress (1): 343/352 kBProgress (1): 347/352 kBProgress (1): 351/352 kBProgress (1): 352 kB Downloaded from apache release: https://repository.apache.org/content/repositories/releases/org/apache/httpcomponents/httpclient/4.1.2/httpclient-4.1.2.jar (352 kB at 292 kB/s)
Downloading from Nexus: http://repository.apache.org/snapshots/org/eclipse/jetty/jetty-server/8.1.7.v20120910/jetty-server-8.1.7.v20120910.jar
Downloading from Nexus: http://repository.apache.org/snapshots/org/eclipse/jetty/jetty-continuation/8.1.7.v20120910/jetty-continuation-8.1.7.v20120910.jar
Downloading from Nexus: http://repository.apache.org/snapshots/org/eclipse/jetty/jetty-webapp/8.1.7.v20120910/jetty-webapp-8.1.7.v20120910.jar
Downloading from Nexus: http://repository.apache.org/snapshots/org/eclipse/jetty/jetty-io/8.1.7.v20120910/jetty-io-8.1.7.v20120910.jar
Downloading from Nexus: http://repository.apache.org/snapshots/org/eclipse/jetty/jetty-http/8.1.7.v20120910/jetty-http-8.1.7.v20120910.jar
Downloading from Nexus: http://repository.apache.org/snapshots/org/eclipse/jetty/jetty-xml/8.1.7.v20120910/jetty-xml-8.1.7.v20120910.jar
Downloading from Nexus: http://repository.apache.org/snapshots/org/eclipse/jetty/jetty-util/8.1.7.v20120910/jetty-util-8.1.7.v20120910.jar
Downloading from Nexus: http://repository.apache.org/snapshots/org/eclipse/jetty/jetty-servlet/8.1.7.v20120910/jetty-servlet-8.1.7.v20120910.jar
Downloading from Nexus: http://repository.apache.org/snapshots/org/eclipse/jetty/jetty-security/8.1.7.v20120910/jetty-security-8.1.7.v20120910.jar
Downloading from central: https://repo.maven.apache.org/maven2/org/eclipse/jetty/jetty-server/8.1.7.v20120910/jetty-server-8.1.7.v20120910.jar
Downloading from central: https://repo.maven.apache.org/maven2/org/eclipse/jetty/jetty-http/8.1.7.v20120910/jetty-http-8.1.7.v20120910.jar
Downloading from central: https://repo.maven.apache.org/maven2/org/eclipse/jetty/jetty-continuation/8.1.7.v20120910/jetty-continuation-8.1.7.v20120910.jar
Downloading from central: https://repo.maven.apache.org/maven2/org/eclipse/jetty/jetty-webapp/8.1.7.v20120910/jetty-webapp-8.1.7.v20120910.jar
Downloading from central: https://repo.maven.apache.org/maven2/org/eclipse/jetty/jetty-io/8.1.7.v20120910/jetty-io-8.1.7.v20120910.jar
Progress (1): 2.2/336 kBProgress (1): 5.0/336 kBProgress (1): 7.8/336 kBProgress (1): 11/336 kB Progress (1): 13/336 kBProgress (1): 16/336 kBProgress (1): 19/336 kBProgress (1): 21/336 kBProgress (2): 21/336 kB | 2.2/94 kBProgress (2): 24/336 kB | 2.2/94 kBProgress (2): 24/336 kB | 5.0/94 kBProgress (2): 27/336 kB | 5.0/94 kBProgress (2): 27/336 kB | 7.8/94 kBProgress (2): 30/336 kB | 7.8/94 kBProgress (2): 30/336 kB | 11/94 kB Progress (2): 32/336 kB | 11/94 kBProgress (2): 32/336 kB | 13/94 kBProgress (2): 32/336 kB | 16/94 kBProgress (2): 32/336 kB | 19/94 kBProgress (2): 32/336 kB | 21/94 kBProgress (2): 36/336 kB | 21/94 kBProgress (2): 40/336 kB | 21/94 kBProgress (2): 40/336 kB | 24/94 kBProgress (2): 45/336 kB | 24/94 kBProgress (2): 45/336 kB | 27/94 kBProgress (2): 49/336 kB | 27/94 kBProgress (2): 49/336 kB | 30/94 kBProgress (2): 49/336 kB | 32/94 kBProgress (2): 53/336 kB | 32/94 kBProgress (2): 57/336 kB | 32/94 kBProgress (2): 57/336 kB | 36/94 kBProgress (2): 61/336 kB | 36/94 kBProgress (2): 61/336 kB | 40/94 kBProgress (2): 65/336 kB | 40/94 kBProgress (2): 65/336 kB | 45/94 kBProgress (2): 65/336 kB | 49/94 kBProgress (2): 69/336 kB | 49/94 kBProgress (2): 73/336 kB | 49/94 kBProgress (2): 73/336 kB | 53/94 kBProgress (2): 77/336 kB | 53/94 kBProgress (2): 77/336 kB | 57/94 kBProgress (2): 81/336 kB | 57/94 kBProgress (2): 81/336 kB | 61/94 kBProgress (2): 81/336 kB | 65/94 kBProgress (2): 86/336 kB | 65/94 kBProgress (2): 90/336 kB | 65/94 kBProgress (2): 90/336 kB | 69/94 kBProgress (2): 94/336 kB | 69/94 kBProgress (2): 94/336 kB | 73/94 kBProgress (2): 98/336 kB | 73/94 kBProgress (2): 98/336 kB | 77/94 kBProgress (2): 98/336 kB | 81/94 kBProgress (2): 102/336 kB | 81/94 kBProgress (2): 102/336 kB | 86/94 kBProgress (2): 106/336 kB | 86/94 kBProgress (2): 106/336 kB | 90/94 kBProgress (2): 110/336 kB | 90/94 kBProgress (2): 110/336 kB | 94/94 kBProgress (2): 114/336 kB | 94/94 kBProgress (2): 114/336 kB | 94 kB Progress (2): 118/336 kB | 94 kBProgress (2): 122/336 kB | 94 kBProgress (2): 126/336 kB | 94 kBProgress (2): 131/336 kB | 94 kBProgress (2): 135/336 kB | 94 kBProgress (2): 139/336 kB | 94 kBProgress (2): 143/336 kB | 94 kBProgress (2): 147/336 kB | 94 kBProgress (2): 151/336 kB | 94 kBProgress (2): 155/336 kB | 94 kBProgress (2): 159/336 kB | 94 kBProgress (2): 163/336 kB | 94 kBProgress (2): 167/336 kB | 94 kBProgress (2): 172/336 kB | 94 kBProgress (2): 176/336 kB | 94 kBProgress (2): 180/336 kB | 94 kBProgress (2): 184/336 kB | 94 kBProgress (2): 188/336 kB | 94 kBProgress (2): 192/336 kB | 94 kBProgress (2): 196/336 kB | 94 kB Downloaded from central: https://repo.maven.apache.org/maven2/org/eclipse/jetty/jetty-http/8.1.7.v20120910/jetty-http-8.1.7.v20120910.jar (94 kB at 3.5 MB/s)
Progress (1): 200/336 kB Downloading from central: https://repo.maven.apache.org/maven2/org/eclipse/jetty/jetty-xml/8.1.7.v20120910/jetty-xml-8.1.7.v20120910.jar
Progress (1): 204/336 kBProgress (1): 208/336 kBProgress (1): 212/336 kBProgress (1): 217/336 kBProgress (1): 221/336 kBProgress (1): 225/336 kBProgress (1): 229/336 kBProgress (1): 233/336 kBProgress (1): 237/336 kBProgress (1): 241/336 kBProgress (1): 245/336 kBProgress (1): 249/336 kBProgress (1): 253/336 kBProgress (1): 258/336 kBProgress (1): 262/336 kBProgress (1): 266/336 kBProgress (1): 270/336 kBProgress (1): 274/336 kBProgress (1): 278/336 kBProgress (1): 282/336 kBProgress (1): 286/336 kBProgress (1): 290/336 kBProgress (1): 294/336 kBProgress (1): 298/336 kBProgress (1): 303/336 kBProgress (1): 307/336 kBProgress (1): 311/336 kBProgress (1): 315/336 kBProgress (1): 319/336 kBProgress (1): 323/336 kBProgress (1): 327/336 kBProgress (1): 331/336 kBProgress (1): 335/336 kBProgress (1): 336 kB Downloaded from central: https://repo.maven.apache.org/maven2/org/eclipse/jetty/jetty-server/8.1.7.v20120910/jetty-server-8.1.7.v20120910.jar (336 kB at 1.5 MB/s)
Downloading from central: https://repo.maven.apache.org/maven2/org/eclipse/jetty/jetty-util/8.1.7.v20120910/jetty-util-8.1.7.v20120910.jar
Progress (1): 4.1/280 kBProgress (1): 8.2/280 kBProgress (1): 12/280 kB Progress (1): 16/280 kBProgress (1): 20/280 kBProgress (1): 25/280 kBProgress (1): 29/280 kBProgress (1): 33/280 kBProgress (1): 37/280 kBProgress (1): 41/280 kBProgress (1): 45/280 kBProgress (1): 49/280 kBProgress (1): 53/280 kBProgress (1): 57/280 kBProgress (1): 61/280 kBProgress (1): 66/280 kBProgress (1): 70/280 kBProgress (1): 74/280 kBProgress (1): 78/280 kBProgress (1): 82/280 kBProgress (1): 86/280 kBProgress (1): 90/280 kBProgress (1): 94/280 kBProgress (1): 98/280 kBProgress (1): 102/280 kBProgress (1): 106/280 kBProgress (1): 111/280 kBProgress (1): 115/280 kBProgress (1): 119/280 kBProgress (1): 123/280 kBProgress (1): 127/280 kBProgress (1): 131/280 kBProgress (1): 135/280 kBProgress (1): 139/280 kBProgress (1): 143/280 kBProgress (1): 147/280 kBProgress (1): 152/280 kBProgress (1): 156/280 kBProgress (1): 160/280 kBProgress (1): 164/280 kBProgress (1): 168/280 kBProgress (1): 172/280 kBProgress (1): 176/280 kBProgress (1): 180/280 kBProgress (1): 184/280 kBProgress (1): 188/280 kBProgress (1): 193/280 kBProgress (1): 197/280 kBProgress (1): 201/280 kBProgress (1): 205/280 kBProgress (1): 209/280 kBProgress (1): 213/280 kBProgress (1): 217/280 kBProgress (1): 221/280 kBProgress (1): 225/280 kBProgress (1): 229/280 kBProgress (1): 233/280 kBProgress (1): 238/280 kBProgress (1): 242/280 kBProgress (1): 246/280 kBProgress (1): 250/280 kBProgress (1): 254/280 kBProgress (1): 258/280 kBProgress (1): 262/280 kBProgress (1): 266/280 kBProgress (1): 270/280 kBProgress (2): 270/280 kB | 2.2/21 kBProgress (2): 274/280 kB | 2.2/21 kBProgress (2): 277/280 kB | 2.2/21 kBProgress (2): 280 kB | 2.2/21 kB Progress (2): 280 kB | 5.0/21 kBProgress (2): 280 kB | 7.8/21 kBProgress (2): 280 kB | 11/21 kB Progress (2): 280 kB | 13/21 kBProgress (2): 280 kB | 16/21 kBProgress (2): 280 kB | 19/21 kBProgress (2): 280 kB | 21 kB Downloaded from central: https://repo.maven.apache.org/maven2/org/eclipse/jetty/jetty-util/8.1.7.v20120910/jetty-util-8.1.7.v20120910.jar (280 kB at 1.1 MB/s)
Downloading from central: https://repo.maven.apache.org/maven2/org/eclipse/jetty/jetty-servlet/8.1.7.v20120910/jetty-servlet-8.1.7.v20120910.jar
Downloaded from central: https://repo.maven.apache.org/maven2/org/eclipse/jetty/jetty-continuation/8.1.7.v20120910/jetty-continuation-8.1.7.v20120910.jar (21 kB at 84 kB/s)
Downloading from central: https://repo.maven.apache.org/maven2/org/eclipse/jetty/jetty-security/8.1.7.v20120910/jetty-security-8.1.7.v20120910.jar
Progress (1): 2.2/87 kBProgress (1): 5.0/87 kBProgress (1): 7.7/87 kBProgress (1): 10/87 kB Progress (1): 13/87 kBProgress (1): 16/87 kBProgress (1): 19/87 kBProgress (1): 21/87 kBProgress (1): 24/87 kBProgress (1): 27/87 kBProgress (1): 30/87 kBProgress (1): 32/87 kBProgress (1): 36/87 kBProgress (1): 40/87 kBProgress (1): 45/87 kBProgress (1): 49/87 kBProgress (1): 53/87 kBProgress (1): 57/87 kBProgress (1): 61/87 kBProgress (1): 65/87 kBProgress (1): 69/87 kBProgress (1): 73/87 kBProgress (1): 77/87 kBProgress (1): 81/87 kBProgress (1): 85/87 kBProgress (1): 87 kB Progress (2): 87 kB | 2.2/103 kBProgress (2): 87 kB | 5.0/103 kBProgress (2): 87 kB | 7.8/103 kBProgress (2): 87 kB | 11/103 kB Progress (2): 87 kB | 13/103 kBProgress (2): 87 kB | 16/103 kBProgress (2): 87 kB | 19/103 kBProgress (2): 87 kB | 21/103 kBProgress (2): 87 kB | 24/103 kBProgress (2): 87 kB | 27/103 kBProgress (2): 87 kB | 30/103 kBProgress (2): 87 kB | 32/103 kBProgress (3): 87 kB | 32/103 kB | 4.1/39 kBProgress (3): 87 kB | 32/103 kB | 7.7/39 kBProgress (3): 87 kB | 36/103 kB | 7.7/39 kBProgress (3): 87 kB | 36/103 kB | 12/39 kB Progress (3): 87 kB | 40/103 kB | 12/39 kBProgress (3): 87 kB | 40/103 kB | 16/39 kBProgress (3): 87 kB | 45/103 kB | 16/39 kBProgress (3): 87 kB | 49/103 kB | 16/39 kBProgress (3): 87 kB | 53/103 kB | 16/39 kBProgress (3): 87 kB | 53/103 kB | 20/39 kBProgress (3): 87 kB | 57/103 kB | 20/39 kBProgress (3): 87 kB | 57/103 kB | 24/39 kBProgress (3): 87 kB | 61/103 kB | 24/39 kBProgress (3): 87 kB | 61/103 kB | 28/39 kBProgress (3): 87 kB | 65/103 kB | 28/39 kBProgress (3): 87 kB | 65/103 kB | 32/39 kBProgress (3): 87 kB | 65/103 kB | 36/39 kBProgress (3): 87 kB | 69/103 kB | 36/39 kBProgress (3): 87 kB | 69/103 kB | 39 kB Progress (3): 87 kB | 73/103 kB | 39 kBProgress (3): 87 kB | 77/103 kB | 39 kBProgress (3): 87 kB | 81/103 kB | 39 kBProgress (3): 87 kB | 86/103 kB | 39 kBProgress (3): 87 kB | 90/103 kB | 39 kBProgress (3): 87 kB | 94/103 kB | 39 kBProgress (3): 87 kB | 98/103 kB | 39 kBProgress (3): 87 kB | 102/103 kB | 39 kBProgress (3): 87 kB | 103 kB | 39 kB Downloaded from central: https://repo.maven.apache.org/maven2/org/eclipse/jetty/jetty-io/8.1.7.v20120910/jetty-io-8.1.7.v20120910.jar (103 kB at 290 kB/s)
Progress (3): 87 kB | 39 kB | 2.2/107 kBProgress (3): 87 kB | 39 kB | 5.0/107 kBProgress (3): 87 kB | 39 kB | 7.8/107 kBProgress (3): 87 kB | 39 kB | 11/107 kB Progress (3): 87 kB | 39 kB | 13/107 kBProgress (3): 87 kB | 39 kB | 16/107 kBProgress (3): 87 kB | 39 kB | 19/107 kBProgress (3): 87 kB | 39 kB | 21/107 kBProgress (3): 87 kB | 39 kB | 24/107 kBProgress (3): 87 kB | 39 kB | 27/107 kBProgress (3): 87 kB | 39 kB | 30/107 kBProgress (3): 87 kB | 39 kB | 32/107 kBProgress (3): 87 kB | 39 kB | 36/107 kBProgress (3): 87 kB | 39 kB | 40/107 kBProgress (3): 87 kB | 39 kB | 45/107 kBProgress (3): 87 kB | 39 kB | 49/107 kBProgress (3): 87 kB | 39 kB | 53/107 kBProgress (3): 87 kB | 39 kB | 57/107 kBProgress (3): 87 kB | 39 kB | 61/107 kBProgress (3): 87 kB | 39 kB | 65/107 kBProgress (3): 87 kB | 39 kB | 69/107 kBProgress (3): 87 kB | 39 kB | 73/107 kBProgress (3): 87 kB | 39 kB | 77/107 kBProgress (3): 87 kB | 39 kB | 81/107 kBProgress (3): 87 kB | 39 kB | 86/107 kBProgress (3): 87 kB | 39 kB | 90/107 kBProgress (3): 87 kB | 39 kB | 94/107 kBProgress (3): 87 kB | 39 kB | 98/107 kBProgress (3): 87 kB | 39 kB | 102/107 kBProgress (3): 87 kB | 39 kB | 106/107 kBProgress (3): 87 kB | 39 kB | 107 kB Downloaded from central: https://repo.maven.apache.org/maven2/org/eclipse/jetty/jetty-webapp/8.1.7.v20120910/jetty-webapp-8.1.7.v20120910.jar (107 kB at 281 kB/s)
Downloaded from central: https://repo.maven.apache.org/maven2/org/eclipse/jetty/jetty-security/8.1.7.v20120910/jetty-security-8.1.7.v20120910.jar (87 kB at 198 kB/s)
Downloaded from central: https://repo.maven.apache.org/maven2/org/eclipse/jetty/jetty-xml/8.1.7.v20120910/jetty-xml-8.1.7.v20120910.jar (39 kB at 71 kB/s)
Progress (1): 4.1/97 kBProgress (1): 7.7/97 kBProgress (1): 12/97 kB Progress (1): 16/97 kBProgress (1): 20/97 kBProgress (1): 24/97 kBProgress (1): 28/97 kBProgress (1): 32/97 kBProgress (1): 36/97 kBProgress (1): 40/97 kBProgress (1): 45/97 kBProgress (1): 49/97 kBProgress (1): 53/97 kBProgress (1): 57/97 kBProgress (1): 61/97 kBProgress (1): 65/97 kBProgress (1): 69/97 kBProgress (1): 73/97 kBProgress (1): 77/97 kBProgress (1): 81/97 kBProgress (1): 86/97 kBProgress (1): 90/97 kBProgress (1): 94/97 kBProgress (1): 97 kB Downloaded from central: https://repo.maven.apache.org/maven2/org/eclipse/jetty/jetty-servlet/8.1.7.v20120910/jetty-servlet-8.1.7.v20120910.jar (97 kB at 119 kB/s)
[INFO]
[INFO] --- maven-clean-plugin:3.1.0:clean (default-clean) @ phoenix-tracing-webapp ---
[INFO]
[INFO] --- maven-enforcer-plugin:1.4.1:enforce (enforce-maven-version) @ phoenix-tracing-webapp ---
[INFO]
[INFO] --- maven-checkstyle-plugin:3.1.0:check (validate) @ phoenix-tracing-webapp ---
[INFO]
[INFO] --- build-helper-maven-plugin:1.9.1:add-test-source (add-test-source) @ phoenix-tracing-webapp ---
[INFO] Test Source directory: <https://builds.apache.org/job/Phoenix-4.x-HBase-1.5/ws/phoenix-tracing-webapp/src/it/java> added.
[INFO]
[INFO] --- build-helper-maven-plugin:1.9.1:add-test-resource (add-test-resource) @ phoenix-tracing-webapp ---
[INFO]
[INFO] --- maven-remote-resources-plugin:1.5:process (process-resource-bundles) @ phoenix-tracing-webapp ---
[INFO]
[INFO] --- maven-resources-plugin:3.1.0:resources (default-resources) @ phoenix-tracing-webapp ---
[INFO] Using 'UTF-8' encoding to copy filtered resources.
[INFO] skip non existing resourceDirectory <https://builds.apache.org/job/Phoenix-4.x-HBase-1.5/ws/phoenix-tracing-webapp/src/main/resources>
[INFO] Copying 3 resources
[INFO]
[INFO] --- maven-compiler-plugin:3.7.0:compile (default-compile) @ phoenix-tracing-webapp ---
[INFO] Changes detected - recompiling the module!
[INFO] Compiling 4 source files to <https://builds.apache.org/job/Phoenix-4.x-HBase-1.5/ws/phoenix-tracing-webapp/target/classes>
[INFO]
[INFO] --- maven-resources-plugin:3.1.0:testResources (default-testResources) @ phoenix-tracing-webapp ---
[INFO] Using 'UTF-8' encoding to copy filtered resources.
[INFO] skip non existing resourceDirectory <https://builds.apache.org/job/Phoenix-4.x-HBase-1.5/ws/phoenix-tracing-webapp/src/test/resources>
[INFO] skip non existing resourceDirectory <https://builds.apache.org/job/Phoenix-4.x-HBase-1.5/ws/phoenix-tracing-webapp/src/it/resources>
[INFO] Copying 3 resources
[INFO]
[INFO] --- maven-compiler-plugin:3.7.0:testCompile (default-testCompile) @ phoenix-tracing-webapp ---
[INFO] No sources to compile
[INFO]
[INFO] --- maven-surefire-plugin:2.22.0:test (default-test) @ phoenix-tracing-webapp ---
[INFO]
[INFO] --- jasmine-maven-plugin:1.3.1.6:test (default) @ phoenix-tracing-webapp ---
Downloading from central: https://repo.maven.apache.org/maven2/org/seleniumhq/selenium/selenium-java/2.45.0/selenium-java-2.45.0.pom
Progress (1): 2.2/4.8 kBProgress (1): 4.8 kB Downloaded from central: https://repo.maven.apache.org/maven2/org/seleniumhq/selenium/selenium-java/2.45.0/selenium-java-2.45.0.pom (4.8 kB at 345 kB/s)
Downloading from central: https://repo.maven.apache.org/maven2/org/seleniumhq/selenium/selenium-parent/2.45.0/selenium-parent-2.45.0.pom
Progress (1): 2.2/9.8 kBProgress (1): 5.0/9.8 kBProgress (1): 7.8/9.8 kBProgress (1): 9.8 kB Downloaded from central: https://repo.maven.apache.org/maven2/org/seleniumhq/selenium/selenium-parent/2.45.0/selenium-parent-2.45.0.pom (9.8 kB at 752 kB/s)
Downloading from central: https://repo.maven.apache.org/maven2/org/seleniumhq/selenium/selenium-chrome-driver/2.45.0/selenium-chrome-driver-2.45.0.pom
Progress (1): 2.2/2.9 kBProgress (1): 2.9 kB Downloaded from central: https://repo.maven.apache.org/maven2/org/seleniumhq/selenium/selenium-chrome-driver/2.45.0/selenium-chrome-driver-2.45.0.pom (2.9 kB at 227 kB/s)
Downloading from central: https://repo.maven.apache.org/maven2/org/seleniumhq/selenium/selenium-remote-driver/2.45.0/selenium-remote-driver-2.45.0.pom
Progress (1): 2.2/3.6 kBProgress (1): 3.6 kB Downloaded from central: https://repo.maven.apache.org/maven2/org/seleniumhq/selenium/selenium-remote-driver/2.45.0/selenium-remote-driver-2.45.0.pom (3.6 kB at 15 kB/s)
Downloading from central: https://repo.maven.apache.org/maven2/org/seleniumhq/selenium/selenium-api/2.45.0/selenium-api-2.45.0.pom
Progress (1): 2.2/5.2 kBProgress (1): 5.0/5.2 kBProgress (1): 5.2 kB Downloaded from central: https://repo.maven.apache.org/maven2/org/seleniumhq/selenium/selenium-api/2.45.0/selenium-api-2.45.0.pom (5.2 kB at 369 kB/s)
Downloading from central: https://repo.maven.apache.org/maven2/org/seleniumhq/selenium/selenium-htmlunit-driver/2.45.0/selenium-htmlunit-driver-2.45.0.pom
Progress (1): 2.2/2.3 kBProgress (1): 2.3 kB Downloaded from central: https://repo.maven.apache.org/maven2/org/seleniumhq/selenium/selenium-htmlunit-driver/2.45.0/selenium-htmlunit-driver-2.45.0.pom (2.3 kB at 190 kB/s)
Downloading from central: https://repo.maven.apache.org/maven2/net/sourceforge/htmlunit/htmlunit/2.15/htmlunit-2.15.pom
Progress (1): 2.2/37 kBProgress (1): 5.0/37 kBProgress (1): 7.8/37 kBProgress (1): 11/37 kB Progress (1): 13/37 kBProgress (1): 16/37 kBProgress (1): 19/37 kBProgress (1): 21/37 kBProgress (1): 24/37 kBProgress (1): 27/37 kBProgress (1): 30/37 kBProgress (1): 32/37 kBProgress (1): 35/37 kBProgress (1): 37 kB Downloaded from central: https://repo.maven.apache.org/maven2/net/sourceforge/htmlunit/htmlunit/2.15/htmlunit-2.15.pom (37 kB at 2.3 MB/s)
Downloading from central: https://repo.maven.apache.org/maven2/org/apache/httpcomponents/httpclient/4.3.3/httpclient-4.3.3.pom
Progress (1): 2.2/5.4 kBProgress (1): 5.0/5.4 kBProgress (1): 5.4 kB Downloaded from central: https://repo.maven.apache.org/maven2/org/apache/httpcomponents/httpclient/4.3.3/httpclient-4.3.3.pom (5.4 kB at 413 kB/s)
Downloading from central: https://repo.maven.apache.org/maven2/org/apache/httpcomponents/httpcomponents-client/4.3.3/httpcomponents-client-4.3.3.pom
Progress (1): 2.2/16 kBProgress (1): 5.0/16 kBProgress (1): 7.8/16 kBProgress (1): 11/16 kB Progress (1): 13/16 kBProgress (1): 16 kB Downloaded from central: https://repo.maven.apache.org/maven2/org/apache/httpcomponents/httpcomponents-client/4.3.3/httpcomponents-client-4.3.3.pom (16 kB at 1.2 MB/s)
Downloading from central: https://repo.maven.apache.org/maven2/org/apache/httpcomponents/httpmime/4.3.3/httpmime-4.3.3.pom
Progress (1): 2.2/4.9 kBProgress (1): 4.9 kB Downloaded from central: https://repo.maven.apache.org/maven2/org/apache/httpcomponents/httpmime/4.3.3/httpmime-4.3.3.pom (4.9 kB at 379 kB/s)
Downloading from central: https://repo.maven.apache.org/maven2/net/sourceforge/htmlunit/htmlunit-core-js/2.15/htmlunit-core-js-2.15.pom
Progress (1): 1.5 kB Downloaded from central: https://repo.maven.apache.org/maven2/net/sourceforge/htmlunit/htmlunit-core-js/2.15/htmlunit-core-js-2.15.pom (1.5 kB at 21 kB/s)
Downloading from central: https://repo.maven.apache.org/maven2/net/sourceforge/nekohtml/nekohtml/1.9.21/nekohtml-1.9.21.pom
Progress (1): 1.4 kB Downloaded from central: https://repo.maven.apache.org/maven2/net/sourceforge/nekohtml/nekohtml/1.9.21/nekohtml-1.9.21.pom (1.4 kB at 110 kB/s)
Downloading from central: https://repo.maven.apache.org/maven2/net/sourceforge/cssparser/cssparser/0.9.14/cssparser-0.9.14.pom
[WARNING] Failed to create parent directories for tracking file /home/jenkins/.m2/repository/net/sourceforge/cssparser/cssparser/0.9.14/cssparser-0.9.14.pom.lastUpdated
Downloading from central: https://repo.maven.apache.org/maven2/org/eclipse/jetty/jetty-websocket/8.1.15.v20140411/jetty-websocket-8.1.15.v20140411.pom
[WARNING] Failed to create parent directories for tracking file /home/jenkins/.m2/repository/org/eclipse/jetty/jetty-websocket/8.1.15.v20140411/jetty-websocket-8.1.15.v20140411.pom.lastUpdated
Downloading from central: https://repo.maven.apache.org/maven2/org/seleniumhq/selenium/selenium-firefox-driver/2.45.0/selenium-firefox-driver-2.45.0.pom
Progress (1): 2.2/3.2 kBProgress (1): 3.2 kB Downloaded from central: https://repo.maven.apache.org/maven2/org/seleniumhq/selenium/selenium-firefox-driver/2.45.0/selenium-firefox-driver-2.45.0.pom (3.2 kB at 17 kB/s)
Downloading from central: https://repo.maven.apache.org/maven2/org/seleniumhq/selenium/selenium-ie-driver/2.45.0/selenium-ie-driver-2.45.0.pom
Progress (1): 2.3/3.2 kBProgress (1): 3.2 kB Downloaded from central: https://repo.maven.apache.org/maven2/org/seleniumhq/selenium/selenium-ie-driver/2.45.0/selenium-ie-driver-2.45.0.pom (3.2 kB at 245 kB/s)
Downloading from central: https://repo.maven.apache.org/maven2/org/seleniumhq/selenium/selenium-safari-driver/2.45.0/selenium-safari-driver-2.45.0.pom
Progress (1): 2.2/3.1 kBProgress (1): 3.1 kB Downloaded from central: https://repo.maven.apache.org/maven2/org/seleniumhq/selenium/selenium-safari-driver/2.45.0/selenium-safari-driver-2.45.0.pom (3.1 kB at 237 kB/s)
Downloading from central: https://repo.maven.apache.org/maven2/org/webbitserver/webbit/0.4.14/webbit-0.4.14.pom
Progress (1): 2.2/5.0 kBProgress (1): 5.0/5.0 kBProgress (1): 5.0 kB Downloaded from central: https://repo.maven.apache.org/maven2/org/webbitserver/webbit/0.4.14/webbit-0.4.14.pom (5.0 kB at 385 kB/s)
Downloading from central: https://repo.maven.apache.org/maven2/io/netty/netty/3.5.2.Final/netty-3.5.2.Final.pom
Progress (1): 2.2/26 kBProgress (1): 5.0/26 kBProgress (1): 7.8/26 kBProgress (1): 11/26 kB Progress (1): 13/26 kBProgress (1): 16/26 kBProgress (1): 19/26 kBProgress (1): 21/26 kBProgress (1): 24/26 kBProgress (1): 26 kB Downloaded from central: https://repo.maven.apache.org/maven2/io/netty/netty/3.5.2.Final/netty-3.5.2.Final.pom (26 kB at 1.7 MB/s)
Downloading from central: https://repo.maven.apache.org/maven2/org/seleniumhq/selenium/selenium-support/2.45.0/selenium-support-2.45.0.pom
Progress (1): 2.2/2.5 kBProgress (1): 2.5 kB Downloaded from central: https://repo.maven.apache.org/maven2/org/seleniumhq/selenium/selenium-support/2.45.0/selenium-support-2.45.0.pom (2.5 kB at 205 kB/s)
Downloading from central: https://repo.maven.apache.org/maven2/org/seleniumhq/selenium/selenium-leg-rc/2.45.0/selenium-leg-rc-2.45.0.pom
Progress (1): 2.2/4.7 kBProgress (1): 4.7 kB Downloaded from central: https://repo.maven.apache.org/maven2/org/seleniumhq/selenium/selenium-leg-rc/2.45.0/selenium-leg-rc-2.45.0.pom (4.7 kB at 27 kB/s)
Downloading from central: https://repo.maven.apache.org/maven2/org/seleniumhq/selenium/selenium-server/2.45.0/selenium-server-2.45.0.pom
Progress (1): 2.3/5.6 kBProgress (1): 5.0/5.6 kBProgress (1): 5.6 kB Downloaded from central: https://repo.maven.apache.org/maven2/org/seleniumhq/selenium/selenium-server/2.45.0/selenium-server-2.45.0.pom (5.6 kB at 26 kB/s)
Downloading from central: https://repo.maven.apache.org/maven2/org/bouncycastle/bcprov-jdk15on/1.48/bcprov-jdk15on-1.48.pom
Progress (1): 1.0 kB Downloaded from central: https://repo.maven.apache.org/maven2/org/bouncycastle/bcprov-jdk15on/1.48/bcprov-jdk15on-1.48.pom (1.0 kB at 86 kB/s)
Downloading from central: https://repo.maven.apache.org/maven2/org/bouncycastle/bcpkix-jdk15on/1.48/bcpkix-jdk15on-1.48.pom
Progress (1): 1.4 kB Downloaded from central: https://repo.maven.apache.org/maven2/org/bouncycastle/bcpkix-jdk15on/1.48/bcpkix-jdk15on-1.48.pom (1.4 kB at 113 kB/s)
Downloading from central: https://repo.maven.apache.org/maven2/mx4j/mx4j-tools/3.0.1/mx4j-tools-3.0.1.pom
Progress (1): 155 B Downloaded from central: https://repo.maven.apache.org/maven2/mx4j/mx4j-tools/3.0.1/mx4j-tools-3.0.1.pom (155 B at 14 kB/s)
Downloading from central: https://repo.maven.apache.org/maven2/org/seleniumhq/selenium/jetty-repacked/7.6.1/jetty-repacked-7.6.1.pom
Progress (1): 2.2/4.7 kBProgress (1): 4.7 kB Downloaded from central: https://repo.maven.apache.org/maven2/org/seleniumhq/selenium/jetty-repacked/7.6.1/jetty-repacked-7.6.1.pom (4.7 kB at 391 kB/s)
Downloading from central: https://repo.maven.apache.org/maven2/org/seleniumhq/selenium/jetty-rc-repacked/5/jetty-rc-repacked-5.pom
Progress (1): 2.2/2.7 kBProgress (1): 2.7 kB Downloaded from central: https://repo.maven.apache.org/maven2/org/seleniumhq/selenium/jetty-rc-repacked/5/jetty-rc-repacked-5.pom (2.7 kB at 210 kB/s)
Downloading from central: https://repo.maven.apache.org/maven2/org/yaml/snakeyaml/1.8/snakeyaml-1.8.pom
Progress (1): 2.2/13 kBProgress (1): 5.0/13 kBProgress (1): 7.8/13 kBProgress (1): 11/13 kB Progress (1): 13/13 kBProgress (1): 13 kB Downloaded from central: https://repo.maven.apache.org/maven2/org/yaml/snakeyaml/1.8/snakeyaml-1.8.pom (13 kB at 963 kB/s)
Downloading from central: https://repo.maven.apache.org/maven2/org/eclipse/jetty/jetty-server/8.1.14.v20131031/jetty-server-8.1.14.v20131031.pom
Progress (1): 2.2/3.8 kBProgress (1): 3.8 kB Downloaded from central: https://repo.maven.apache.org/maven2/org/eclipse/jetty/jetty-server/8.1.14.v20131031/jetty-server-8.1.14.v20131031.pom (3.8 kB at 291 kB/s)
Downloading from central: https://repo.maven.apache.org/maven2/org/eclipse/jetty/jetty-project/8.1.14.v20131031/jetty-project-8.1.14.v20131031.pom
Progress (1): 2.2/28 kBProgress (1): 5.0/28 kBProgress (1): 7.8/28 kBProgress (1): 11/28 kB Progress (1): 13/28 kBProgress (1): 16/28 kBProgress (1): 19/28 kBProgress (1): 21/28 kBProgress (1): 24/28 kBProgress (1): 27/28 kBProgress (1): 28 kB Downloaded from central: https://repo.maven.apache.org/maven2/org/eclipse/jetty/jetty-project/8.1.14.v20131031/jetty-project-8.1.14.v20131031.pom (28 kB at 1.8 MB/s)
Downloading from central: https://repo.maven.apache.org/maven2/org/eclipse/jetty/jetty-continuation/8.1.14.v20131031/jetty-continuation-8.1.14.v20131031.pom
Progress (1): 2.2/2.7 kBProgress (1): 2.7 kB Downloaded from central: https://repo.maven.apache.org/maven2/org/eclipse/jetty/jetty-continuation/8.1.14.v20131031/jetty-continuation-8.1.14.v20131031.pom (2.7 kB at 210 kB/s)
Downloading from central: https://repo.maven.apache.org/maven2/org/eclipse/jetty/jetty-http/8.1.14.v20131031/jetty-http-8.1.14.v20131031.pom
Progress (1): 2.2/2.6 kBProgress (1): 2.6 kB Downloaded from central: https://repo.maven.apache.org/maven2/org/eclipse/jetty/jetty-http/8.1.14.v20131031/jetty-http-8.1.14.v20131031.pom (2.6 kB at 189 kB/s)
Downloading from central: https://repo.maven.apache.org/maven2/org/eclipse/jetty/jetty-io/8.1.14.v20131031/jetty-io-8.1.14.v20131031.pom
Progress (1): 2.1 kB Downloaded from central: https://repo.maven.apache.org/maven2/org/eclipse/jetty/jetty-io/8.1.14.v20131031/jetty-io-8.1.14.v20131031.pom (2.1 kB at 153 kB/s)
Downloading from central: https://repo.maven.apache.org/maven2/org/eclipse/jetty/jetty-util/8.1.14.v20131031/jetty-util-8.1.14.v20131031.pom
Progress (1): 2.2/3.4 kBProgress (1): 3.4 kB Downloaded from central: https://repo.maven.apache.org/maven2/org/eclipse/jetty/jetty-util/8.1.14.v20131031/jetty-util-8.1.14.v20131031.pom (3.4 kB at 286 kB/s)
Downloading from central: https://repo.maven.apache.org/maven2/com/codeborne/phantomjsdriver/1.2.1/phantomjsdriver-1.2.1.pom
Progress (1): 2.0 kB Downloaded from central: https://repo.maven.apache.org/maven2/com/codeborne/phantomjsdriver/1.2.1/phantomjsdriver-1.2.1.pom (2.0 kB at 158 kB/s)
Downloading from central: https://repo.maven.apache.org/maven2/org/seleniumhq/selenium/selenium-java/2.44.0/selenium-java-2.44.0.pom
Progress (1): 2.2/5.9 kBProgress (1): 5.0/5.9 kBProgress (1): 5.9 kB Downloaded from central: https://repo.maven.apache.org/maven2/org/seleniumhq/selenium/selenium-java/2.44.0/selenium-java-2.44.0.pom (5.9 kB at 453 kB/s)
Downloading from central: https://repo.maven.apache.org/maven2/org/seleniumhq/selenium/selenium-parent/2.44.0/selenium-parent-2.44.0.pom
Progress (1): 2.2/9.7 kBProgress (1): 5.0/9.7 kBProgress (1): 7.8/9.7 kBProgress (1): 9.7 kB Downloaded from central: https://repo.maven.apache.org/maven2/org/seleniumhq/selenium/selenium-parent/2.44.0/selenium-parent-2.44.0.pom (9.7 kB at 696 kB/s)
Downloading from central: https://repo.maven.apache.org/maven2/org/seleniumhq/selenium/selenium-chrome-driver/2.44.0/selenium-chrome-driver-2.44.0.pom
Progress (1): 2.2/2.9 kBProgress (1): 2.9 kB Downloaded from central: https://repo.maven.apache.org/maven2/org/seleniumhq/selenium/selenium-chrome-driver/2.44.0/selenium-chrome-driver-2.44.0.pom (2.9 kB at 245 kB/s)
Downloading from central: https://repo.maven.apache.org/maven2/org/seleniumhq/selenium/selenium-remote-driver/2.44.0/selenium-remote-driver-2.44.0.pom
Progress (1): 2.2/3.6 kBProgress (1): 3.6 kB Downloaded from central: https://repo.maven.apache.org/maven2/org/seleniumhq/selenium/selenium-remote-driver/2.44.0/selenium-remote-driver-2.44.0.pom (3.6 kB at 59 kB/s)
Downloading from central: https://repo.maven.apache.org/maven2/com/google/code/gson/gson/2.3/gson-2.3.pom
Progress (1): 2.2/9.0 kBProgress (1): 5.0/9.0 kBProgress (1): 7.8/9.0 kBProgress (1): 9.0 kB Downloaded from central: https://repo.maven.apache.org/maven2/com/google/code/gson/gson/2.3/gson-2.3.pom (9.0 kB at 641 kB/s)
Downloading from central: https://repo.maven.apache.org/maven2/org/seleniumhq/selenium/selenium-api/2.44.0/selenium-api-2.44.0.pom
Progress (1): 2.2/5.2 kBProgress (1): 5.0/5.2 kBProgress (1): 5.2 kB Downloaded from central: https://repo.maven.apache.org/maven2/org/seleniumhq/selenium/selenium-api/2.44.0/selenium-api-2.44.0.pom (5.2 kB at 397 kB/s)
Downloading from central: https://repo.maven.apache.org/maven2/org/seleniumhq/selenium/selenium-htmlunit-driver/2.44.0/selenium-htmlunit-driver-2.44.0.pom
Progress (1): 2.2/2.3 kBProgress (1): 2.3 kB Downloaded from central: https://repo.maven.apache.org/maven2/org/seleniumhq/selenium/selenium-htmlunit-driver/2.44.0/selenium-htmlunit-driver-2.44.0.pom (2.3 kB at 175 kB/s)
Downloading from central: https://repo.maven.apache.org/maven2/org/seleniumhq/selenium/selenium-firefox-driver/2.44.0/selenium-firefox-driver-2.44.0.pom
Progress (1): 2.2/3.2 kBProgress (1): 3.2 kB Downloaded from central: https://repo.maven.apache.org/maven2/org/seleniumhq/selenium/selenium-firefox-driver/2.44.0/selenium-firefox-driver-2.44.0.pom (3.2 kB at 248 kB/s)
Downloading from central: https://repo.maven.apache.org/maven2/org/seleniumhq/selenium/selenium-ie-driver/2.44.0/selenium-ie-driver-2.44.0.pom
Progress (1): 2.2/3.2 kBProgress (1): 3.2 kB Downloaded from central: https://repo.maven.apache.org/maven2/org/seleniumhq/selenium/selenium-ie-driver/2.44.0/selenium-ie-driver-2.44.0.pom (3.2 kB at 245 kB/s)
Downloading from central: https://repo.maven.apache.org/maven2/org/seleniumhq/selenium/selenium-safari-driver/2.44.0/selenium-safari-driver-2.44.0.pom
Progress (1): 2.2/3.1 kBProgress (1): 3.1 kB Downloaded from central: https://repo.maven.apache.org/maven2/org/seleniumhq/selenium/selenium-safari-driver/2.44.0/selenium-safari-driver-2.44.0.pom (3.1 kB at 237 kB/s)
Downloading from central: https://repo.maven.apache.org/maven2/org/seleniumhq/selenium/selenium-support/2.44.0/selenium-support-2.44.0.pom
Progress (1): 2.5 kB Downloaded from central: https://repo.maven.apache.org/maven2/org/seleniumhq/selenium/selenium-support/2.44.0/selenium-support-2.44.0.pom (2.5 kB at 205 kB/s)
Downloading from central: https://repo.maven.apache.org/maven2/org/webjars/webjars-locator/0.14/webjars-locator-0.14.pom
Progress (1): 2.2/4.9 kBProgress (1): 4.9 kB Downloaded from central: https://repo.maven.apache.org/maven2/org/webjars/webjars-locator/0.14/webjars-locator-0.14.pom (4.9 kB at 378 kB/s)
Downloading from central: https://repo.maven.apache.org/maven2/com/fasterxml/jackson/core/jackson-databind/2.3.3/jackson-databind-2.3.3.pom
Progress (1): 2.2/5.9 kBProgress (1): 5.0/5.9 kBProgress (1): 5.9 kB Downloaded from central: https://repo.maven.apache.org/maven2/com/fasterxml/jackson/core/jackson-databind/2.3.3/jackson-databind-2.3.3.pom (5.9 kB at 494 kB/s)
Downloading from central: https://repo.maven.apache.org/maven2/com/fasterxml/jackson/core/jackson-core/2.3.3/jackson-core-2.3.3.pom
Progress (1): 2.2/6.0 kBProgress (1): 5.0/6.0 kBProgress (1): 6.0 kB Downloaded from central: https://repo.maven.apache.org/maven2/com/fasterxml/jackson/core/jackson-core/2.3.3/jackson-core-2.3.3.pom (6.0 kB at 497 kB/s)
[INFO] ------------------------------------------------------------------------
[INFO] Reactor Summary for Apache Phoenix 4.16.0-HBase-1.5-SNAPSHOT:
[INFO]
[INFO] Apache Phoenix ..................................... SUCCESS [ 2.358 s]
[INFO] Phoenix Core ....................................... SUCCESS [ 02:47 h]
[INFO] Phoenix - Pherf .................................... SUCCESS [03:58 min]
[INFO] Phoenix Client ..................................... SUCCESS [05:20 min]
[INFO] Phoenix Server ..................................... SUCCESS [ 17.079 s]
[INFO] Phoenix Assembly ................................... SUCCESS [ 33.115 s]
[INFO] Phoenix - Tracing Web Application .................. FAILURE [ 17.146 s]
[INFO] ------------------------------------------------------------------------
[INFO] BUILD FAILURE
[INFO] ------------------------------------------------------------------------
[INFO] Total time: 02:57 h
[INFO] Finished at: 2020-02-13T22:39:12Z
[INFO] ------------------------------------------------------------------------
[ERROR] Failed to execute goal com.github.searls:jasmine-maven-plugin:1.3.1.6:test (default) on project phoenix-tracing-webapp: Execution default of goal com.github.searls:jasmine-maven-plugin:1.3.1.6:test failed: Plugin com.github.searls:jasmine-maven-plugin:1.3.1.6 or one of its dependencies could not be resolved: Failed to collect dependencies at com.github.searls:jasmine-maven-plugin:jar:1.3.1.6 -> org.seleniumhq.selenium:selenium-java:jar:2.45.0 -> org.seleniumhq.selenium:selenium-htmlunit-driver:jar:2.45.0 -> net.sourceforge.htmlunit:htmlunit:jar:2.15 -> net.sourceforge.cssparser:cssparser:jar:0.9.14: Failed to read artifact descriptor for net.sourceforge.cssparser:cssparser:jar:0.9.14: Could not transfer artifact net.sourceforge.cssparser:cssparser:pom:0.9.14 from/to central (https://repo.maven.apache.org/maven2): /home/jenkins/.m2/repository/net/sourceforge/cssparser/cssparser/0.9.14/cssparser-0.9.14.pom.part.lock (No such file or directory) -> [Help 1]
[ERROR]
[ERROR] To see the full stack trace of the errors, re-run Maven with the -e switch.
[ERROR] Re-run Maven using the -X switch to enable full debug logging.
[ERROR]
[ERROR] For more information about the errors and possible solutions, please read the following articles:
[ERROR] [Help 1] http://cwiki.apache.org/confluence/display/MAVEN/PluginResolutionException
[ERROR]
[ERROR] After correcting the problems, you can resume the build with the command
[ERROR] mvn <args> -rf :phoenix-tracing-webapp
Build step 'Invoke top-level Maven targets' marked build as failure
[JIRA] Updating issue PHOENIX-5714
Recording test results