You are viewing a plain text version of this content. The canonical link for it is here.
Posted to commits@myfaces.apache.org by Apache Jenkins Server <je...@builds.apache.org> on 2014/02/24 01:20:16 UTC

Build failed in Jenkins: myfaces-shared #378

See <https://builds.apache.org/job/myfaces-shared/378/>

------------------------------------------
Started by timer
Building remotely on windows2 in workspace <https://builds.apache.org/job/myfaces-shared/ws/>
Updating http://svn.apache.org/repos/asf/myfaces/shared/trunk at revision '2014-02-23T16:19:46.036 -0800'
At revision 1571119
no change for http://svn.apache.org/repos/asf/myfaces/shared/trunk since the previous build
Parsing POMs
maven31-agent.jar already up to date
maven31-interceptor.jar already up to date
maven3-interceptor-commons.jar already up to date
[trunk] $ f:\jenkins\tools\java\latest-1.6-64/bin/java -cp f:\jenkins\jenkins-slave\maven31-agent.jar;f:\jenkins\tools\maven\latest\boot\plexus-classworlds-2.5.1.jar;f:\jenkins\tools\maven\latest/conf/logging jenkins.maven3.agent.Maven31Main f:\jenkins\tools\maven\latest F:\jenkins\jenkins-slave\slave.jar f:\jenkins\jenkins-slave\maven31-interceptor.jar f:\jenkins\jenkins-slave\maven3-interceptor-commons.jar 56938
<===[JENKINS REMOTING CAPACITY]===>   channel started
log4j:WARN No appenders could be found for logger (org.apache.commons.beanutils.converters.BooleanConverter).
log4j:WARN Please initialize the log4j system properly.
Executing Maven:  -B -f <https://builds.apache.org/job/myfaces-shared/ws/trunk\pom.xml> -Dmaven.repo.local=f:\jenkins\jenkins-slave\maven-repositories\1 clean install deploy
[INFO] Scanning for projects...
[INFO] ------------------------------------------------------------------------
[INFO] Reactor Build Order:
[INFO] 
[INFO] Apache MyFaces Shared For JSF 2.2 - Project
[INFO] Apache MyFaces Shared For JSF 2.2 - Core Mirror
[INFO] MyFaces Shared Tomahawk
[INFO]                                                                         
[INFO] ------------------------------------------------------------------------
[INFO] Building Apache MyFaces Shared For JSF 2.2 - Project 4.2.2-SNAPSHOT
[INFO] ------------------------------------------------------------------------
[INFO] Downloading: http://repo.maven.apache.org/maven2/org/apache/geronimo/specs/geronimo-el_2.2_spec/1.0.1/geronimo-el_2.2_spec-1.0.1.pom
[INFO] Downloaded: http://repo.maven.apache.org/maven2/org/apache/geronimo/specs/geronimo-el_2.2_spec/1.0.1/geronimo-el_2.2_spec-1.0.1.pom (4 KB at 16.1 KB/sec)
[INFO] Downloading: http://repo.maven.apache.org/maven2/org/apache/geronimo/specs/geronimo-el_2.2_spec/1.0.1/geronimo-el_2.2_spec-1.0.1.jar
[INFO] Downloaded: http://repo.maven.apache.org/maven2/org/apache/geronimo/specs/geronimo-el_2.2_spec/1.0.1/geronimo-el_2.2_spec-1.0.1.jar (47 KB at 426.6 KB/sec)
[INFO] 
[INFO] --- maven-clean-plugin:2.4.1:clean (default-clean) @ myfaces-shared-project ---
[INFO] 
[INFO] --- maven-remote-resources-plugin:1.2.1:process (default) @ myfaces-shared-project ---
[INFO] 
[INFO] --- maven-site-plugin:3.0:attach-descriptor (attach-descriptor) @ myfaces-shared-project ---
[INFO] 
[INFO] --- maven-checkstyle-plugin:2.6:check (verify-style) @ myfaces-shared-project ---
[INFO] 
[INFO] 
[INFO] --- maven-install-plugin:2.3.1:install (default-install) @ myfaces-shared-project ---
[INFO] Installing <https://builds.apache.org/job/myfaces-shared/ws/trunk\pom.xml> to f:\jenkins\jenkins-slave\maven-repositories\1\org\apache\myfaces\shared\myfaces-shared-project\4.2.2-SNAPSHOT\myfaces-shared-project-4.2.2-SNAPSHOT.pom
[INFO] Installing <https://builds.apache.org/job/myfaces-shared/ws/trunk\target\myfaces-shared-project-4.2.2-SNAPSHOT-site.xml> to f:\jenkins\jenkins-slave\maven-repositories\1\org\apache\myfaces\shared\myfaces-shared-project\4.2.2-SNAPSHOT\myfaces-shared-project-4.2.2-SNAPSHOT-site.xml
[INFO] 
[INFO] --- maven-remote-resources-plugin:1.2.1:process (default) @ myfaces-shared-project ---
[INFO] 
[INFO] --- maven-site-plugin:3.0:attach-descriptor (attach-descriptor) @ myfaces-shared-project ---
[INFO] 
[INFO] --- maven-checkstyle-plugin:2.6:check (verify-style) @ myfaces-shared-project ---
[INFO] 
[INFO] 
[INFO] --- maven-install-plugin:2.3.1:install (default-install) @ myfaces-shared-project ---
[INFO] Installing <https://builds.apache.org/job/myfaces-shared/ws/trunk\pom.xml> to f:\jenkins\jenkins-slave\maven-repositories\1\org\apache\myfaces\shared\myfaces-shared-project\4.2.2-SNAPSHOT\myfaces-shared-project-4.2.2-SNAPSHOT.pom
[INFO] Installing <https://builds.apache.org/job/myfaces-shared/ws/trunk\target\myfaces-shared-project-4.2.2-SNAPSHOT-site.xml> to f:\jenkins\jenkins-slave\maven-repositories\1\org\apache\myfaces\shared\myfaces-shared-project\4.2.2-SNAPSHOT\myfaces-shared-project-4.2.2-SNAPSHOT-site.xml
[INFO] 
[INFO] --- maven-deploy-plugin:2.6:deploy (default-deploy) @ myfaces-shared-project ---
[INFO] Downloading: https://repository.apache.org/content/repositories/snapshots/org/apache/myfaces/shared/myfaces-shared-project/4.2.2-SNAPSHOT/maven-metadata.xml
[INFO] Downloaded: https://repository.apache.org/content/repositories/snapshots/org/apache/myfaces/shared/myfaces-shared-project/4.2.2-SNAPSHOT/maven-metadata.xml (838 B at 1.4 KB/sec)
[INFO] Uploading: https://repository.apache.org/content/repositories/snapshots/org/apache/myfaces/shared/myfaces-shared-project/4.2.2-SNAPSHOT/myfaces-shared-project-4.2.2-20140224.002003-82.pom
[INFO] ------------------------------------------------------------------------
[INFO] Reactor Summary:
[INFO] 
[INFO] Apache MyFaces Shared For JSF 2.2 - Project ....... FAILURE [11.156s]
[INFO] Apache MyFaces Shared For JSF 2.2 - Core Mirror ... SKIPPED
[INFO] MyFaces Shared Tomahawk ........................... SKIPPED
[INFO] ------------------------------------------------------------------------
[INFO] BUILD FAILURE
[INFO] ------------------------------------------------------------------------
[INFO] Total time: 14.638s
[INFO] Finished at: Sun Feb 23 16:20:06 PST 2014
[INFO] Final Memory: 16M/61M
[INFO] ------------------------------------------------------------------------
[ERROR] Failed to execute goal org.apache.maven.plugins:maven-deploy-plugin:2.6:deploy (default-deploy) on project myfaces-shared-project: Failed to deploy artifacts: Could not transfer artifact org.apache.myfaces.shared:myfaces-shared-project:pom:4.2.2-20140224.002003-82 from/to apache.snapshots.https (https://repository.apache.org/content/repositories/snapshots): Failed to transfer file: https://repository.apache.org/content/repositories/snapshots/org/apache/myfaces/shared/myfaces-shared-project/4.2.2-SNAPSHOT/myfaces-shared-project-4.2.2-20140224.002003-82.pom. Return code is: 401, ReasonPhrase: Unauthorized. -> [Help 1]
[ERROR] 
[ERROR] To see the full stack trace of the errors, re-run Maven with the -e switch.
[ERROR] Re-run Maven using the -X switch to enable full debug logging.
[ERROR] 
[ERROR] For more information about the errors and possible solutions, please read the following articles:
[ERROR] [Help 1] http://cwiki.apache.org/confluence/display/MAVEN/MojoExecutionException
[JENKINS] Archiving F:\jenkins\jenkins-slave\workspace\myfaces-shared\trunk\shared-tomahawk\pom.xml to org.apache.myfaces.shared/myfaces-shared-tomahawk/4.2.2-SNAPSHOT/myfaces-shared-tomahawk-4.2.2-SNAPSHOT.pom
[JENKINS] Archiving F:\jenkins\jenkins-slave\workspace\myfaces-shared\trunk\core\pom.xml to org.apache.myfaces.shared/myfaces-shared-core/4.2.2-SNAPSHOT/myfaces-shared-core-4.2.2-SNAPSHOT.pom
[JENKINS] Archiving <https://builds.apache.org/job/myfaces-shared/ws/trunk\pom.xml> to org.apache.myfaces.shared/myfaces-shared-project/4.2.2-SNAPSHOT/myfaces-shared-project-4.2.2-SNAPSHOT.pom
[JENKINS] Archiving <https://builds.apache.org/job/myfaces-shared/ws/trunk\target\myfaces-shared-project-4.2.2-SNAPSHOT-site.xml> to org.apache.myfaces.shared/myfaces-shared-project/4.2.2-SNAPSHOT/myfaces-shared-project-4.2.2-SNAPSHOT-site.xml
channel stopped

Jenkins build is back to normal : myfaces-shared #379

Posted by Apache Jenkins Server <je...@builds.apache.org>.
See <https://builds.apache.org/job/myfaces-shared/379/changes>