You are viewing a plain text version of this content. The canonical link for it is here.
Posted to builds@solr.apache.org by Apache Jenkins Server <je...@builds.apache.org> on 2026/08/08 02:19:30 UTC
[JENKINS] Solr » Solr-Test-10.x - Build # 2121 - Unstable!
Build: https://ci-builds.apache.org/job/Solr/job/Solr-Test-10.x/2121/
1 tests failed.
FAILED: org.apache.solr.search.TestIntervalsQParserPlugin.testIntervalsRegexpRule
Error Message:
java.lang.RuntimeException: mismatch: '60'!='61' @ response/docs/[0]/id
Stack Trace:
java.lang.RuntimeException: mismatch: '60'!='61' @ response/docs/[0]/id
at __randomizedtesting.SeedInfo.seed([1E41B9646E3C9E70:E17A612A4F086DDC]:0)
at org.apache.solr.SolrTestCaseJ4.assertJQ(SolrTestCaseJ4.java:993)
at org.apache.solr.SolrTestCaseJ4.assertJJQ(SolrTestCaseJ4.java:928)
at org.apache.solr.search.TestIntervalsQParserPlugin.testIntervalsRegexpRule(TestIntervalsQParserPlugin.java:164)
at java.base/jdk.internal.reflect.DirectMethodHandleAccessor.invoke(DirectMethodHandleAccessor.java:103)
at java.base/java.lang.reflect.Method.invoke(Method.java:580)
at com.carrotsearch.randomizedtesting.RandomizedRunner.invoke(RandomizedRunner.java:1780)
at com.carrotsearch.randomizedtesting.RandomizedRunner$8.evaluate(RandomizedRunner.java:959)
at com.carrotsearch.randomizedtesting.RandomizedRunner$9.evaluate(RandomizedRunner.java:995)
at com.carrotsearch.randomizedtesting.RandomizedRunner$10.evaluate(RandomizedRunner.java:1009)
at com.carrotsearch.randomizedtesting.rules.SystemPropertiesRestoreRule$1.evaluate(SystemPropertiesRestoreRule.java:80)
at org.junit.rules.RunRules.evaluate(RunRules.java:20)
at org.apache.lucene.tests.util.TestRuleSetupTeardownChained$1.evaluate(TestRuleSetupTeardownChained.java:48)
at org.apache.lucene.tests.util.AbstractBeforeAfterRule$1.evaluate(AbstractBeforeAfterRule.java:43)
at org.apache.lucene.tests.util.TestRuleThreadAndTestName$1.evaluate(TestRuleThreadAndTestName.java:45)
at org.apache.lucene.tests.util.TestRuleIgnoreAfterMaxFailures$1.evaluate(TestRuleIgnoreAfterMaxFailures.java:60)
at org.apache.lucene.tests.util.TestRuleMarkFailure$1.evaluate(TestRuleMarkFailure.java:44)
at org.junit.rules.RunRules.evaluate(RunRules.java:20)
at com.carrotsearch.randomizedtesting.rules.StatementAdapter.evaluate(StatementAdapter.java:36)
at com.carrotsearch.randomizedtesting.ThreadLeakControl$StatementRunner.run(ThreadLeakControl.java:390)
at com.carrotsearch.randomizedtesting.ThreadLeakControl.forkTimeoutingTask(ThreadLeakControl.java:843)
at com.carrotsearch.randomizedtesting.ThreadLeakControl$3.evaluate(ThreadLeakControl.java:490)
at com.carrotsearch.randomizedtesting.RandomizedRunner.runSingleTest(RandomizedRunner.java:968)
at com.carrotsearch.randomizedtesting.RandomizedRunner$5.evaluate(RandomizedRunner.java:853)
at com.carrotsearch.randomizedtesting.RandomizedRunner$6.evaluate(RandomizedRunner.java:904)
at com.carrotsearch.randomizedtesting.RandomizedRunner$7.evaluate(RandomizedRunner.java:915)
at com.carrotsearch.randomizedtesting.rules.StatementAdapter.evaluate(StatementAdapter.java:36)
at com.carrotsearch.randomizedtesting.rules.StatementAdapter.evaluate(StatementAdapter.java:36)
at org.apache.lucene.tests.util.AbstractBeforeAfterRule$1.evaluate(AbstractBeforeAfterRule.java:43)
at com.carrotsearch.randomizedtesting.rules.SystemPropertiesRestoreRule$1.evaluate(SystemPropertiesRestoreRule.java:80)
at org.junit.rules.RunRules.evaluate(RunRules.java:20)
at org.apache.lucene.tests.util.AbstractBeforeAfterRule$1.evaluate(AbstractBeforeAfterRule.java:43)
at com.carrotsearch.randomizedtesting.rules.StatementAdapter.evaluate(StatementAdapter.java:36)
at org.apache.lucene.tests.util.TestRuleStoreClassName$1.evaluate(TestRuleStoreClassName.java:38)
at com.carrotsearch.randomizedtesting.rules.NoShadowingOrOverridesOnMethodsRule$1.evaluate(NoShadowingOrOverridesOnMethodsRule.java:40)
at com.carrotsearch.randomizedtesting.rules.NoShadowingOrOverridesOnMethodsRule$1.evaluate(NoShadowingOrOverridesOnMethodsRule.java:40)
at com.carrotsearch.randomizedtesting.rules.StatementAdapter.evaluate(StatementAdapter.java:36)
at com.carrotsearch.randomizedtesting.rules.StatementAdapter.evaluate(StatementAdapter.java:36)
at org.apache.lucene.tests.util.TestRuleAssertionsRequired$1.evaluate(TestRuleAssertionsRequired.java:53)
at org.apache.lucene.tests.util.AbstractBeforeAfterRule$1.evaluate(AbstractBeforeAfterRule.java:43)
at org.apache.lucene.tests.util.TestRuleMarkFailure$1.evaluate(TestRuleMarkFailure.java:44)
at org.apache.lucene.tests.util.TestRuleIgnoreAfterMaxFailures$1.evaluate(TestRuleIgnoreAfterMaxFailures.java:60)
at org.apache.lucene.tests.util.TestRuleIgnoreTestSuites$1.evaluate(TestRuleIgnoreTestSuites.java:47)
at org.junit.rules.RunRules.evaluate(RunRules.java:20)
at com.carrotsearch.randomizedtesting.rules.StatementAdapter.evaluate(StatementAdapter.java:36)
at com.carrotsearch.randomizedtesting.ThreadLeakControl$StatementRunner.run(ThreadLeakControl.java:390)
at com.carrotsearch.randomizedtesting.ThreadLeakControl.lambda$forkTimeoutingTask$0(ThreadLeakControl.java:850)
at java.base/java.lang.Thread.run(Thread.java:1583)
Build Log:
[...truncated 11 lines...]
ERROR: Workspace has a .git repository, but it appears to be corrupt.
hudson.plugins.git.GitException: Command "git rev-parse --resolve-git-dir /home/jenkins/jenkins-agent/workspace/Solr/Solr-Test-10.x/.git" returned status code 128:
stdout:
stderr: fatal: not a gitdir '/home/jenkins/jenkins-agent/workspace/Solr/Solr-Test-10.x/.git'
at PluginClassLoader for git-client//org.jenkinsci.plugins.gitclient.CliGitAPIImpl.launchCommandIn(CliGitAPIImpl.java:2848)
at PluginClassLoader for git-client//org.jenkinsci.plugins.gitclient.CliGitAPIImpl.launchCommandIn(CliGitAPIImpl.java:2768)
at PluginClassLoader for git-client//org.jenkinsci.plugins.gitclient.CliGitAPIImpl.launchCommandIn(CliGitAPIImpl.java:2763)
at PluginClassLoader for git-client//org.jenkinsci.plugins.gitclient.CliGitAPIImpl.launchCommand(CliGitAPIImpl.java:2052)
at PluginClassLoader for git-client//org.jenkinsci.plugins.gitclient.CliGitAPIImpl.launchCommand(CliGitAPIImpl.java:2064)
at PluginClassLoader for git-client//org.jenkinsci.plugins.gitclient.CliGitAPIImpl.hasGitRepo(CliGitAPIImpl.java:404)
at PluginClassLoader for git-client//hudson.plugins.git.GitAPI.hasGitRepo(GitAPI.java:281)
at jdk.internal.reflect.GeneratedMethodAccessor33.invoke(Unknown Source)
at java.base/jdk.internal.reflect.DelegatingMethodAccessorImpl.invoke(DelegatingMethodAccessorImpl.java:43)
at java.base/java.lang.reflect.Method.invoke(Method.java:569)
at hudson.remoting.RemoteInvocationHandler$RPCRequest.perform(RemoteInvocationHandler.java:986)
at hudson.remoting.RemoteInvocationHandler$RPCRequest.call(RemoteInvocationHandler.java:961)
at hudson.remoting.RemoteInvocationHandler$RPCRequest.call(RemoteInvocationHandler.java:907)
at hudson.remoting.UserRequest.perform(UserRequest.java:225)
at hudson.remoting.UserRequest.perform(UserRequest.java:50)
at hudson.remoting.Request$2.run(Request.java:391)
at hudson.remoting.InterceptingExecutorService.lambda$wrap$0(InterceptingExecutorService.java:81)
at java.base/java.util.concurrent.FutureTask.run(FutureTask.java:264)
at java.base/java.util.concurrent.ThreadPoolExecutor.runWorker(ThreadPoolExecutor.java:1136)
at java.base/java.util.concurrent.ThreadPoolExecutor$Worker.run(ThreadPoolExecutor.java:635)
at java.base/java.lang.Thread.run(Thread.java:840)
Cloning the remote Git repository
Cloning repository https://gitbox.apache.org/repos/asf/solr.git
> git init /home/jenkins/jenkins-agent/workspace/Solr/Solr-Test-10.x # timeout=10
Fetching upstream changes from https://gitbox.apache.org/repos/asf/solr.git
> git --version # timeout=10
> git --version # 'git version 2.43.0'
> git fetch --tags --force --progress -- https://gitbox.apache.org/repos/asf/solr.git +refs/heads/*:refs/remotes/origin/* # timeout=10
> git config remote.origin.url https://gitbox.apache.org/repos/asf/solr.git # timeout=10
> git config --add remote.origin.fetch +refs/heads/*:refs/remotes/origin/* # timeout=10
Avoid second fetch
> git rev-parse refs/remotes/origin/branch_10x^{commit} # timeout=10
Checking out Revision d451fbf3aab7bc45e87651cbf4d524f41641d0ba (refs/remotes/origin/branch_10x)
> git config core.sparsecheckout # timeout=10
> git checkout -f d451fbf3aab7bc45e87651cbf4d524f41641d0ba # timeout=10
> git branch -a -v --no-abbrev # timeout=10
> git checkout -b branch_10x d451fbf3aab7bc45e87651cbf4d524f41641d0ba # timeout=10
Commit message: "SOLR-17697: Refactor AuthTool: extract AuthParams and parser-independent command methods (#4688)"
> git rev-list --no-walk d451fbf3aab7bc45e87651cbf4d524f41641d0ba # timeout=10
No emails were triggered.
provisioning config files...
copy managed file [gradle.properties] to file:/home/jenkins/jenkins-agent/workspace/Solr/Solr-Test-10.x/gradle.properties
[Gradle] - Launching build.
[Solr-Test-10.x] $ /home/jenkins/jenkins-agent/workspace/Solr/Solr-Test-10.x/gradlew -Dtests.haltonfailure=false -Dtests.badapples=false --continue test
Downloading gradle-wrapper.jar from https://raw.githubusercontent.com/gradle/gradle/v8.10.2/gradle/wrapper/gradle-wrapper.jar
To honour the JVM settings for this build a single-use Daemon process will be forked. For more on this, please refer to https://docs.gradle.org/9.6.0/userguide/gradle_daemon.html#sec:disabling_the_daemon in the Gradle documentation.
Daemon will be stopped at the end of the build
> Task :build-infra:compileJava
Note: /home/jenkins/jenkins-agent/workspace/Solr/Solr-Test-10.x/build-tools/build-infra/src/main/java/org/apache/lucene/gradle/Checksum.java uses or overrides a deprecated API.
Note: Recompile with -Xlint:deprecation for details.
> Task :build-infra:pluginDescriptors
> Task :build-infra:processResources
> Task :build-infra:classes
> Task :build-infra:jar
> Task :gitStatus
> Task :checkJdkInternalsExportedToGradle
> Task :solr:api:compileJava
Note: Some input files use or override a deprecated API.
Note: Recompile with -Xlint:deprecation for details.
> Task :solr:api:processResources NO-SOURCE
> Task :solr:api:classes
> Task :solr:api:jar
> Task :randomizationInfo
Running tests with randomization seed: tests.seed=1E41B9646E3C9E70
> Task :solr:api:resolve
SLF4J(W): No SLF4J providers were found.
SLF4J(W): Defaulting to no-operation (NOP) logger implementation
SLF4J(W): See https://www.slf4j.org/codes.html#noProviders for further details.
> Task :solr:api:processTestResources
> Task :solr:core:processResources
> Task :solr:solrj:processResources
> Task :solr:solrj-jetty:processResources NO-SOURCE
> Task :solr:solrj-streaming:processResources
> Task :solr:solrj-zookeeper:processResources NO-SOURCE
> Task :solr:test-framework:processResources
> Task :solr:benchmark:processResources
> Task :solr:benchmark:processTestResources
> Task :solr:core:processTestResources
> Task :solr:modules:analysis-extras:processResources NO-SOURCE
> Task :solr:cross-dc-manager:processResources NO-SOURCE
> Task :solr:cross-dc-manager:processTestResources
> Task :solr:modules:cross-dc:processResources NO-SOURCE
> Task :solr:modules:opentelemetry:processResources NO-SOURCE
> Task :solr:server:compileJava SKIPPED
> Task :solr:server:processResources NO-SOURCE
> Task :solr:server:classes UP-TO-DATE
> Task :solr:server:compileTestJava NO-SOURCE
> Task :solr:server:processTestResources NO-SOURCE
> Task :solr:server:testClasses UP-TO-DATE
> Task :solr:server:test NO-SOURCE
> Task :solr:server:wipeTaskTemp
> Task :solr:solr-ref-guide:compileJava NO-SOURCE
> Task :solr:solr-ref-guide:processResources NO-SOURCE
> Task :solr:solr-ref-guide:classes UP-TO-DATE
> Task :solr:solr-ref-guide:copySolrjTestResources
> Task :solr:solr-ref-guide:processTestResources NO-SOURCE
> Task :solr:modules:sql:processResources
> Task :solr:solrj:processTestResources
> Task :solr:solrj-jetty:processTestResources
> Task :solr:solrj-streaming:processTestResources
> Task :solr:solrj-zookeeper:processTestResources
> Task :solr:test-framework:processTestResources
> Task :solr:webapp:processResources NO-SOURCE
> Task :solr:webapp:processTestResources NO-SOURCE
> Task :solr:modules:analysis-extras:processTestResources
> Task :solr:modules:clustering:processResources NO-SOURCE
> Task :solr:modules:clustering:processTestResources
> Task :solr:modules:cross-dc:processTestResources
> Task :solr:modules:cuvs:processResources NO-SOURCE
> Task :solr:modules:cuvs:processTestResources
> Task :solr:modules:extraction:processResources
> Task :solr:modules:extraction:processTestResources
> Task :solr:modules:gcs-repository:processResources NO-SOURCE
> Task :solr:modules:gcs-repository:processTestResources
> Task :solr:modules:jwt-auth:processResources NO-SOURCE
> Task :solr:modules:jwt-auth:processTestResources
> Task :solr:modules:langid:processResources NO-SOURCE
> Task :solr:modules:langid:processTestResources
> Task :solr:modules:language-models:processResources NO-SOURCE
> Task :solr:modules:language-models:processTestResources
> Task :solr:modules:ltr:processResources NO-SOURCE
> Task :solr:modules:ltr:processTestResources
> Task :solr:modules:opentelemetry:processTestResources
> Task :solr:modules:s3-repository:processResources NO-SOURCE
> Task :solr:modules:s3-repository:processTestResources
> Task :solr:modules:scripting:processResources NO-SOURCE
> Task :solr:modules:scripting:processTestResources
> Task :solr:modules:sql:copySolrCoreTestResources
> Task :solr:modules:sql:processTestResources
> Task :solr:solrj:openApiGenerate
Cleaned up output directory /home/jenkins/jenkins-agent/workspace/Solr/Solr-Test-10.x/solr/solrj/build/generated before code generation.
[openApiGenerate] Worker isolation: classloader (fast startup, but generator classes accumulate in Gradle daemon Metaspace - consider workerIsolation = "process" if you hit metaspace pressure)
No application/json content media type found in response. Response examples can currently only be generated for application/json media type.
############################################################################################
# Thanks for using OpenAPI Generator. #
# We appreciate your support! Please consider donation to help us maintain this project. #
# https://opencollective.com/openapi_generator/donate #
############################################################################################
Successfully generated code to /home/jenkins/jenkins-agent/workspace/Solr/Solr-Test-10.x/solr/solrj/build/generated
> Task :solr:solrj:generatedSpotlessHelper
> Task :solr:solrj:generatedSpotless
> Task :solr:solrj:compileJava
Note: Some input files use or override a deprecated API.
Note: Recompile with -Xlint:deprecation for details.
> Task :solr:solrj-jetty:compileJava
Note: /home/jenkins/jenkins-agent/workspace/Solr/Solr-Test-10.x/solr/solrj-jetty/src/java/org/apache/solr/client/solrj/jetty/HttpJettySolrClient.java uses or overrides a deprecated API.
Note: Recompile with -Xlint:deprecation for details.
> Task :solr:solrj-streaming:compileJava
Note: Some input files use or override a deprecated API.
Note: Recompile with -Xlint:deprecation for details.
> Task :solr:solrj-zookeeper:compileJava
Note: Some input files use or override a deprecated API.
Note: Recompile with -Xlint:deprecation for details.
> Task :solr:core:compileJava
Note: Some input files use or override a deprecated API.
Note: Recompile with -Xlint:deprecation for details.
> Task :solr:test-framework:compileJava
Note: Some input files use or override a deprecated API.
Note: Recompile with -Xlint:deprecation for details.
> Task :solr:api:compileTestJava
> Task :solr:api:testClasses
> Task :solr:core:classes
> Task :solr:core:jar
> Task :solr:solrj:classes
> Task :solr:solrj:jar
> Task :solr:solrj-jetty:classes
> Task :solr:solrj-jetty:jar
> Task :solr:solrj-streaming:classes
> Task :solr:solrj-streaming:jar
> Task :solr:solrj-zookeeper:classes
> Task :solr:solrj-zookeeper:jar
> Task :solr:test-framework:classes
> Task :solr:test-framework:jar
> Task :solr:api:test
WARNING: Using incubator modules: jdk.incubator.vector
WARNING: Using incubator modules: jdk.incubator.vector
WARNING: A command line option has enabled the Security Manager
WARNING: The Security Manager is deprecated and will be removed in a future release
WARNING: A command line option has enabled the Security Manager
WARNING: The Security Manager is deprecated and will be removed in a future release
java.security.policy: error adding Permission, java.net.URLPermission:
java.util.ServiceConfigurationError: Locale provider adapter "CLDR"cannot be instantiated.
java.security.policy: error adding Permission, java.net.URLPermission:
java.util.ServiceConfigurationError: Locale provider adapter "CLDR"cannot be instantiated.
java.security.policy: error adding Permission, java.net.URLPermission:
java.util.ServiceConfigurationError: Locale provider adapter "CLDR"cannot be instantiated.
java.security.policy: error adding Permission, java.net.URLPermission:
java.util.ServiceConfigurationError: Locale provider adapter "CLDR"cannot be instantiated.
java.security.policy: error adding Permission, java.net.URLPermission:
java.util.ServiceConfigurationError: Locale provider adapter "CLDR"cannot be instantiated.
java.security.policy: error adding Permission, java.net.URLPermission:
java.util.ServiceConfigurationError: Locale provider adapter "CLDR"cannot be instantiated.
java.security.policy: error adding Permission, java.net.URLPermission:
java.util.ServiceConfigurationError: Locale provider adapter "CLDR"cannot be instantiated.
java.security.policy: error adding Permission, java.net.URLPermission:
java.util.ServiceConfigurationError: Locale provider adapter "CLDR"cannot be instantiated.
java.security.policy: error adding Permission, java.net.URLPermission:
java.util.ServiceConfigurationError: Locale provider adapter "CLDR"cannot be instantiated.
java.security.policy: error adding Permission, java.net.URLPermission:
java.util.ServiceConfigurationError: Locale provider adapter "CLDR"cannot be instantiated.
:solr:api:test (SUCCESS): 19 test(s)
> Task :solr:api:wipeTaskTemp
> Task :solr:benchmark:compileJava
Note: /home/jenkins/jenkins-agent/workspace/Solr/Solr-Test-10.x/solr/benchmark/src/java/org/apache/solr/bench/lifecycle/SolrStartup.java uses or overrides a deprecated API.
Note: Recompile with -Xlint:deprecation for details.
> Task :solr:benchmark:classes
> Task :solr:benchmark:compileTestJava
> Task :solr:benchmark:testClasses
> Task :solr:benchmark:test
WARNING: Using incubator modules: jdk.incubator.vector
WARNING: Using incubator modules: jdk.incubator.vector
WARNING: Using incubator modules: jdk.incubator.vector
WARNING: A command line option has enabled the Security Manager
WARNING: The Security Manager is deprecated and will be removed in a future release
WARNING: A command line option has enabled the Security Manager
WARNING: The Security Manager is deprecated and will be removed in a future release
WARNING: A command line option has enabled the Security Manager
WARNING: The Security Manager is deprecated and will be removed in a future release
java.security.policy: error adding Permission, java.net.URLPermission:
java.util.ServiceConfigurationError: Locale provider adapter "CLDR"cannot be instantiated.
java.security.policy: error adding Permission, java.net.URLPermission:
java.util.ServiceConfigurationError: Locale provider adapter "CLDR"cannot be instantiated.
java.security.policy: error adding Permission, java.net.URLPermission:
java.util.ServiceConfigurationError: Locale provider adapter "CLDR"cannot be instantiated.
java.security.policy: error adding Permission, java.net.URLPermission:
java.util.ServiceConfigurationError: Locale provider adapter "CLDR"cannot be instantiated.
java.security.policy: error adding Permission, java.net.URLPermission:
java.util.ServiceConfigurationError: Locale provider adapter "CLDR"cannot be instantiated.
java.security.policy: error adding Permission, java.net.URLPermission:
java.util.ServiceConfigurationError: Locale provider adapter "CLDR"cannot be instantiated.
java.security.policy: error adding Permission, java.net.URLPermission:
java.util.ServiceConfigurationError: Locale provider adapter "CLDR"cannot be instantiated.
java.security.policy: error adding Permission, java.net.URLPermission:
java.util.ServiceConfigurationError: Locale provider adapter "CLDR"cannot be instantiated.
java.security.policy: error adding Permission, java.net.URLPermission:
java.util.ServiceConfigurationError: Locale provider adapter "CLDR"cannot be instantiated.
java.security.policy: error adding Permission, java.net.URLPermission:
java.util.ServiceConfigurationError: Locale provider adapter "CLDR"cannot be instantiated.
java.security.policy: error adding Permission, java.net.URLPermission:
java.security.policy: error adding Permission, java.net.URLPermission:
java.util.ServiceConfigurationError: Locale provider adapter "CLDR"cannot be instantiated.
java.util.ServiceConfigurationError: Locale provider adapter "CLDR"cannot be instantiated.
java.security.policy: error adding Permission, java.net.URLPermission:
java.util.ServiceConfigurationError: Locale provider adapter "CLDR"cannot be instantiated.
java.security.policy: error adding Permission, java.net.URLPermission:
java.util.ServiceConfigurationError: Locale provider adapter "CLDR"cannot be instantiated.
java.security.policy: error adding Permission, java.net.URLPermission:
java.util.ServiceConfigurationError: Locale provider adapter "CLDR"cannot be instantiated.
:solr:benchmark:test (SUCCESS): 10 test(s)
> Task :solr:benchmark:wipeTaskTemp
> Task :solr:core:compileTestJava
Note: Some input files use or override a deprecated API.
Note: Recompile with -Xlint:deprecation for details.
> Task :solr:core:testClasses
> Task :solr:modules:analysis-extras:compileJava
Note: /home/jenkins/jenkins-agent/workspace/Solr/Solr-Test-10.x/solr/modules/analysis-extras/src/java/org/apache/solr/schema/ICUCollationField.java uses or overrides a deprecated API.
Note: Recompile with -Xlint:deprecation for details.
> Task :solr:modules:analysis-extras:classes
> Task :solr:modules:analysis-extras:jar
> Task :solr:core:test
WARNING: Using incubator modules: jdk.incubator.vector
WARNING: Using incubator modules: jdk.incubator.vector
WARNING: Using incubator modules: jdk.incubator.vector
WARNING: Using incubator modules: jdk.incubator.vector
WARNING: A command line option has enabled the Security Manager
WARNING: The Security Manager is deprecated and will be removed in a future release
WARNING: A command line option has enabled the Security Manager
WARNING: The Security Manager is deprecated and will be removed in a future release
WARNING: A command line option has enabled the Security Manager
WARNING: The Security Manager is deprecated and will be removed in a future release
WARNING: A command line option has enabled the Security Manager
WARNING: The Security Manager is deprecated and will be removed in a future release
java.security.policy: error adding Permission, java.net.URLPermission:
java.security.policy: error adding Permission, java.net.URLPermission:
java.util.ServiceConfigurationError: Locale provider adapter "CLDR"cannot be instantiated.
java.security.policy: error adding Permission, java.net.URLPermission:
java.util.ServiceConfigurationError: Locale provider adapter "CLDR"cannot be instantiated.
java.util.ServiceConfigurationError: Locale provider adapter "CLDR"cannot be instantiated.
java.security.policy: error adding Permission, java.net.URLPermission:
java.util.ServiceConfigurationError: Locale provider adapter "CLDR"cannot be instantiated.
java.security.policy: error adding Permission, java.net.URLPermission:
java.util.ServiceConfigurationError: Locale provider adapter "CLDR"cannot be instantiated.
java.security.policy: error adding Permission, java.net.URLPermission:
java.util.ServiceConfigurationError: Locale provider adapter "CLDR"cannot be instantiated.
java.security.policy: error adding Permission, java.net.URLPermission:
java.util.ServiceConfigurationError: Locale provider adapter "CLDR"cannot be instantiated.
java.security.policy: error adding Permission, java.net.URLPermission:
java.util.ServiceConfigurationError: Locale provider adapter "CLDR"cannot be instantiated.
java.security.policy: error adding Permission, java.net.URLPermission:
java.util.ServiceConfigurationError: Locale provider adapter "CLDR"cannot be instantiated.
java.security.policy: error adding Permission, java.net.URLPermission:
java.security.policy: error adding Permission, java.net.URLPermission:
java.util.ServiceConfigurationError: Locale provider adapter "CLDR"cannot be instantiated.
java.util.ServiceConfigurationError: Locale provider adapter "CLDR"cannot be instantiated.
java.security.policy: error adding Permission, java.net.URLPermission:
java.security.policy: error adding Permission, java.net.URLPermission:
java.util.ServiceConfigurationError: Locale provider adapter "CLDR"cannot be instantiated.
java.util.ServiceConfigurationError: Locale provider adapter "CLDR"cannot be instantiated.
java.security.policy: error adding Permission, java.net.URLPermission:
java.util.ServiceConfigurationError: Locale provider adapter "CLDR"cannot be instantiated.
java.security.policy: error adding Permission, java.net.URLPermission:
java.util.ServiceConfigurationError: Locale provider adapter "CLDR"cannot be instantiated.
java.security.policy: error adding Permission, java.net.URLPermission:
java.util.ServiceConfigurationError: Locale provider adapter "CLDR"cannot be instantiated.
java.security.policy: error adding Permission, java.net.URLPermission:
java.util.ServiceConfigurationError: Locale provider adapter "CLDR"cannot be instantiated.
java.security.policy: error adding Permission, java.net.URLPermission:
java.util.ServiceConfigurationError: Locale provider adapter "CLDR"cannot be instantiated.
java.security.policy: error adding Permission, java.net.URLPermission:
java.util.ServiceConfigurationError: Locale provider adapter "CLDR"cannot be instantiated.
java.security.policy: error adding Permission, java.net.URLPermission:
java.util.ServiceConfigurationError: Locale provider adapter "CLDR"cannot be instantiated.
WARNING: Test org.apache.solr.TestRandomDVFaceting wrote 10,741,791 bytes of output.
WARNING: Test org.apache.solr.TestRandomFaceting wrote 27,351,081 bytes of output.
WARNING: Test org.apache.solr.cloud.TestStressCloudBlindAtomicUpdates wrote 16,315,171 bytes of output.
WARNING: Test org.apache.solr.cloud.TestRandomFlRTGCloud wrote 15,822,111 bytes of output.
[599.022s][warning][jfr,system] Could not initialize JDK events. access denied ("java.lang.RuntimePermission" "accessClassInPackage.jdk.internal.event")
[691.001s][warning][jfr,system] Could not initialize JDK events. access denied ("java.lang.RuntimePermission" "accessClassInPackage.jdk.internal.event")
> Task :solr:core:test
TestIntervalsQParserPlugin > testIntervalsRegexpRule FAILED
java.lang.RuntimeException: mismatch: '60'!='61' @ response/docs/[0]/id
at __randomizedtesting.SeedInfo.seed([1E41B9646E3C9E70:E17A612A4F086DDC]:0)
at org.apache.solr.SolrTestCaseJ4.assertJQ(SolrTestCaseJ4.java:993)
at org.apache.solr.SolrTestCaseJ4.assertJJQ(SolrTestCaseJ4.java:928)
at org.apache.solr.search.TestIntervalsQParserPlugin.testIntervalsRegexpRule(TestIntervalsQParserPlugin.java:164)
at java.base/jdk.internal.reflect.DirectMethodHandleAccessor.invoke(DirectMethodHandleAccessor.java:103)
at java.base/java.lang.reflect.Method.invoke(Method.java:580)
at com.carrotsearch.randomizedtesting.RandomizedRunner.invoke(RandomizedRunner.java:1780)
at com.carrotsearch.randomizedtesting.RandomizedRunner$8.evaluate(RandomizedRunner.java:959)
at com.carrotsearch.randomizedtesting.RandomizedRunner$9.evaluate(RandomizedRunner.java:995)
at com.carrotsearch.randomizedtesting.RandomizedRunner$10.evaluate(RandomizedRunner.java:1009)
at com.carrotsearch.randomizedtesting.rules.SystemPropertiesRestoreRule$1.evaluate(SystemPropertiesRestoreRule.java:80)
at org.junit.rules.RunRules.evaluate(RunRules.java:20)
at org.apache.lucene.tests.util.TestRuleSetupTeardownChained$1.evaluate(TestRuleSetupTeardownChained.java:48)
at org.apache.lucene.tests.util.AbstractBeforeAfterRule$1.evaluate(AbstractBeforeAfterRule.java:43)
at org.apache.lucene.tests.util.TestRuleThreadAndTestName$1.evaluate(TestRuleThreadAndTestName.java:45)
at org.apache.lucene.tests.util.TestRuleIgnoreAfterMaxFailures$1.evaluate(TestRuleIgnoreAfterMaxFailures.java:60)
at org.apache.lucene.tests.util.TestRuleMarkFailure$1.evaluate(TestRuleMarkFailure.java:44)
at org.junit.rules.RunRules.evaluate(RunRules.java:20)
at com.carrotsearch.randomizedtesting.rules.StatementAdapter.evaluate(StatementAdapter.java:36)
at com.carrotsearch.randomizedtesting.ThreadLeakControl$StatementRunner.run(ThreadLeakControl.java:390)
at com.carrotsearch.randomizedtesting.ThreadLeakControl.forkTimeoutingTask(ThreadLeakControl.java:843)
at com.carrotsearch.randomizedtesting.ThreadLeakControl$3.evaluate(ThreadLeakControl.java:490)
at com.carrotsearch.randomizedtesting.RandomizedRunner.runSingleTest(RandomizedRunner.java:968)
at com.carrotsearch.randomizedtesting.RandomizedRunner$5.evaluate(RandomizedRunner.java:853)
at com.carrotsearch.randomizedtesting.RandomizedRunner$6.evaluate(RandomizedRunner.java:904)
at com.carrotsearch.randomizedtesting.RandomizedRunner$7.evaluate(RandomizedRunner.java:915)
at com.carrotsearch.randomizedtesting.rules.StatementAdapter.evaluate(StatementAdapter.java:36)
at com.carrotsearch.randomizedtesting.rules.StatementAdapter.evaluate(StatementAdapter.java:36)
at org.apache.lucene.tests.util.AbstractBeforeAfterRule$1.evaluate(AbstractBeforeAfterRule.java:43)
at com.carrotsearch.randomizedtesting.rules.SystemPropertiesRestoreRule$1.evaluate(SystemPropertiesRestoreRule.java:80)
at org.junit.rules.RunRules.evaluate(RunRules.java:20)
at org.apache.lucene.tests.util.AbstractBeforeAfterRule$1.evaluate(AbstractBeforeAfterRule.java:43)
at com.carrotsearch.randomizedtesting.rules.StatementAdapter.evaluate(StatementAdapter.java:36)
at org.apache.lucene.tests.util.TestRuleStoreClassName$1.evaluate(TestRuleStoreClassName.java:38)
at com.carrotsearch.randomizedtesting.rules.NoShadowingOrOverridesOnMethodsRule$1.evaluate(NoShadowingOrOverridesOnMethodsRule.java:40)
at com.carrotsearch.randomizedtesting.rules.NoShadowingOrOverridesOnMethodsRule$1.evaluate(NoShadowingOrOverridesOnMethodsRule.java:40)
at com.carrotsearch.randomizedtesting.rules.StatementAdapter.evaluate(StatementAdapter.java:36)
at com.carrotsearch.randomizedtesting.rules.StatementAdapter.evaluate(StatementAdapter.java:36)
at org.apache.lucene.tests.util.TestRuleAssertionsRequired$1.evaluate(TestRuleAssertionsRequired.java:53)
at org.apache.lucene.tests.util.AbstractBeforeAfterRule$1.evaluate(AbstractBeforeAfterRule.java:43)
at org.apache.lucene.tests.util.TestRuleMarkFailure$1.evaluate(TestRuleMarkFailure.java:44)
at org.apache.lucene.tests.util.TestRuleIgnoreAfterMaxFailures$1.evaluate(TestRuleIgnoreAfterMaxFailures.java:60)
at org.apache.lucene.tests.util.TestRuleIgnoreTestSuites$1.evaluate(TestRuleIgnoreTestSuites.java:47)
at org.junit.rules.RunRules.evaluate(RunRules.java:20)
at com.carrotsearch.randomizedtesting.rules.StatementAdapter.evaluate(StatementAdapter.java:36)
at com.carrotsearch.randomizedtesting.ThreadLeakControl$StatementRunner.run(ThreadLeakControl.java:390)
at com.carrotsearch.randomizedtesting.ThreadLeakControl.lambda$forkTimeoutingTask$0(ThreadLeakControl.java:850)
at java.base/java.lang.Thread.run(Thread.java:1583)
org.apache.solr.search.TestIntervalsQParserPlugin > test suite's output saved to /home/jenkins/jenkins-agent/workspace/Solr/Solr-Test-10.x/solr/core/build/test-results/test/outputs/OUTPUT-org.apache.solr.search.TestIntervalsQParserPlugin.txt, copied below:
2> 825570 INFO (SUITE-TestIntervalsQParserPlugin-seed#[1E41B9646E3C9E70]-worker) [] o.a.s.SolrTestCase Setting 'solr.configset.default.confdir' system property to test-framework derived value of '/home/jenkins/jenkins-agent/workspace/Solr/Solr-Test-10.x/solr/server/solr/configsets/_default/conf'
2> 825571 INFO (SUITE-TestIntervalsQParserPlugin-seed#[1E41B9646E3C9E70]-worker) [] o.a.s.u.ErrorLogMuter Closing ErrorLogMuter-regex-401 after muting 0 log messages
2> 825571 INFO (SUITE-TestIntervalsQParserPlugin-seed#[1E41B9646E3C9E70]-worker) [] o.a.s.u.ErrorLogMuter Creating ErrorLogMuter-regex-402 for ERROR logs matching regex: ignore_exception
2> 825572 INFO (SUITE-TestIntervalsQParserPlugin-seed#[1E41B9646E3C9E70]-worker) [] o.a.s.SolrTestCaseJ4 Created dataDir: /home/jenkins/jenkins-agent/workspace/Solr/Solr-Test-10.x/solr/core/build/tmp/tests-tmp/org.apache.solr.search.TestIntervalsQParserPlugin_1E41B9646E3C9E70-001/data-dir-181-001
2> 825572 WARN (SUITE-TestIntervalsQParserPlugin-seed#[1E41B9646E3C9E70]-worker) [] o.a.s.SolrTestCaseJ4 startTrackingSearchers: numOpens=7 numCloses=7
2> 825572 INFO (SUITE-TestIntervalsQParserPlugin-seed#[1E41B9646E3C9E70]-worker) [] o.a.s.SolrTestCaseJ4 Using PointFields (NUMERIC_POINTS_SYSPROP=true) w/NUMERIC_DOCVALUES_SYSPROP=true
2> 825573 INFO (SUITE-TestIntervalsQParserPlugin-seed#[1E41B9646E3C9E70]-worker) [] o.a.s.SolrTestCaseJ4 Randomized ssl (true) and clientAuth (false) via: @org.apache.solr.util.RandomizeSSL(reason="", value=0.0/0.0, ssl=0.0/0.0, clientAuth=0.0/0.0)
2> 825573 INFO (SUITE-TestIntervalsQParserPlugin-seed#[1E41B9646E3C9E70]-worker) [] o.a.s.SolrTestCaseJ4 SecureRandom sanity checks: test.solr.allowed.securerandom=null & java.security.egd=file:/dev/./urandom
2> 825573 INFO (SUITE-TestIntervalsQParserPlugin-seed#[1E41B9646E3C9E70]-worker) [] o.a.s.SolrTestCaseJ4 ####initCore
2> 825576 INFO (SUITE-TestIntervalsQParserPlugin-seed#[1E41B9646E3C9E70]-worker) [] o.a.s.c.SolrResourceLoader Added lib dirs to classloader: [/home/jenkins/jenkins-agent/workspace/Solr/Solr-Test-10.x/solr/core/build/resources/test/solr/collection1/lib, /home/jenkins/jenkins-agent/workspace/Solr/Solr-Test-10.x/solr/core/build/resources/test/solr/collection1/lib/classes]
2> 825591 WARN (SUITE-TestIntervalsQParserPlugin-seed#[1E41B9646E3C9E70]-worker) [] o.a.s.c.SolrConfig solrconfig.xml: <boolTofilterOptimizer> is currently not implemented and has no effect.
2> 825606 INFO (SUITE-TestIntervalsQParserPlugin-seed#[1E41B9646E3C9E70]-worker) [] o.a.s.s.IndexSchema Loaded schema example/1.1 with uniqueid field id
2> 826488 INFO (SUITE-TestIntervalsQParserPlugin-seed#[1E41B9646E3C9E70]-worker) [] o.a.s.c.OpenTelemetryConfigurator OpenTelemetry tracer enabled with simple propagation only.
2> 826488 INFO (SUITE-TestIntervalsQParserPlugin-seed#[1E41B9646E3C9E70]-worker) [] o.a.s.m.OtelRuntimeJvmMetrics JVM metrics are disabled
2> 826490 WARN (SUITE-TestIntervalsQParserPlugin-seed#[1E41B9646E3C9E70]-worker) [] o.e.j.u.s.S.config Trusting all certificates configured for Client@2bab8d38[provider=null,keyStore=null,trustStore=null]
2> 826490 WARN (SUITE-TestIntervalsQParserPlugin-seed#[1E41B9646E3C9E70]-worker) [] o.e.j.u.s.S.config No Client EndPointIdentificationAlgorithm configured for Client@2bab8d38[provider=null,keyStore=null,trustStore=null]
2> 826492 WARN (SUITE-TestIntervalsQParserPlugin-seed#[1E41B9646E3C9E70]-worker) [] o.e.j.u.s.S.config Trusting all certificates configured for Client@511faecc[provider=null,keyStore=null,trustStore=null]
2> 826492 WARN (SUITE-TestIntervalsQParserPlugin-seed#[1E41B9646E3C9E70]-worker) [] o.e.j.u.s.S.config No Client EndPointIdentificationAlgorithm configured for Client@511faecc[provider=null,keyStore=null,trustStore=null]
2> 826493 WARN (SUITE-TestIntervalsQParserPlugin-seed#[1E41B9646E3C9E70]-worker) [] o.e.j.u.s.S.config Trusting all certificates configured for Client@41d91e15[provider=null,keyStore=null,trustStore=null]
2> 826493 WARN (SUITE-TestIntervalsQParserPlugin-seed#[1E41B9646E3C9E70]-worker) [] o.e.j.u.s.S.config No Client EndPointIdentificationAlgorithm configured for Client@41d91e15[provider=null,keyStore=null,trustStore=null]
2> 826494 WARN (SUITE-TestIntervalsQParserPlugin-seed#[1E41B9646E3C9E70]-worker) [] o.e.j.u.s.S.config Trusting all certificates configured for Client@62396fc7[provider=null,keyStore=null,trustStore=null]
2> 826494 WARN (SUITE-TestIntervalsQParserPlugin-seed#[1E41B9646E3C9E70]-worker) [] o.e.j.u.s.S.config No Client EndPointIdentificationAlgorithm configured for Client@62396fc7[provider=null,keyStore=null,trustStore=null]
2> 826495 WARN (SUITE-TestIntervalsQParserPlugin-seed#[1E41B9646E3C9E70]-worker) [] o.a.s.c.CoreContainer Not all security plugins configured! authentication=disabled authorization=disabled. Solr is only as secure as you make it. Consider configuring authentication/authorization before exposing Solr to users internal or external. See https://s.apache.org/solrsecurity for more info
2> 826502 INFO (coreLoadExecutor-14265-thread-1) [ x:collection1] o.a.s.c.SolrResourceLoader Added lib dirs to classloader: [/home/jenkins/jenkins-agent/workspace/Solr/Solr-Test-10.x/solr/core/build/resources/test/solr/collection1/lib, /home/jenkins/jenkins-agent/workspace/Solr/Solr-Test-10.x/solr/core/build/resources/test/solr/collection1/lib/classes]
2> 826518 WARN (coreLoadExecutor-14265-thread-1) [ x:collection1] o.a.s.c.SolrConfig solrconfig.xml: <boolTofilterOptimizer> is currently not implemented and has no effect.
2> 826533 INFO (coreLoadExecutor-14265-thread-1) [ x:collection1] o.a.s.s.IndexSchema Loaded schema example/1.1 with uniqueid field id
2> 826539 INFO (coreLoadExecutor-14265-thread-1) [ x:collection1] o.a.s.c.CoreContainer Creating SolrCore 'collection1' using configuration from instancedir /home/jenkins/jenkins-agent/workspace/Solr/Solr-Test-10.x/solr/core/build/resources/test/solr/collection1
2> 826539 INFO (coreLoadExecutor-14265-thread-1) [ x:collection1] o.a.s.c.SolrCore Opening new SolrCore at [/home/jenkins/jenkins-agent/workspace/Solr/Solr-Test-10.x/solr/core/build/resources/test/solr/collection1], dataDir=[/home/jenkins/jenkins-agent/workspace/Solr/Solr-Test-10.x/solr/core/build/tmp/tests-tmp/org.apache.solr.search.TestIntervalsQParserPlugin_1E41B9646E3C9E70-001/data-dir-181-001/]
2> 826540 INFO (coreLoadExecutor-14265-thread-1) [ x:collection1] o.a.s.u.RandomMergePolicy RandomMergePolicy wrapping class org.apache.lucene.index.TieredMergePolicy: [TieredMergePolicy: maxMergeAtOnce=19, maxMergedSegmentMB=34.4370698928833, floorSegmentMB=0.8630180358886719, forceMergeDeletesPctAllowed=9.19372553920041, segmentsPerTier=40.0, maxCFSSegmentSizeMB=8.796093022208E12, noCFSRatio=0.0, deletesPctAllowed=32.2682295593608, targetSearchConcurrency=10
2> 826572 INFO (coreLoadExecutor-14265-thread-1) [ x:collection1] o.a.s.u.UpdateLog Initializing UpdateLog: dataDir= defaultSyncLevel=FLUSH numRecordsToKeep=100 maxNumLogsToKeep=10
2> 826572 INFO (coreLoadExecutor-14265-thread-1) [ x:collection1] o.a.s.u.CommitTracker Hard AutoCommit: disabled
2> 826572 INFO (coreLoadExecutor-14265-thread-1) [ x:collection1] o.a.s.u.CommitTracker Soft AutoCommit: disabled
2> 826573 INFO (coreLoadExecutor-14265-thread-1) [ x:collection1] o.a.s.u.RandomMergePolicy RandomMergePolicy wrapping class org.apache.lucene.tests.index.MockRandomMergePolicy: org.apache.lucene.tests.index.MockRandomMergePolicy@2165df68
2> 826603 INFO (coreLoadExecutor-14265-thread-1) [ x:collection1] o.a.s.h.ReplicationHandler Commits will be reserved for 10000 ms
2> 826603 INFO (searcherExecutor-14267-thread-1-processing-collection1) [ x:collection1] o.a.s.h.c.SpellCheckComponent Loading spell index for spellchecker: default
2> 826603 INFO (searcherExecutor-14267-thread-1-processing-collection1) [ x:collection1] o.a.s.h.c.SpellCheckComponent Loading spell index for spellchecker: direct
2> 826603 INFO (searcherExecutor-14267-thread-1-processing-collection1) [ x:collection1] o.a.s.h.c.SpellCheckComponent Loading spell index for spellchecker: directMQF2
2> 826603 INFO (searcherExecutor-14267-thread-1-processing-collection1) [ x:collection1] o.a.s.h.c.SpellCheckComponent Loading spell index for spellchecker: wordbreak
2> 826603 INFO (searcherExecutor-14267-thread-1-processing-collection1) [ x:collection1] o.a.s.h.c.SpellCheckComponent Loading spell index for spellchecker: multipleFields
2> 826604 INFO (searcherExecutor-14267-thread-1-processing-collection1) [ x:collection1] o.a.s.h.c.SpellCheckComponent Loading spell index for spellchecker: jarowinkler
2> 826604 INFO (searcherExecutor-14267-thread-1-processing-collection1) [ x:collection1] o.a.s.h.c.SpellCheckComponent Loading spell index for spellchecker: external
2> 826604 INFO (searcherExecutor-14267-thread-1-processing-collection1) [ x:collection1] o.a.s.h.c.SpellCheckComponent Loading spell index for spellchecker: freq
2> 826604 INFO (searcherExecutor-14267-thread-1-processing-collection1) [ x:collection1] o.a.s.h.c.SpellCheckComponent Loading spell index for spellchecker: fqcn
2> 826605 INFO (searcherExecutor-14267-thread-1-processing-collection1) [ x:collection1] o.a.s.h.c.SpellCheckComponent Loading spell index for spellchecker: perDict
2> 826605 INFO (searcherExecutor-14267-thread-1-processing-collection1) [ x:collection1] o.a.s.c.SolrCore Registered new searcher autowarm time: 0 ms
2> 826645 INFO (SUITE-TestIntervalsQParserPlugin-seed#[1E41B9646E3C9E70]-worker) [] o.a.s.SolrTestCaseJ4 ####initCore end
2> 826649 INFO (TEST-TestIntervalsQParserPlugin.testIntervalsAllOfAnyOfNamedQuery-seed#[1E41B9646E3C9E70]) [] o.a.s.SolrTestCaseJ4 ###Starting testIntervalsAllOfAnyOfNamedQuery
2> 826650 INFO (TEST-TestIntervalsQParserPlugin.testIntervalsAllOfAnyOfNamedQuery-seed#[1E41B9646E3C9E70]) [ x:collection1] o.a.s.u.p.LogUpdateProcessorFactory path=/update params={{params(wt=xml),defaults(wt=xml)}}{add=[30 (1872918478241923072)]} 0 0
2> 826651 INFO (TEST-TestIntervalsQParserPlugin.testIntervalsAllOfAnyOfNamedQuery-seed#[1E41B9646E3C9E70]) [ x:collection1] o.a.s.u.p.LogUpdateProcessorFactory path=/update params={{params(wt=xml),defaults(wt=xml)}}{add=[31 (1872918478244020224)]} 0 0
2> 826652 INFO (TEST-TestIntervalsQParserPlugin.testIntervalsAllOfAnyOfNamedQuery-seed#[1E41B9646E3C9E70]) [ x:collection1] o.a.s.u.p.LogUpdateProcessorFactory path=/update params={{params(wt=xml),defaults(wt=xml)}}{add=[32 (1872918478244020225)]} 0 0
2> 826655 INFO (searcherExecutor-14267-thread-1-processing-collection1) [ x:collection1] o.a.s.c.SolrCore Registered new searcher autowarm time: 0 ms
2> 826655 INFO (TEST-TestIntervalsQParserPlugin.testIntervalsAllOfAnyOfNamedQuery-seed#[1E41B9646E3C9E70]) [ x:collection1] o.a.s.u.p.LogUpdateProcessorFactory path=/update params={{params(wt=xml),defaults(wt=xml)}}{commit=} 0 2
2> 826662 INFO (TEST-TestIntervalsQParserPlugin.testIntervalsAllOfAnyOfNamedQuery-seed#[1E41B9646E3C9E70]) [] o.a.s.c.S.Request path=null params={wt=xml} hits=2 status=0 QTime=7
2> 826662 INFO (TEST-TestIntervalsQParserPlugin.testIntervalsAllOfAnyOfNamedQuery-seed#[1E41B9646E3C9E70]) [] o.a.s.SolrTestCaseJ4 ###Ending testIntervalsAllOfAnyOfNamedQuery
2> 826666 INFO (TEST-TestIntervalsQParserPlugin.testIntervalsPhraseRuleWithTerms-seed#[1E41B9646E3C9E70]) [] o.a.s.SolrTestCaseJ4 ###Starting testIntervalsPhraseRuleWithTerms
2> 826667 INFO (TEST-TestIntervalsQParserPlugin.testIntervalsPhraseRuleWithTerms-seed#[1E41B9646E3C9E70]) [ x:collection1] o.a.s.u.p.LogUpdateProcessorFactory path=/update params={{params(wt=xml),defaults(wt=xml)}}{add=[50 (1872918478259748864)]} 0 0
2> 826667 INFO (TEST-TestIntervalsQParserPlugin.testIntervalsPhraseRuleWithTerms-seed#[1E41B9646E3C9E70]) [ x:collection1] o.a.s.u.p.LogUpdateProcessorFactory path=/update params={{params(wt=xml),defaults(wt=xml)}}{add=[51 (1872918478260797440)]} 0 0
2> 826671 INFO (searcherExecutor-14267-thread-1-processing-collection1) [ x:collection1] o.a.s.c.SolrCore Registered new searcher autowarm time: 0 ms
2> 826671 INFO (TEST-TestIntervalsQParserPlugin.testIntervalsPhraseRuleWithTerms-seed#[1E41B9646E3C9E70]) [ x:collection1] o.a.s.u.p.LogUpdateProcessorFactory path=/update params={{params(wt=xml),defaults(wt=xml)}}{commit=} 0 3
2> 826672 INFO (TEST-TestIntervalsQParserPlugin.testIntervalsPhraseRuleWithTerms-seed#[1E41B9646E3C9E70]) [] o.a.s.c.S.Request path=null params={wt=xml} hits=1 status=0 QTime=0
2> 826672 INFO (TEST-TestIntervalsQParserPlugin.testIntervalsPhraseRuleWithTerms-seed#[1E41B9646E3C9E70]) [] o.a.s.SolrTestCaseJ4 ###Ending testIntervalsPhraseRuleWithTerms
2> 826675 INFO (TEST-TestIntervalsQParserPlugin.testIntervalsExtendRule-seed#[1E41B9646E3C9E70]) [] o.a.s.SolrTestCaseJ4 ###Starting testIntervalsExtendRule
2> 826676 INFO (TEST-TestIntervalsQParserPlugin.testIntervalsExtendRule-seed#[1E41B9646E3C9E70]) [ x:collection1] o.a.s.u.p.LogUpdateProcessorFactory path=/update params={{params(wt=xml),defaults(wt=xml)}}{add=[90 (1872918478270234624)]} 0 0
2> 826677 INFO (TEST-TestIntervalsQParserPlugin.testIntervalsExtendRule-seed#[1E41B9646E3C9E70]) [ x:collection1] o.a.s.u.p.LogUpdateProcessorFactory path=/update params={{params(wt=xml),defaults(wt=xml)}}{add=[91 (1872918478270234625)]} 0 0
2> 826683 INFO (searcherExecutor-14267-thread-1-processing-collection1) [ x:collection1] o.a.s.c.SolrCore Registered new searcher autowarm time: 0 ms
2> 826684 INFO (TEST-TestIntervalsQParserPlugin.testIntervalsExtendRule-seed#[1E41B9646E3C9E70]) [ x:collection1] o.a.s.u.p.LogUpdateProcessorFactory path=/update params={{params(wt=xml),defaults(wt=xml)}}{commit=} 0 6
2> 826685 INFO (TEST-TestIntervalsQParserPlugin.testIntervalsExtendRule-seed#[1E41B9646E3C9E70]) [] o.a.s.c.S.Request path=null params={wt=xml} hits=1 status=0 QTime=0
2> 826685 INFO (TEST-TestIntervalsQParserPlugin.testIntervalsExtendRule-seed#[1E41B9646E3C9E70]) [] o.a.s.SolrTestCaseJ4 ###Ending testIntervalsExtendRule
2> 826689 INFO (TEST-TestIntervalsQParserPlugin.testIntervalsAtLeastRule-seed#[1E41B9646E3C9E70]) [] o.a.s.SolrTestCaseJ4 ###Starting testIntervalsAtLeastRule
2> 826689 INFO (TEST-TestIntervalsQParserPlugin.testIntervalsAtLeastRule-seed#[1E41B9646E3C9E70]) [ x:collection1] o.a.s.u.p.LogUpdateProcessorFactory path=/update params={{params(wt=xml),defaults(wt=xml)}}{add=[130 (1872918478283866112)]} 0 0
2> 826690 INFO (TEST-TestIntervalsQParserPlugin.testIntervalsAtLeastRule-seed#[1E41B9646E3C9E70]) [ x:collection1] o.a.s.u.p.LogUpdateProcessorFactory path=/update params={{params(wt=xml),defaults(wt=xml)}}{add=[131 (1872918478284914688)]} 0 0
2> 826690 INFO (TEST-TestIntervalsQParserPlugin.testIntervalsAtLeastRule-seed#[1E41B9646E3C9E70]) [ x:collection1] o.a.s.u.p.LogUpdateProcessorFactory path=/update params={{params(wt=xml),defaults(wt=xml)}}{add=[132 (1872918478284914689)]} 0 0
2> 826694 INFO (searcherExecutor-14267-thread-1-processing-collection1) [ x:collection1] o.a.s.c.SolrCore Registered new searcher autowarm time: 0 ms
2> 826694 INFO (TEST-TestIntervalsQParserPlugin.testIntervalsAtLeastRule-seed#[1E41B9646E3C9E70]) [ x:collection1] o.a.s.u.p.LogUpdateProcessorFactory path=/update params={{params(wt=xml),defaults(wt=xml)}}{commit=} 0 3
2> 826696 INFO (TEST-TestIntervalsQParserPlugin.testIntervalsAtLeastRule-seed#[1E41B9646E3C9E70]) [] o.a.s.c.S.Request path=null params={wt=xml} hits=2 status=0 QTime=1
2> 826696 INFO (TEST-TestIntervalsQParserPlugin.testIntervalsAtLeastRule-seed#[1E41B9646E3C9E70]) [] o.a.s.SolrTestCaseJ4 ###Ending testIntervalsAtLeastRule
2> 826700 INFO (TEST-TestIntervalsQParserPlugin.testIntervalsNotWithinRule-seed#[1E41B9646E3C9E70]) [] o.a.s.SolrTestCaseJ4 ###Starting testIntervalsNotWithinRule
2> 826700 INFO (TEST-TestIntervalsQParserPlugin.testIntervalsNotWithinRule-seed#[1E41B9646E3C9E70]) [ x:collection1] o.a.s.u.p.LogUpdateProcessorFactory path=/update params={{params(wt=xml),defaults(wt=xml)}}{add=[120 (1872918478295400448)]} 0 0
2> 826701 INFO (TEST-TestIntervalsQParserPlugin.testIntervalsNotWithinRule-seed#[1E41B9646E3C9E70]) [ x:collection1] o.a.s.u.p.LogUpdateProcessorFactory path=/update params={{params(wt=xml),defaults(wt=xml)}}{add=[121 (1872918478296449024)]} 0 0
2> 826707 INFO (searcherExecutor-14267-thread-1-processing-collection1) [ x:collection1] o.a.s.c.SolrCore Registered new searcher autowarm time: 0 ms
2> 826707 INFO (TEST-TestIntervalsQParserPlugin.testIntervalsNotWithinRule-seed#[1E41B9646E3C9E70]) [ x:collection1] o.a.s.u.p.LogUpdateProcessorFactory path=/update params={{params(wt=xml),defaults(wt=xml)}}{commit=} 0 6
2> 826708 INFO (TEST-TestIntervalsQParserPlugin.testIntervalsNotWithinRule-seed#[1E41B9646E3C9E70]) [] o.a.s.c.S.Request path=null params={wt=xml} hits=1 status=0 QTime=0
2> 826709 INFO (TEST-TestIntervalsQParserPlugin.testIntervalsNotWithinRule-seed#[1E41B9646E3C9E70]) [] o.a.s.SolrTestCaseJ4 ###Ending testIntervalsNotWithinRule
2> 826712 INFO (TEST-TestIntervalsQParserPlugin.testIntervalsFuzzyRule-seed#[1E41B9646E3C9E70]) [] o.a.s.SolrTestCaseJ4 ###Starting testIntervalsFuzzyRule
2> 826713 INFO (TEST-TestIntervalsQParserPlugin.testIntervalsFuzzyRule-seed#[1E41B9646E3C9E70]) [ x:collection1] o.a.s.u.p.LogUpdateProcessorFactory path=/update params={{params(wt=xml),defaults(wt=xml)}}{add=[80 (1872918478307983360)]} 0 0
2> 826713 INFO (TEST-TestIntervalsQParserPlugin.testIntervalsFuzzyRule-seed#[1E41B9646E3C9E70]) [ x:collection1] o.a.s.u.p.LogUpdateProcessorFactory path=/update params={{params(wt=xml),defaults(wt=xml)}}{add=[81 (1872918478309031936)]} 0 0
2> 826714 INFO (TEST-TestIntervalsQParserPlugin.testIntervalsFuzzyRule-seed#[1E41B9646E3C9E70]) [ x:collection1] o.a.s.u.p.LogUpdateProcessorFactory path=/update params={{params(wt=xml),defaults(wt=xml)}}{add=[82 (1872918478310080512)]} 0 0
2> 826717 INFO (searcherExecutor-14267-thread-1-processing-collection1) [ x:collection1] o.a.s.c.SolrCore Registered new searcher autowarm time: 0 ms
2> 826717 INFO (TEST-TestIntervalsQParserPlugin.testIntervalsFuzzyRule-seed#[1E41B9646E3C9E70]) [ x:collection1] o.a.s.u.p.LogUpdateProcessorFactory path=/update params={{params(wt=xml),defaults(wt=xml)}}{commit=} 0 3
2> 826720 INFO (TEST-TestIntervalsQParserPlugin.testIntervalsFuzzyRule-seed#[1E41B9646E3C9E70]) [] o.a.s.c.S.Request path=null params={wt=xml} hits=2 status=0 QTime=2
2> 826721 INFO (TEST-TestIntervalsQParserPlugin.testIntervalsFuzzyRule-seed#[1E41B9646E3C9E70]) [] o.a.s.u.ErrorLogMuter Creating ErrorLogMuter-regex-403 for ERROR logs matching regex: .
2> 826721 INFO (TEST-TestIntervalsQParserPlugin.testIntervalsFuzzyRule-seed#[1E41B9646E3C9E70]) [] o.a.s.c.S.Request path=null params={json={query:{intervals:{use_field:v_ws,+fuzzy:{term:fzz_cat,prefix_length:-1}}},fields:id}&wt=xml} status=400 QTime=0
2> 826722 INFO (TEST-TestIntervalsQParserPlugin.testIntervalsFuzzyRule-seed#[1E41B9646E3C9E70]) [] o.a.s.u.ErrorLogMuter Closing ErrorLogMuter-regex-403 after muting 1 log messages
2> 826722 INFO (TEST-TestIntervalsQParserPlugin.testIntervalsFuzzyRule-seed#[1E41B9646E3C9E70]) [] o.a.s.SolrTestCaseJ4 ###Ending testIntervalsFuzzyRule
2> 826726 INFO (TEST-TestIntervalsQParserPlugin.testIntervalsWithinRule-seed#[1E41B9646E3C9E70]) [] o.a.s.SolrTestCaseJ4 ###Starting testIntervalsWithinRule
2> 826727 INFO (TEST-TestIntervalsQParserPlugin.testIntervalsWithinRule-seed#[1E41B9646E3C9E70]) [ x:collection1] o.a.s.u.p.LogUpdateProcessorFactory path=/update params={{params(wt=xml),defaults(wt=xml)}}{add=[110 (1872918478322663424)]} 0 0
2> 826727 INFO (TEST-TestIntervalsQParserPlugin.testIntervalsWithinRule-seed#[1E41B9646E3C9E70]) [ x:collection1] o.a.s.u.p.LogUpdateProcessorFactory path=/update params={{params(wt=xml),defaults(wt=xml)}}{add=[111 (1872918478323712000)]} 0 0
2> 826734 INFO (searcherExecutor-14267-thread-1-processing-collection1) [ x:collection1] o.a.s.c.SolrCore Registered new searcher autowarm time: 0 ms
2> 826735 INFO (TEST-TestIntervalsQParserPlugin.testIntervalsWithinRule-seed#[1E41B9646E3C9E70]) [ x:collection1] o.a.s.u.p.LogUpdateProcessorFactory path=/update params={{params(wt=xml),defaults(wt=xml)}}{commit=} 0 7
2> 826736 INFO (TEST-TestIntervalsQParserPlugin.testIntervalsWithinRule-seed#[1E41B9646E3C9E70]) [] o.a.s.c.S.Request path=null params={wt=xml} hits=1 status=0 QTime=1
2> 826736 INFO (TEST-TestIntervalsQParserPlugin.testIntervalsWithinRule-seed#[1E41B9646E3C9E70]) [] o.a.s.SolrTestCaseJ4 ###Ending testIntervalsWithinRule
2> 826740 INFO (TEST-TestIntervalsQParserPlugin.testIntervalsUnknownAnalyzerFieldTypeThrows-seed#[1E41B9646E3C9E70]) [] o.a.s.SolrTestCaseJ4 ###Starting testIntervalsUnknownAnalyzerFieldTypeThrows
2> 826740 INFO (TEST-TestIntervalsQParserPlugin.testIntervalsUnknownAnalyzerFieldTypeThrows-seed#[1E41B9646E3C9E70]) [] o.a.s.u.ErrorLogMuter Creating ErrorLogMuter-regex-404 for ERROR logs matching regex: .
2> 826741 INFO (TEST-TestIntervalsQParserPlugin.testIntervalsUnknownAnalyzerFieldTypeThrows-seed#[1E41B9646E3C9E70]) [] o.a.s.c.S.Request path=null params={json={query:{intervals:{use_field:v_t,+match:{query:foo,analyzer:no_such_field_type}}},fields:id}&wt=xml} status=400 QTime=0
2> 826742 INFO (TEST-TestIntervalsQParserPlugin.testIntervalsUnknownAnalyzerFieldTypeThrows-seed#[1E41B9646E3C9E70]) [] o.a.s.u.ErrorLogMuter Closing ErrorLogMuter-regex-404 after muting 1 log messages
2> 826742 INFO (TEST-TestIntervalsQParserPlugin.testIntervalsUnknownAnalyzerFieldTypeThrows-seed#[1E41B9646E3C9E70]) [] o.a.s.SolrTestCaseJ4 ###Ending testIntervalsUnknownAnalyzerFieldTypeThrows
2> 826745 INFO (TEST-TestIntervalsQParserPlugin.testIntervalsNestedAlternativeOutperformsXmlSpans-seed#[1E41B9646E3C9E70]) [] o.a.s.SolrTestCaseJ4 ###Starting testIntervalsNestedAlternativeOutperformsXmlSpans
2> 826746 INFO (TEST-TestIntervalsQParserPlugin.testIntervalsNestedAlternativeOutperformsXmlSpans-seed#[1E41B9646E3C9E70]) [ x:collection1] o.a.s.u.p.LogUpdateProcessorFactory path=/update params={{params(wt=xml),defaults(wt=xml)}}{add=[170 (1872918478343634944)]} 0 0
2> 826747 INFO (TEST-TestIntervalsQParserPlugin.testIntervalsNestedAlternativeOutperformsXmlSpans-seed#[1E41B9646E3C9E70]) [ x:collection1] o.a.s.u.p.LogUpdateProcessorFactory path=/update params={{params(wt=xml),defaults(wt=xml)}}{add=[171 (1872918478343634945)]} 0 0
2> 826747 INFO (TEST-TestIntervalsQParserPlugin.testIntervalsNestedAlternativeOutperformsXmlSpans-seed#[1E41B9646E3C9E70]) [ x:collection1] o.a.s.u.p.LogUpdateProcessorFactory path=/update params={{params(wt=xml),defaults(wt=xml)}}{add=[172 (1872918478344683520)]} 0 0
2> 826751 INFO (searcherExecutor-14267-thread-1-processing-collection1) [ x:collection1] o.a.s.c.SolrCore Registered new searcher autowarm time: 0 ms
2> 826751 INFO (TEST-TestIntervalsQParserPlugin.testIntervalsNestedAlternativeOutperformsXmlSpans-seed#[1E41B9646E3C9E70]) [ x:collection1] o.a.s.u.p.LogUpdateProcessorFactory path=/update params={{params(wt=xml),defaults(wt=xml)}}{commit=} 0 3
2> 826753 INFO (TEST-TestIntervalsQParserPlugin.testIntervalsNestedAlternativeOutperformsXmlSpans-seed#[1E41B9646E3C9E70]) [] o.a.s.c.S.Request path=null params={q={!xmlparser+df%3Dv_ws}<SpanNear+slop%3D"0"+inOrder%3D"true"+fieldName%3D"v_ws"><SpanTerm+fieldName%3D"v_ws">cmpthe</SpanTerm><SpanOr><SpanTerm+fieldName%3D"v_ws">cmpdomain</SpanTerm><SpanNear+slop%3D"0"+inOrder%3D"true"><SpanTerm+fieldName%3D"v_ws">cmpdomain</SpanTerm><SpanTerm+fieldName%3D"v_ws">cmpname</SpanTerm><SpanTerm+fieldName%3D"v_ws">cmpsystem</SpanTerm></SpanNear></SpanOr><SpanTerm+fieldName%3D"v_ws">cmpis</SpanTerm></SpanNear>&wt=xml} hits=1 status=0 QTime=1
2> 826755 INFO (TEST-TestIntervalsQParserPlugin.testIntervalsNestedAlternativeOutperformsXmlSpans-seed#[1E41B9646E3C9E70]) [] o.a.s.c.S.Request path=null params={wt=xml} hits=2 status=0 QTime=2
2> 826755 INFO (TEST-TestIntervalsQParserPlugin.testIntervalsNestedAlternativeOutperformsXmlSpans-seed#[1E41B9646E3C9E70]) [] o.a.s.SolrTestCaseJ4 ###Ending testIntervalsNestedAlternativeOutperformsXmlSpans
2> 826759 INFO (TEST-TestIntervalsQParserPlugin.testIntervalsPrefixRuleNonexistentUseFieldThrows-seed#[1E41B9646E3C9E70]) [] o.a.s.SolrTestCaseJ4 ###Starting testIntervalsPrefixRuleNonexistentUseFieldThrows
2> 826759 INFO (TEST-TestIntervalsQParserPlugin.testIntervalsPrefixRuleNonexistentUseFieldThrows-seed#[1E41B9646E3C9E70]) [] o.a.s.u.ErrorLogMuter Creating ErrorLogMuter-regex-405 for ERROR logs matching regex: .
2> 826760 INFO (TEST-TestIntervalsQParserPlugin.testIntervalsPrefixRuleNonexistentUseFieldThrows-seed#[1E41B9646E3C9E70]) [] o.a.s.c.S.Request path=null params={json={query:{intervals:{use_field:v_ws,+prefix:{prefix:foo,use_field:no_such_field}}},fields:id}&wt=xml} status=400 QTime=0
2> 826761 INFO (TEST-TestIntervalsQParserPlugin.testIntervalsPrefixRuleNonexistentUseFieldThrows-seed#[1E41B9646E3C9E70]) [] o.a.s.u.ErrorLogMuter Closing ErrorLogMuter-regex-405 after muting 1 log messages
2> 826761 INFO (TEST-TestIntervalsQParserPlugin.testIntervalsPrefixRuleNonexistentUseFieldThrows-seed#[1E41B9646E3C9E70]) [] o.a.s.SolrTestCaseJ4 ###Ending testIntervalsPrefixRuleNonexistentUseFieldThrows
2> 826764 INFO (TEST-TestIntervalsQParserPlugin.testIntervalsMatchRuleNonexistentUseFieldThrows-seed#[1E41B9646E3C9E70]) [] o.a.s.SolrTestCaseJ4 ###Starting testIntervalsMatchRuleNonexistentUseFieldThrows
2> 826765 INFO (TEST-TestIntervalsQParserPlugin.testIntervalsMatchRuleNonexistentUseFieldThrows-seed#[1E41B9646E3C9E70]) [] o.a.s.u.ErrorLogMuter Creating ErrorLogMuter-regex-406 for ERROR logs matching regex: .
2> 826765 INFO (TEST-TestIntervalsQParserPlugin.testIntervalsMatchRuleNonexistentUseFieldThrows-seed#[1E41B9646E3C9E70]) [] o.a.s.c.S.Request path=null params={json={query:{intervals:{use_field:v_t,+match:{query:foo,use_field:no_such_field}}},fields:id}&wt=xml} status=400 QTime=0
2> 826766 INFO (TEST-TestIntervalsQParserPlugin.testIntervalsMatchRuleNonexistentUseFieldThrows-seed#[1E41B9646E3C9E70]) [] o.a.s.u.ErrorLogMuter Closing ErrorLogMuter-regex-406 after muting 1 log messages
2> 826766 INFO (TEST-TestIntervalsQParserPlugin.testIntervalsMatchRuleNonexistentUseFieldThrows-seed#[1E41B9646E3C9E70]) [] o.a.s.SolrTestCaseJ4 ###Ending testIntervalsMatchRuleNonexistentUseFieldThrows
2> 826770 INFO (TEST-TestIntervalsQParserPlugin.testIntervalsMissingQueryThrows-seed#[1E41B9646E3C9E70]) [] o.a.s.SolrTestCaseJ4 ###Starting testIntervalsMissingQueryThrows
2> 826770 INFO (TEST-TestIntervalsQParserPlugin.testIntervalsMissingQueryThrows-seed#[1E41B9646E3C9E70]) [ x:collection1] o.a.s.u.p.LogUpdateProcessorFactory path=/update params={{params(wt=xml),defaults(wt=xml)}}{add=[1 (1872918478368800768)]} 0 0
2> 826777 INFO (searcherExecutor-14267-thread-1-processing-collection1) [ x:collection1] o.a.s.c.SolrCore Registered new searcher autowarm time: 0 ms
2> 826777 INFO (TEST-TestIntervalsQParserPlugin.testIntervalsMissingQueryThrows-seed#[1E41B9646E3C9E70]) [ x:collection1] o.a.s.u.p.LogUpdateProcessorFactory path=/update params={{params(wt=xml),defaults(wt=xml)}}{commit=} 0 6
2> 826777 INFO (TEST-TestIntervalsQParserPlugin.testIntervalsMissingQueryThrows-seed#[1E41B9646E3C9E70]) [] o.a.s.u.ErrorLogMuter Creating ErrorLogMuter-regex-407 for ERROR logs matching regex: .
2> 826778 INFO (TEST-TestIntervalsQParserPlugin.testIntervalsMissingQueryThrows-seed#[1E41B9646E3C9E70]) [] o.a.s.c.S.Request path=null params={json={query:{intervals:{use_field:v_t}},+fields:id}&wt=xml} status=400 QTime=0
2> 826779 INFO (TEST-TestIntervalsQParserPlugin.testIntervalsMissingQueryThrows-seed#[1E41B9646E3C9E70]) [] o.a.s.u.ErrorLogMuter Closing ErrorLogMuter-regex-407 after muting 1 log messages
2> 826779 INFO (TEST-TestIntervalsQParserPlugin.testIntervalsMissingQueryThrows-seed#[1E41B9646E3C9E70]) [] o.a.s.SolrTestCaseJ4 ###Ending testIntervalsMissingQueryThrows
2> 826782 INFO (TEST-TestIntervalsQParserPlugin.testIntervalsMatchRuleMatchesDocument-seed#[1E41B9646E3C9E70]) [] o.a.s.SolrTestCaseJ4 ###Starting testIntervalsMatchRuleMatchesDocument
2> 826783 INFO (TEST-TestIntervalsQParserPlugin.testIntervalsMatchRuleMatchesDocument-seed#[1E41B9646E3C9E70]) [ x:collection1] o.a.s.u.p.LogUpdateProcessorFactory path=/update params={{params(wt=xml),defaults(wt=xml)}}{add=[10 (1872918478382432256)]} 0 0
2> 826784 INFO (TEST-TestIntervalsQParserPlugin.testIntervalsMatchRuleMatchesDocument-seed#[1E41B9646E3C9E70]) [ x:collection1] o.a.s.u.p.LogUpdateProcessorFactory path=/update params={{params(wt=xml),defaults(wt=xml)}}{add=[11 (1872918478382432257)]} 0 0
2> 826790 INFO (searcherExecutor-14267-thread-1-processing-collection1) [ x:collection1] o.a.s.c.SolrCore Registered new searcher autowarm time: 0 ms
2> 826790 INFO (TEST-TestIntervalsQParserPlugin.testIntervalsMatchRuleMatchesDocument-seed#[1E41B9646E3C9E70]) [ x:collection1] o.a.s.u.p.LogUpdateProcessorFactory path=/update params={{params(wt=xml),defaults(wt=xml)}}{commit=} 0 6
2> 826791 INFO (TEST-TestIntervalsQParserPlugin.testIntervalsMatchRuleMatchesDocument-seed#[1E41B9646E3C9E70]) [] o.a.s.c.S.Request path=null params={wt=xml} hits=1 status=0 QTime=0
2> 826791 INFO (TEST-TestIntervalsQParserPlugin.testIntervalsMatchRuleMatchesDocument-seed#[1E41B9646E3C9E70]) [] o.a.s.SolrTestCaseJ4 ###Ending testIntervalsMatchRuleMatchesDocument
2> 826795 INFO (TEST-TestIntervalsQParserPlugin.testIntervalsNoMatchingRule-seed#[1E41B9646E3C9E70]) [] o.a.s.SolrTestCaseJ4 ###Starting testIntervalsNoMatchingRule
2> 826796 INFO (TEST-TestIntervalsQParserPlugin.testIntervalsNoMatchingRule-seed#[1E41B9646E3C9E70]) [ x:collection1] o.a.s.u.p.LogUpdateProcessorFactory path=/update params={{params(wt=xml),defaults(wt=xml)}}{add=[20 (1872918478395015168)]} 0 0
2> 826802 INFO (searcherExecutor-14267-thread-1-processing-collection1) [ x:collection1] o.a.s.c.SolrCore Registered new searcher autowarm time: 0 ms
2> 826802 INFO (TEST-TestIntervalsQParserPlugin.testIntervalsNoMatchingRule-seed#[1E41B9646E3C9E70]) [ x:collection1] o.a.s.u.p.LogUpdateProcessorFactory path=/update params={{params(wt=xml),defaults(wt=xml)}}{commit=} 0 6
2> 826803 INFO (TEST-TestIntervalsQParserPlugin.testIntervalsNoMatchingRule-seed#[1E41B9646E3C9E70]) [] o.a.s.c.S.Request path=null params={wt=xml} hits=0 status=0 QTime=0
2> 826803 INFO (TEST-TestIntervalsQParserPlugin.testIntervalsNoMatchingRule-seed#[1E41B9646E3C9E70]) [] o.a.s.SolrTestCaseJ4 ###Ending testIntervalsNoMatchingRule
2> 826807 INFO (TEST-TestIntervalsQParserPlugin.testIntervalsMatchRuleNonexistentDfFieldThrows-seed#[1E41B9646E3C9E70]) [] o.a.s.SolrTestCaseJ4 ###Starting testIntervalsMatchRuleNonexistentDfFieldThrows
2> 826807 INFO (TEST-TestIntervalsQParserPlugin.testIntervalsMatchRuleNonexistentDfFieldThrows-seed#[1E41B9646E3C9E70]) [] o.a.s.u.ErrorLogMuter Creating ErrorLogMuter-regex-408 for ERROR logs matching regex: .
2> 826808 INFO (TEST-TestIntervalsQParserPlugin.testIntervalsMatchRuleNonexistentDfFieldThrows-seed#[1E41B9646E3C9E70]) [] o.a.s.c.S.Request path=null params={json={query:{intervals:{use_field:no_such_field,+match:{query:foo}}},fields:id}&wt=xml} status=400 QTime=0
2> 826808 INFO (TEST-TestIntervalsQParserPlugin.testIntervalsMatchRuleNonexistentDfFieldThrows-seed#[1E41B9646E3C9E70]) [] o.a.s.u.ErrorLogMuter Closing ErrorLogMuter-regex-408 after muting 1 log messages
2> 826808 INFO (TEST-TestIntervalsQParserPlugin.testIntervalsMatchRuleNonexistentDfFieldThrows-seed#[1E41B9646E3C9E70]) [] o.a.s.SolrTestCaseJ4 ###Ending testIntervalsMatchRuleNonexistentDfFieldThrows
2> 826812 INFO (TEST-TestIntervalsQParserPlugin.testIntervalsRegexpRule-seed#[1E41B9646E3C9E70]) [] o.a.s.SolrTestCaseJ4 ###Starting testIntervalsRegexpRule
2> 826813 INFO (TEST-TestIntervalsQParserPlugin.testIntervalsRegexpRule-seed#[1E41B9646E3C9E70]) [ x:collection1] o.a.s.u.p.LogUpdateProcessorFactory path=/update params={{params(wt=xml),defaults(wt=xml)}}{add=[60 (1872918478412840960)]} 0 0
2> 826813 INFO (TEST-TestIntervalsQParserPlugin.testIntervalsRegexpRule-seed#[1E41B9646E3C9E70]) [ x:collection1] o.a.s.u.p.LogUpdateProcessorFactory path=/update params={{params(wt=xml),defaults(wt=xml)}}{add=[61 (1872918478413889536)]} 0 0
2> 826813 INFO (TEST-TestIntervalsQParserPlugin.testIntervalsRegexpRule-seed#[1E41B9646E3C9E70]) [ x:collection1] o.a.s.u.p.LogUpdateProcessorFactory path=/update params={{params(wt=xml),defaults(wt=xml)}}{add=[62 (1872918478413889537)]} 0 0
2> 826820 INFO (searcherExecutor-14267-thread-1-processing-collection1) [ x:collection1] o.a.s.c.SolrCore Registered new searcher autowarm time: 0 ms
2> 826821 INFO (TEST-TestIntervalsQParserPlugin.testIntervalsRegexpRule-seed#[1E41B9646E3C9E70]) [ x:collection1] o.a.s.u.p.LogUpdateProcessorFactory path=/update params={{params(wt=xml),defaults(wt=xml)}}{commit=} 0 6
2> 826822 INFO (TEST-TestIntervalsQParserPlugin.testIntervalsRegexpRule-seed#[1E41B9646E3C9E70]) [] o.a.s.c.S.Request path=null params={wt=xml} hits=2 status=0 QTime=0
2> 826822 ERROR (TEST-TestIntervalsQParserPlugin.testIntervalsRegexpRule-seed#[1E41B9646E3C9E70]) [] o.a.s.SolrTestCaseJ4 query failed JSON validation. error=mismatch: '60'!='61' @ response/docs/[0]/id
2> expected =/response=={'numFound':2,'start':0,'numFoundExact':true,"docs":[
2> {
2> "id":"60"
2> },
2> {
2> "id":"61"
2> }
2> ]}
2> response = {
2> "responseHeader":{
2> "status":0,
2> "QTime":0
2> },
2> "response":{
2> "numFound":2,
2> "start":0,
2> "numFoundExact":true,
2> "docs":[
2> {
2> "id":"61"
2> },
2> {
2> "id":"60"
2> }
2> ]
2> }
2> }
2> request = wt=xml
2> 826822 INFO (TEST-TestIntervalsQParserPlugin.testIntervalsRegexpRule-seed#[1E41B9646E3C9E70]) [] o.a.s.SolrTestCaseJ4 ###Ending testIntervalsRegexpRule
> java.lang.RuntimeException: mismatch: '60'!='61' @ response/docs/[0]/id
> at __randomizedtesting.SeedInfo.seed([1E41B9646E3C9E70:E17A612A4F086DDC]:0)
> at org.apache.solr.SolrTestCaseJ4.assertJQ(SolrTestCaseJ4.java:993)
> at org.apache.solr.SolrTestCaseJ4.assertJJQ(SolrTestCaseJ4.java:928)
> at org.apache.solr.search.TestIntervalsQParserPlugin.testIntervalsRegexpRule(TestIntervalsQParserPlugin.java:164)
> at java.base/jdk.internal.reflect.DirectMethodHandleAccessor.invoke(DirectMethodHandleAccessor.java:103)
> at java.base/java.lang.reflect.Method.invoke(Method.java:580)
> at com.carrotsearch.randomizedtesting.RandomizedRunner.invoke(RandomizedRunner.java:1780)
> at com.carrotsearch.randomizedtesting.RandomizedRunner$8.evaluate(RandomizedRunner.java:959)
> at com.carrotsearch.randomizedtesting.RandomizedRunner$9.evaluate(RandomizedRunner.java:995)
> at com.carrotsearch.randomizedtesting.RandomizedRunner$10.evaluate(RandomizedRunner.java:1009)
> at com.carrotsearch.randomizedtesting.rules.SystemPropertiesRestoreRule$1.evaluate(SystemPropertiesRestoreRule.java:80)
> at org.junit.rules.RunRules.evaluate(RunRules.java:20)
> at org.apache.lucene.tests.util.TestRuleSetupTeardownChained$1.evaluate(TestRuleSetupTeardownChained.java:48)
> at org.apache.lucene.tests.util.AbstractBeforeAfterRule$1.evaluate(AbstractBeforeAfterRule.java:43)
> at org.apache.lucene.tests.util.TestRuleThreadAndTestName$1.evaluate(TestRuleThreadAndTestName.java:45)
> at org.apache.lucene.tests.util.TestRuleIgnoreAfterMaxFailures$1.evaluate(TestRuleIgnoreAfterMaxFailures.java:60)
> at org.apache.lucene.tests.util.TestRuleMarkFailure$1.evaluate(TestRuleMarkFailure.java:44)
> at org.junit.rules.RunRules.evaluate(RunRules.java:20)
> at com.carrotsearch.randomizedtesting.rules.StatementAdapter.evaluate(StatementAdapter.java:36)
> at com.carrotsearch.randomizedtesting.ThreadLeakControl$StatementRunner.run(ThreadLeakControl.java:390)
> at com.carrotsearch.randomizedtesting.ThreadLeakControl.forkTimeoutingTask(ThreadLeakControl.java:843)
> at com.carrotsearch.randomizedtesting.ThreadLeakControl$3.evaluate(ThreadLeakControl.java:490)
> at com.carrotsearch.randomizedtesting.RandomizedRunner.runSingleTest(RandomizedRunner.java:968)
> at com.carrotsearch.randomizedtesting.RandomizedRunner$5.evaluate(RandomizedRunner.java:853)
> at com.carrotsearch.randomizedtesting.RandomizedRunner$6.evaluate(RandomizedRunner.java:904)
> at com.carrotsearch.randomizedtesting.RandomizedRunner$7.evaluate(RandomizedRunner.java:915)
> at com.carrotsearch.randomizedtesting.rules.StatementAdapter.evaluate(StatementAdapter.java:36)
> at com.carrotsearch.randomizedtesting.rules.StatementAdapter.evaluate(StatementAdapter.java:36)
> at org.apache.lucene.tests.util.AbstractBeforeAfterRule$1.evaluate(AbstractBeforeAfterRule.java:43)
> at com.carrotsearch.randomizedtesting.rules.SystemPropertiesRestoreRule$1.evaluate(SystemPropertiesRestoreRule.java:80)
> at org.junit.rules.RunRules.evaluate(RunRules.java:20)
> at org.apache.lucene.tests.util.AbstractBeforeAfterRule$1.evaluate(AbstractBeforeAfterRule.java:43)
> at com.carrotsearch.randomizedtesting.rules.StatementAdapter.evaluate(StatementAdapter.java:36)
> at org.apache.lucene.tests.util.TestRuleStoreClassName$1.evaluate(TestRuleStoreClassName.java:38)
> at com.carrotsearch.randomizedtesting.rules.NoShadowingOrOverridesOnMethodsRule$1.evaluate(NoShadowingOrOverridesOnMethodsRule.java:40)
> at com.carrotsearch.randomizedtesting.rules.NoShadowingOrOverridesOnMethodsRule$1.evaluate(NoShadowingOrOverridesOnMethodsRule.java:40)
> at com.carrotsearch.randomizedtesting.rules.StatementAdapter.evaluate(StatementAdapter.java:36)
> at com.carrotsearch.randomizedtesting.rules.StatementAdapter.evaluate(StatementAdapter.java:36)
> at org.apache.lucene.tests.util.TestRuleAssertionsRequired$1.evaluate(TestRuleAssertionsRequired.java:53)
> at org.apache.lucene.tests.util.AbstractBeforeAfterRule$1.evaluate(AbstractBeforeAfterRule.java:43)
> at org.apache.lucene.tests.util.TestRuleMarkFailure$1.evaluate(TestRuleMarkFailure.java:44)
> at org.apache.lucene.tests.util.TestRuleIgnoreAfterMaxFailures$1.evaluate(TestRuleIgnoreAfterMaxFailures.java:60)
> at org.apache.lucene.tests.util.TestRuleIgnoreTestSuites$1.evaluate(TestRuleIgnoreTestSuites.java:47)
> at org.junit.rules.RunRules.evaluate(RunRules.java:20)
> at com.carrotsearch.randomizedtesting.rules.StatementAdapter.evaluate(StatementAdapter.java:36)
> at com.carrotsearch.randomizedtesting.ThreadLeakControl$StatementRunner.run(ThreadLeakControl.java:390)
> at com.carrotsearch.randomizedtesting.ThreadLeakControl.lambda$forkTimeoutingTask$0(ThreadLeakControl.java:850)
> at java.base/java.lang.Thread.run(Thread.java:1583)
2> NOTE: reproduce with: gradlew test --tests TestIntervalsQParserPlugin.testIntervalsRegexpRule -Dtests.seed=1E41B9646E3C9E70 -Dtests.multiplier=2 -Dtests.locale=kn-IN -Dtests.timezone=Antarctica/DumontDUrville -Dtests.asserts=true -Dtests.file.encoding=UTF-8
2> 826827 INFO (TEST-TestIntervalsQParserPlugin.testIntervalsTermRule-seed#[1E41B9646E3C9E70]) [] o.a.s.SolrTestCaseJ4 ###Starting testIntervalsTermRule
2> 826828 INFO (TEST-TestIntervalsQParserPlugin.testIntervalsTermRule-seed#[1E41B9646E3C9E70]) [ x:collection1] o.a.s.u.p.LogUpdateProcessorFactory path=/update params={{params(wt=xml),defaults(wt=xml)}}{add=[40 (1872918478428569600)]} 0 0
2> 826828 INFO (TEST-TestIntervalsQParserPlugin.testIntervalsTermRule-seed#[1E41B9646E3C9E70]) [ x:collection1] o.a.s.u.p.LogUpdateProcessorFactory path=/update params={{params(wt=xml),defaults(wt=xml)}}{add=[41 (1872918478429618176)]} 0 0
2> 826832 INFO (searcherExecutor-14267-thread-1-processing-collection1) [ x:collection1] o.a.s.c.SolrCore Registered new searcher autowarm time: 0 ms
2> 826832 INFO (TEST-TestIntervalsQParserPlugin.testIntervalsTermRule-seed#[1E41B9646E3C9E70]) [ x:collection1] o.a.s.u.p.LogUpdateProcessorFactory path=/update params={{params(wt=xml),defaults(wt=xml)}}{commit=} 0 3
2> 826833 INFO (TEST-TestIntervalsQParserPlugin.testIntervalsTermRule-seed#[1E41B9646E3C9E70]) [] o.a.s.c.S.Request path=null params={wt=xml} hits=1 status=0 QTime=0
2> 826833 INFO (TEST-TestIntervalsQParserPlugin.testIntervalsTermRule-seed#[1E41B9646E3C9E70]) [] o.a.s.SolrTestCaseJ4 ###Ending testIntervalsTermRule
2> 826837 INFO (TEST-TestIntervalsQParserPlugin.testIntervalsNoIntervalsRule-seed#[1E41B9646E3C9E70]) [] o.a.s.SolrTestCaseJ4 ###Starting testIntervalsNoIntervalsRule
2> 826837 INFO (TEST-TestIntervalsQParserPlugin.testIntervalsNoIntervalsRule-seed#[1E41B9646E3C9E70]) [ x:collection1] o.a.s.u.p.LogUpdateProcessorFactory path=/update params={{params(wt=xml),defaults(wt=xml)}}{add=[140 (1872918478439055360)]} 0 0
2> 826844 INFO (searcherExecutor-14267-thread-1-processing-collection1) [ x:collection1] o.a.s.c.SolrCore Registered new searcher autowarm time: 0 ms
2> 826844 INFO (TEST-TestIntervalsQParserPlugin.testIntervalsNoIntervalsRule-seed#[1E41B9646E3C9E70]) [ x:collection1] o.a.s.u.p.LogUpdateProcessorFactory path=/update params={{params(wt=xml),defaults(wt=xml)}}{commit=} 0 6
2> 826845 INFO (TEST-TestIntervalsQParserPlugin.testIntervalsNoIntervalsRule-seed#[1E41B9646E3C9E70]) [] o.a.s.c.S.Request path=null params={wt=xml} hits=0 status=0 QTime=0
2> 826845 INFO (TEST-TestIntervalsQParserPlugin.testIntervalsNoIntervalsRule-seed#[1E41B9646E3C9E70]) [] o.a.s.SolrTestCaseJ4 ###Ending testIntervalsNoIntervalsRule
2> 826849 INFO (TEST-TestIntervalsQParserPlugin.testIntervalsRangeRule-seed#[1E41B9646E3C9E70]) [] o.a.s.SolrTestCaseJ4 ###Starting testIntervalsRangeRule
2> 826849 INFO (TEST-TestIntervalsQParserPlugin.testIntervalsRangeRule-seed#[1E41B9646E3C9E70]) [ x:collection1] o.a.s.u.p.LogUpdateProcessorFactory path=/update params={{params(wt=xml),defaults(wt=xml)}}{add=[70 (1872918478451638272)]} 0 0
2> 826850 INFO (TEST-TestIntervalsQParserPlugin.testIntervalsRangeRule-seed#[1E41B9646E3C9E70]) [ x:collection1] o.a.s.u.p.LogUpdateProcessorFactory path=/update params={{params(wt=xml),defaults(wt=xml)}}{add=[71 (1872918478452686848)]} 0 0
2> 826850 INFO (TEST-TestIntervalsQParserPlugin.testIntervalsRangeRule-seed#[1E41B9646E3C9E70]) [ x:collection1] o.a.s.u.p.LogUpdateProcessorFactory path=/update params={{params(wt=xml),defaults(wt=xml)}}{add=[72 (1872918478452686849)]} 0 0
2> 826851 INFO (TEST-TestIntervalsQParserPlugin.testIntervalsRangeRule-seed#[1E41B9646E3C9E70]) [ x:collection1] o.a.s.u.p.LogUpdateProcessorFactory path=/update params={{params(wt=xml),defaults(wt=xml)}}{add=[73 (1872918478453735424)]} 0 0
2> 826854 INFO (searcherExecutor-14267-thread-1-processing-collection1) [ x:collection1] o.a.s.c.SolrCore Registered new searcher autowarm time: 0 ms
2> 826854 INFO (TEST-TestIntervalsQParserPlugin.testIntervalsRangeRule-seed#[1E41B9646E3C9E70]) [ x:collection1] o.a.s.u.p.LogUpdateProcessorFactory path=/update params={{params(wt=xml),defaults(wt=xml)}}{commit=} 0 3
2> 826855 INFO (TEST-TestIntervalsQParserPlugin.testIntervalsRangeRule-seed#[1E41B9646E3C9E70]) [] o.a.s.c.S.Request path=null params={wt=xml} hits=2 status=0 QTime=0
2> 826855 INFO (TEST-TestIntervalsQParserPlugin.testIntervalsRangeRule-seed#[1E41B9646E3C9E70]) [] o.a.s.u.ErrorLogMuter Creating ErrorLogMuter-regex-409 for ERROR logs matching regex: .
2> 826856 INFO (TEST-TestIntervalsQParserPlugin.testIntervalsRangeRule-seed#[1E41B9646E3C9E70]) [] o.a.s.c.S.Request path=null params={json={query:{intervals:{use_field:v_ws,range:{lower_term:rng_bbbb,upper_term:rng_cccc,include_lower:true,include_upper:true,max_expansions:-1}}},fields:id}&wt=xml} status=400 QTime=0
2> 826857 INFO (TEST-TestIntervalsQParserPlugin.testIntervalsRangeRule-seed#[1E41B9646E3C9E70]) [] o.a.s.u.ErrorLogMuter Closing ErrorLogMuter-regex-409 after muting 1 log messages
2> 826857 INFO (TEST-TestIntervalsQParserPlugin.testIntervalsRangeRule-seed#[1E41B9646E3C9E70]) [] o.a.s.SolrTestCaseJ4 ###Ending testIntervalsRangeRule
2> 826861 INFO (TEST-TestIntervalsQParserPlugin.testIntervalsPrefixRuleNonexistentDfFieldThrows-seed#[1E41B9646E3C9E70]) [] o.a.s.SolrTestCaseJ4 ###Starting testIntervalsPrefixRuleNonexistentDfFieldThrows
2> 826861 INFO (TEST-TestIntervalsQParserPlugin.testIntervalsPrefixRuleNonexistentDfFieldThrows-seed#[1E41B9646E3C9E70]) [] o.a.s.u.ErrorLogMuter Creating ErrorLogMuter-regex-410 for ERROR logs matching regex: .
2> 826862 INFO (TEST-TestIntervalsQParserPlugin.testIntervalsPrefixRuleNonexistentDfFieldThrows-seed#[1E41B9646E3C9E70]) [] o.a.s.c.S.Request path=null params={json={query:{intervals:{use_field:no_such_field,+prefix:{prefix:foo}}},fields:id}&wt=xml} status=400 QTime=0
2> 826862 INFO (TEST-TestIntervalsQParserPlugin.testIntervalsPrefixRuleNonexistentDfFieldThrows-seed#[1E41B9646E3C9E70]) [] o.a.s.u.ErrorLogMuter Closing ErrorLogMuter-regex-410 after muting 1 log messages
2> 826862 INFO (TEST-TestIntervalsQParserPlugin.testIntervalsPrefixRuleNonexistentDfFieldThrows-seed#[1E41B9646E3C9E70]) [] o.a.s.SolrTestCaseJ4 ###Ending testIntervalsPrefixRuleNonexistentDfFieldThrows
2> 826866 INFO (TEST-TestIntervalsQParserPlugin.testIntervalsPhraseRuleWithIntervals-seed#[1E41B9646E3C9E70]) [] o.a.s.SolrTestCaseJ4 ###Starting testIntervalsPhraseRuleWithIntervals
2> 826867 INFO (TEST-TestIntervalsQParserPlugin.testIntervalsPhraseRuleWithIntervals-seed#[1E41B9646E3C9E70]) [ x:collection1] o.a.s.u.p.LogUpdateProcessorFactory path=/update params={{params(wt=xml),defaults(wt=xml)}}{add=[52 (1872918478469464064)]} 0 0
2> 826867 INFO (TEST-TestIntervalsQParserPlugin.testIntervalsPhraseRuleWithIntervals-seed#[1E41B9646E3C9E70]) [ x:collection1] o.a.s.u.p.LogUpdateProcessorFactory path=/update params={{params(wt=xml),defaults(wt=xml)}}{add=[53 (1872918478470512640)]} 0 0
2> 826871 INFO (searcherExecutor-14267-thread-1-processing-collection1) [ x:collection1] o.a.s.c.SolrCore Registered new searcher autowarm time: 0 ms
2> 826871 INFO (TEST-TestIntervalsQParserPlugin.testIntervalsPhraseRuleWithIntervals-seed#[1E41B9646E3C9E70]) [ x:collection1] o.a.s.u.p.LogUpdateProcessorFactory path=/update params={{params(wt=xml),defaults(wt=xml)}}{commit=} 0 3
2> 826872 INFO (TEST-TestIntervalsQParserPlugin.testIntervalsPhraseRuleWithIntervals-seed#[1E41B9646E3C9E70]) [] o.a.s.c.S.Request path=null params={wt=xml} hits=1 status=0 QTime=0
2> 826872 INFO (TEST-TestIntervalsQParserPlugin.testIntervalsPhraseRuleWithIntervals-seed#[1E41B9646E3C9E70]) [] o.a.s.u.ErrorLogMuter Creating ErrorLogMuter-regex-411 for ERROR logs matching regex: .
2> 826873 INFO (TEST-TestIntervalsQParserPlugin.testIntervalsPhraseRuleWithIntervals-seed#[1E41B9646E3C9E70]) [] o.a.s.c.S.Request path=null params={json={query:{intervals:{use_field:v_ws,phrase:{terms:[phrB_quick,phrB_brown],intervals:[{term:{value:phrB_quick}},{term:{value:phrB_brown}}]}}},fields:id}&wt=xml} status=400 QTime=0
2> 826873 INFO (TEST-TestIntervalsQParserPlugin.testIntervalsPhraseRuleWithIntervals-seed#[1E41B9646E3C9E70]) [] o.a.s.u.ErrorLogMuter Closing ErrorLogMuter-regex-411 after muting 1 log messages
2> 826873 INFO (TEST-TestIntervalsQParserPlugin.testIntervalsPhraseRuleWithIntervals-seed#[1E41B9646E3C9E70]) [] o.a.s.SolrTestCaseJ4 ###Ending testIntervalsPhraseRuleWithIntervals
2> 826897 INFO (TEST-TestIntervalsQParserPlugin.testIntervalsUnorderedNoOverlapsRule-seed#[1E41B9646E3C9E70]) [] o.a.s.SolrTestCaseJ4 ###Starting testIntervalsUnorderedNoOverlapsRule
2> 826898 INFO (TEST-TestIntervalsQParserPlugin.testIntervalsUnorderedNoOverlapsRule-seed#[1E41B9646E3C9E70]) [ x:collection1] o.a.s.u.p.LogUpdateProcessorFactory path=/update params={{params(wt=xml),defaults(wt=xml)}}{add=[100 (1872918478501969920)]} 0 0
2> 826899 INFO (TEST-TestIntervalsQParserPlugin.testIntervalsUnorderedNoOverlapsRule-seed#[1E41B9646E3C9E70]) [ x:collection1] o.a.s.u.p.LogUpdateProcessorFactory path=/update params={{params(wt=xml),defaults(wt=xml)}}{add=[101 (1872918478503018496)]} 0 0
2> 826899 INFO (TEST-TestIntervalsQParserPlugin.testIntervalsUnorderedNoOverlapsRule-seed#[1E41B9646E3C9E70]) [ x:collection1] o.a.s.u.p.LogUpdateProcessorFactory path=/update params={{params(wt=xml),defaults(wt=xml)}}{add=[102 (1872918478504067072)]} 0 0
2> 826903 INFO (searcherExecutor-14267-thread-1-processing-collection1) [ x:collection1] o.a.s.c.SolrCore Registered new searcher autowarm time: 0 ms
2> 826903 INFO (TEST-TestIntervalsQParserPlugin.testIntervalsUnorderedNoOverlapsRule-seed#[1E41B9646E3C9E70]) [ x:collection1] o.a.s.u.p.LogUpdateProcessorFactory path=/update params={{params(wt=xml),defaults(wt=xml)}}{commit=} 0 3
2> 826904 INFO (TEST-TestIntervalsQParserPlugin.testIntervalsUnorderedNoOverlapsRule-seed#[1E41B9646E3C9E70]) [] o.a.s.c.S.Request path=null params={wt=xml} hits=2 status=0 QTime=0
2> 826904 INFO (TEST-TestIntervalsQParserPlugin.testIntervalsUnorderedNoOverlapsRule-seed#[1E41B9646E3C9E70]) [] o.a.s.SolrTestCaseJ4 ###Ending testIntervalsUnorderedNoOverlapsRule
2> 826908 INFO (TEST-TestIntervalsQParserPlugin.testIntervalsMaxWidthRule-seed#[1E41B9646E3C9E70]) [] o.a.s.SolrTestCaseJ4 ###Starting testIntervalsMaxWidthRule
2> 826909 INFO (TEST-TestIntervalsQParserPlugin.testIntervalsMaxWidthRule-seed#[1E41B9646E3C9E70]) [ x:collection1] o.a.s.u.p.LogUpdateProcessorFactory path=/update params={{params(wt=xml),defaults(wt=xml)}}{add=[80 (1872918478513504256)]} 0 0
2> 826909 INFO (TEST-TestIntervalsQParserPlugin.testIntervalsMaxWidthRule-seed#[1E41B9646E3C9E70]) [ x:collection1] o.a.s.u.p.LogUpdateProcessorFactory path=/update params={{params(wt=xml),defaults(wt=xml)}}{add=[81 (1872918478514552832)]} 0 0
2> 826913 INFO (searcherExecutor-14267-thread-1-processing-collection1) [ x:collection1] o.a.s.c.SolrCore Registered new searcher autowarm time: 0 ms
2> 826913 INFO (TEST-TestIntervalsQParserPlugin.testIntervalsMaxWidthRule-seed#[1E41B9646E3C9E70]) [ x:collection1] o.a.s.u.p.LogUpdateProcessorFactory path=/update params={{params(wt=xml),defaults(wt=xml)}}{commit=} 0 4
2> 826914 INFO (TEST-TestIntervalsQParserPlugin.testIntervalsMaxWidthRule-seed#[1E41B9646E3C9E70]) [] o.a.s.c.S.Request path=null params={wt=xml} hits=1 status=0 QTime=0
2> 826914 INFO (TEST-TestIntervalsQParserPlugin.testIntervalsMaxWidthRule-seed#[1E41B9646E3C9E70]) [] o.a.s.SolrTestCaseJ4 ###Ending testIntervalsMaxWidthRule
2> 826918 INFO (TEST-TestIntervalsQParserPlugin.testIntervalsLegacyFieldInJsonQueryThrows-seed#[1E41B9646E3C9E70]) [] o.a.s.SolrTestCaseJ4 ###Starting testIntervalsLegacyFieldInJsonQueryThrows
2> 826919 INFO (TEST-TestIntervalsQParserPlugin.testIntervalsLegacyFieldInJsonQueryThrows-seed#[1E41B9646E3C9E70]) [ x:collection1] o.a.s.u.p.LogUpdateProcessorFactory path=/update params={{params(wt=xml),defaults(wt=xml)}}{add=[160 (1872918478523990016)]} 0 0
2> 826923 INFO (searcherExecutor-14267-thread-1-processing-collection1) [ x:collection1] o.a.s.c.SolrCore Registered new searcher autowarm time: 0 ms
2> 826923 INFO (TEST-TestIntervalsQParserPlugin.testIntervalsLegacyFieldInJsonQueryThrows-seed#[1E41B9646E3C9E70]) [ x:collection1] o.a.s.u.p.LogUpdateProcessorFactory path=/update params={{params(wt=xml),defaults(wt=xml)}}{commit=} 0 3
2> 826923 INFO (TEST-TestIntervalsQParserPlugin.testIntervalsLegacyFieldInJsonQueryThrows-seed#[1E41B9646E3C9E70]) [] o.a.s.u.ErrorLogMuter Creating ErrorLogMuter-regex-412 for ERROR logs matching regex: .
2> 826924 INFO (TEST-TestIntervalsQParserPlugin.testIntervalsLegacyFieldInJsonQueryThrows-seed#[1E41B9646E3C9E70]) [] o.a.s.c.S.Request path=null params={json={query:{intervals:{use_field:v_ws,+v_ws:{term:{value:bkc_alpha}}}},fields:id}&wt=xml} status=400 QTime=0
2> 826925 INFO (TEST-TestIntervalsQParserPlugin.testIntervalsLegacyFieldInJsonQueryThrows-seed#[1E41B9646E3C9E70]) [] o.a.s.u.ErrorLogMuter Closing ErrorLogMuter-regex-412 after muting 1 log messages
2> 826925 INFO (TEST-TestIntervalsQParserPlugin.testIntervalsLegacyFieldInJsonQueryThrows-seed#[1E41B9646E3C9E70]) [] o.a.s.SolrTestCaseJ4 ###Ending testIntervalsLegacyFieldInJsonQueryThrows
2> 826928 INFO (TEST-TestIntervalsQParserPlugin.testIntervalsDfFallbackFromQueryParam-seed#[1E41B9646E3C9E70]) [] o.a.s.SolrTestCaseJ4 ###Starting testIntervalsDfFallbackFromQueryParam
2> 826929 INFO (TEST-TestIntervalsQParserPlugin.testIntervalsDfFallbackFromQueryParam-seed#[1E41B9646E3C9E70]) [ x:collection1] o.a.s.u.p.LogUpdateProcessorFactory path=/update params={{params(wt=xml),defaults(wt=xml)}}{add=[150 (1872918478535524352)]} 0 0
2> 826930 INFO (TEST-TestIntervalsQParserPlugin.testIntervalsDfFallbackFromQueryParam-seed#[1E41B9646E3C9E70]) [ x:collection1] o.a.s.u.p.LogUpdateProcessorFactory path=/update params={{params(wt=xml),defaults(wt=xml)}}{add=[151 (1872918478536572928)]} 0 0
2> 826938 INFO (searcherExecutor-14267-thread-1-processing-collection1) [ x:collection1] o.a.s.c.SolrCore Registered new searcher autowarm time: 0 ms
2> 826939 INFO (TEST-TestIntervalsQParserPlugin.testIntervalsDfFallbackFromQueryParam-seed#[1E41B9646E3C9E70]) [ x:collection1] o.a.s.u.p.LogUpdateProcessorFactory path=/update params={{params(wt=xml),defaults(wt=xml)}}{commit=} 0 8
2> 826939 INFO (TEST-TestIntervalsQParserPlugin.testIntervalsDfFallbackFromQueryParam-seed#[1E41B9646E3C9E70]) [] o.a.s.c.S.Request path=null params={wt=xml} hits=1 status=0 QTime=0
2> 826939 INFO (TEST-TestIntervalsQParserPlugin.testIntervalsDfFallbackFromQueryParam-seed#[1E41B9646E3C9E70]) [] o.a.s.SolrTestCaseJ4 ###Ending testIntervalsDfFallbackFromQueryParam
2> 826943 INFO (TEST-TestIntervalsQParserPlugin.testIntervalsMissingJsonBodyThrows-seed#[1E41B9646E3C9E70]) [] o.a.s.SolrTestCaseJ4 ###Starting testIntervalsMissingJsonBodyThrows
2> 826944 INFO (TEST-TestIntervalsQParserPlugin.testIntervalsMissingJsonBodyThrows-seed#[1E41B9646E3C9E70]) [ x:collection1] o.a.s.u.p.LogUpdateProcessorFactory path=/update params={{params(wt=xml),defaults(wt=xml)}}{add=[2 (1872918478550204416)]} 0 0
2> 826948 INFO (searcherExecutor-14267-thread-1-processing-collection1) [ x:collection1] o.a.s.c.SolrCore Registered new searcher autowarm time: 0 ms
2> 826948 INFO (TEST-TestIntervalsQParserPlugin.testIntervalsMissingJsonBodyThrows-seed#[1E41B9646E3C9E70]) [ x:collection1] o.a.s.u.p.LogUpdateProcessorFactory path=/update params={{params(wt=xml),defaults(wt=xml)}}{commit=} 0 3
2> 826948 INFO (TEST-TestIntervalsQParserPlugin.testIntervalsMissingJsonBodyThrows-seed#[1E41B9646E3C9E70]) [] o.a.s.u.ErrorLogMuter Creating ErrorLogMuter-regex-413 for ERROR logs matching regex: .
2> 826949 INFO (TEST-TestIntervalsQParserPlugin.testIntervalsMissingJsonBodyThrows-seed#[1E41B9646E3C9E70]) [] o.a.s.c.S.Request path=null params={q={!intervals+df%3Dv_t}&wt=xml} status=400 QTime=0
2> 826949 INFO (TEST-TestIntervalsQParserPlugin.testIntervalsMissingJsonBodyThrows-seed#[1E41B9646E3C9E70]) [] o.a.s.u.ErrorLogMuter Closing ErrorLogMuter-regex-413 after muting 1 log messages
2> 826949 INFO (TEST-TestIntervalsQParserPlugin.testIntervalsMissingJsonBodyThrows-seed#[1E41B9646E3C9E70]) [] o.a.s.SolrTestCaseJ4 ###Ending testIntervalsMissingJsonBodyThrows
2> 826950 INFO (SUITE-TestIntervalsQParserPlugin-seed#[1E41B9646E3C9E70]-worker) [] o.a.s.SolrTestCaseJ4 ###deleteCore
2> 826950 INFO (SUITE-TestIntervalsQParserPlugin-seed#[1E41B9646E3C9E70]-worker) [] o.a.s.c.CoreContainer Shutting down CoreContainer instance=891492753
2> 826950 INFO (coreCloseExecutor-14273-thread-1) [ x:collection1] o.a.s.c.SolrCore CLOSING SolrCore org.apache.solr.core.SolrCore@4eccfe92 collection1
2> 826950 INFO (coreCloseExecutor-14273-thread-1) [ x:collection1] o.a.s.u.DirectUpdateHandler2 Committing on IndexWriter.close() ... SKIPPED (unnecessary).
2> 826953 INFO (SUITE-TestIntervalsQParserPlugin-seed#[1E41B9646E3C9E70]-worker) [] o.a.s.u.ErrorLogMuter Closing ErrorLogMuter-regex-402 after muting 0 log messages
2> 826953 INFO (SUITE-TestIntervalsQParserPlugin-seed#[1E41B9646E3C9E70]-worker) [] o.a.s.u.ErrorLogMuter Creating ErrorLogMuter-regex-414 for ERROR logs matching regex: ignore_exception
2> NOTE: leaving temporary files on disk at: /home/jenkins/jenkins-agent/workspace/Solr/Solr-Test-10.x/solr/core/build/tmp/tests-tmp/org.apache.solr.search.TestIntervalsQParserPlugin_1E41B9646E3C9E70-001
2> NOTE: test params are: codec=CheapBastard, sim=Asserting(RandomSimilarity(queryNorm=false): {}), locale=kn-IN, timezone=Antarctica/DumontDUrville
2> NOTE: Linux 6.8.0-137-generic amd64/Eclipse Adoptium 21.0.4 (64-bit)/cpus=1,threads=1,free=147411720,total=509083648
2> NOTE: All tests run in this JVM: [CursorPagingTest, HelloWorldSolrCloudTestCase, SolrInfoBeanTest, TestCrossCoreJoin, TestDistributedMissingSort, TestHighlightDedupGrouping, TestSimpleTrackingShardHandler, PathHierarchyTokenizerFactoryTest, TestReversedWildcardFilterFactory, NodeConfigClusterPluginsSourceTest, ApiToolTest, CreateToolTest, PostLogsToolTest, SolrProcessManagerTest, TestSolrCLIRunExample, TestEmbeddedSo
[...truncated too long message...]
r adding Permission, java.net.URLPermission:
java.util.ServiceConfigurationError: Locale provider adapter "CLDR"cannot be instantiated.
java.security.policy: error adding Permission, java.net.URLPermission:
java.util.ServiceConfigurationError: Locale provider adapter "CLDR"cannot be instantiated.
java.security.policy: error adding Permission, java.net.URLPermission:
java.util.ServiceConfigurationError: Locale provider adapter "CLDR"cannot be instantiated.
java.security.policy: error adding Permission, java.net.URLPermission:
java.util.ServiceConfigurationError: Locale provider adapter "CLDR"cannot be instantiated.
java.security.policy: error adding Permission, java.net.URLPermission:
java.util.ServiceConfigurationError: Locale provider adapter "CLDR"cannot be instantiated.
java.security.policy: error adding Permission, java.net.URLPermission:
java.util.ServiceConfigurationError: Locale provider adapter "CLDR"cannot be instantiated.
java.security.policy: error adding Permission, java.net.URLPermission:
java.util.ServiceConfigurationError: Locale provider adapter "CLDR"cannot be instantiated.
java.security.policy: error adding Permission, java.net.URLPermission:
java.util.ServiceConfigurationError: Locale provider adapter "CLDR"cannot be instantiated.
java.security.policy: error adding Permission, java.net.URLPermission:
java.util.ServiceConfigurationError: Locale provider adapter "CLDR"cannot be instantiated.
java.security.policy: error adding Permission, java.net.URLPermission:
java.util.ServiceConfigurationError: Locale provider adapter "CLDR"cannot be instantiated.
java.security.policy: error adding Permission, java.net.URLPermission:
java.util.ServiceConfigurationError: Locale provider adapter "CLDR"cannot be instantiated.
java.security.policy: error adding Permission, java.net.URLPermission:
java.util.ServiceConfigurationError: Locale provider adapter "CLDR"cannot be instantiated.
java.security.policy: error adding Permission, java.net.URLPermission:
java.util.ServiceConfigurationError: Locale provider adapter "CLDR"cannot be instantiated.
java.security.policy: error adding Permission, java.net.URLPermission:
java.util.ServiceConfigurationError: Locale provider adapter "CLDR"cannot be instantiated.
java.security.policy: error adding Permission, java.net.URLPermission:
java.util.ServiceConfigurationError: Locale provider adapter "CLDR"cannot be instantiated.
java.security.policy: error adding Permission, java.net.URLPermission:
java.util.ServiceConfigurationError: Locale provider adapter "CLDR"cannot be instantiated.
java.security.policy: error adding Permission, java.net.URLPermission:
java.util.ServiceConfigurationError: Locale provider adapter "CLDR"cannot be instantiated.
java.security.policy: error adding Permission, java.net.URLPermission:
java.util.ServiceConfigurationError: Locale provider adapter "CLDR"cannot be instantiated.
java.security.policy: error adding Permission, java.net.URLPermission:
java.util.ServiceConfigurationError: Locale provider adapter "CLDR"cannot be instantiated.
:solr:modules:scripting:test (SUCCESS): 24 test(s), 19 skipped
> Task :solr:modules:scripting:wipeTaskTemp
> Task :solr:modules:sql:compileTestJava
> Task :solr:modules:sql:testClasses
> Task :solr:modules:sql:test
WARNING: Using incubator modules: jdk.incubator.vector
WARNING: Using incubator modules: jdk.incubator.vector
WARNING: Using incubator modules: jdk.incubator.vector
WARNING: A command line option has enabled the Security Manager
WARNING: The Security Manager is deprecated and will be removed in a future release
WARNING: A command line option has enabled the Security Manager
WARNING: The Security Manager is deprecated and will be removed in a future release
WARNING: A command line option has enabled the Security Manager
WARNING: The Security Manager is deprecated and will be removed in a future release
java.security.policy: error adding Permission, java.net.URLPermission:
java.security.policy: error adding Permission, java.net.URLPermission:
java.util.ServiceConfigurationError: Locale provider adapter "CLDR"cannot be instantiated.
java.util.ServiceConfigurationError: Locale provider adapter "CLDR"cannot be instantiated.
java.security.policy: error adding Permission, java.net.URLPermission:
java.util.ServiceConfigurationError: Locale provider adapter "CLDR"cannot be instantiated.
java.security.policy: error adding Permission, java.net.URLPermission:
java.util.ServiceConfigurationError: Locale provider adapter "CLDR"cannot be instantiated.
java.security.policy: error adding Permission, java.net.URLPermission:
java.security.policy: error adding Permission, java.net.URLPermission:
java.util.ServiceConfigurationError: Locale provider adapter "CLDR"cannot be instantiated.
java.util.ServiceConfigurationError: Locale provider adapter "CLDR"cannot be instantiated.
java.security.policy: error adding Permission, java.net.URLPermission:
java.util.ServiceConfigurationError: Locale provider adapter "CLDR"cannot be instantiated.
java.security.policy: error adding Permission, java.net.URLPermission:
java.util.ServiceConfigurationError: Locale provider adapter "CLDR"cannot be instantiated.
java.security.policy: error adding Permission, java.net.URLPermission:
java.security.policy: error adding Permission, java.net.URLPermission:
java.util.ServiceConfigurationError: Locale provider adapter "CLDR"cannot be instantiated.
java.util.ServiceConfigurationError: Locale provider adapter "CLDR"cannot be instantiated.
java.security.policy: error adding Permission, java.net.URLPermission:
java.util.ServiceConfigurationError: Locale provider adapter "CLDR"cannot be instantiated.
java.security.policy: error adding Permission, java.net.URLPermission:
java.util.ServiceConfigurationError: Locale provider adapter "CLDR"cannot be instantiated.
java.security.policy: error adding Permission, java.net.URLPermission:
java.util.ServiceConfigurationError: Locale provider adapter "CLDR"cannot be instantiated.
java.security.policy: error adding Permission, java.net.URLPermission:
java.util.ServiceConfigurationError: Locale provider adapter "CLDR"cannot be instantiated.
java.security.policy: error adding Permission, java.net.URLPermission:
java.util.ServiceConfigurationError: Locale provider adapter "CLDR"cannot be instantiated.
:solr:modules:sql:test (SUCCESS): 34 test(s)
> Task :checkWorkingCopyClean
> Task :solr:modules:sql:wipeTaskTemp
The slowest tests (exceeding 500 ms) during this run:
65.84s TestCpuAllowedLimit.testDistribLimit2 (:solr:core)
55.34s TestCpuAllowedLimit.testDistribLimit (:solr:core)
53.72s TestCloudJSONFacetSKG.testRandom (:solr:core)
52.53s SolrIndexFingerprintTest.testSequentialVsParallelFingerprint (:solr:core)
51.54s TestRandomCollapseQParserPlugin.testRandomCollapseWithSort (:solr:core)
45.22s TestInPlaceUpdatesDistrib.test (:solr:core)
40.56s UnloadDistributedZkTest.test (:solr:core)
40.15s HttpJettySolrClientTest.testIdleTimeoutWithHttpClient (:solr:solrj-jetty)
39.83s TestRandomFaceting.testRandomFaceting (:solr:core)
38.33s BasicDistributedZkTest.test (:solr:core)
The slowest suites (exceeding 1s) during this run:
126.00s TestCpuAllowedLimit (:solr:core)
64.76s KnnQParserTest (:solr:core)
64.23s TestRecovery (:solr:core)
62.70s TestTlogReplica (:solr:core)
62.09s TestCoordinatorRole (:solr:core)
60.58s MultiThreadedOCPTest (:solr:core)
58.72s SolrIndexFingerprintTest (:solr:core)
57.91s TestCloudJSONFacetSKG (:solr:core)
57.80s TestRangeQuery (:solr:core)
57.62s ReindexCollectionTest (:solr:core)
ERROR: The following test(s) have failed:
- org.apache.solr.search.TestIntervalsQParserPlugin.testIntervalsRegexpRule (:solr:core)
Test history: https://develocity.apache.org/scans/tests?search.rootProjectNames=solr-root&tests.container=org.apache.solr.search.TestIntervalsQParserPlugin&tests.test=testIntervalsRegexpRule http://fucit.org/solr-jenkins-reports/history-trend-of-recent-failures.html#series/org.apache.solr.search.TestIntervalsQParserPlugin.testIntervalsRegexpRule
Test output: /home/jenkins/jenkins-agent/workspace/Solr/Solr-Test-10.x/solr/core/build/test-results/test/outputs/OUTPUT-org.apache.solr.search.TestIntervalsQParserPlugin.txt
Reproduce with: ./gradlew :solr:core:test --tests "org.apache.solr.search.TestIntervalsQParserPlugin.testIntervalsRegexpRule" -Ptests.haltonfailure=false "-Ptests.jvmargs=-XX:TieredStopAtLevel=1 -XX:+UseParallelGC -XX:ActiveProcessorCount=1 -XX:ReservedCodeCacheSize=120m" -Ptests.seed=1E41B9646E3C9E70 -Ptests.multiplier=2 -Ptests.useSecurityManager=true -Ptests.badapples=false -Ptests.file.encoding=ISO-8859-1
[Incubating] Problems report is available at: file:///home/jenkins/jenkins-agent/workspace/Solr/Solr-Test-10.x/build/reports/problems/problems-report.html
Deprecated Gradle features were used in this build, making it incompatible with Gradle 10.
You can use '--warning-mode all' to show the individual deprecation warnings and determine if they come from your own scripts or plugins.
For more on this, please refer to https://docs.gradle.org/9.6.0/userguide/command_line_interface.html#sec:command_line_warnings in the Gradle documentation.
BUILD SUCCESSFUL in 38m 57s
153 actionable tasks: 153 executed
Publishing Build Scan to Develocity...
The Develocity server (develocity.apache.org) rejected the credential with prefix '7x3jzizm4zpygv7psbkg6byvm4'.
Your credential has expired.
Build step 'Invoke Gradle script' changed build result to SUCCESS
Archiving artifacts
‘**/*.events’ doesn’t match anything: ‘**’ exists but not ‘**/*.events’
No artifacts found that match the file pattern "**/*.events,heapdumps/**,**/hs_err_pid*". Configuration error?
Recording test results
[Checks API] No suitable checks publisher found.
Build step 'Publish JUnit test result report' changed build result to UNSTABLE
Email was triggered for: Unstable (Test Failures)
Sending email for trigger: Unstable (Test Failures)