You are viewing a plain text version of this content. The canonical link for it is here.
Posted to commits@phoenix.apache.org by Apache Jenkins Server <je...@builds.apache.org> on 2015/11/13 01:00:30 UTC

Build failed in Jenkins: Phoenix-4.x-HBase-1.0 #216

See <https://builds.apache.org/job/Phoenix-4.x-HBase-1.0/216/changes>

Changes:

[samarth] Use a priority queue in MergeSortResultIterator (Ankit Singhal)

------------------------------------------
[...truncated 1174 lines...]
Tests run: 2, Failures: 0, Errors: 0, Skipped: 0, Time elapsed: 3.27 sec - in org.apache.phoenix.end2end.RegexpReplaceFunctionIT
Running org.apache.phoenix.end2end.LikeExpressionIT
Tests run: 2, Failures: 0, Errors: 0, Skipped: 0, Time elapsed: 6.974 sec - in org.apache.phoenix.end2end.SqrtFunctionEnd2EndIT
Running org.apache.phoenix.end2end.index.SaltedIndexIT
Tests run: 2, Failures: 0, Errors: 0, Skipped: 0, Time elapsed: 5.862 sec - in org.apache.phoenix.end2end.LikeExpressionIT
Running org.apache.phoenix.end2end.index.DropViewIT
Tests run: 3, Failures: 0, Errors: 0, Skipped: 0, Time elapsed: 11.538 sec - in org.apache.phoenix.end2end.UpsertSelectAutoCommitIT
Running org.apache.phoenix.end2end.index.GlobalIndexOptimizationIT
Tests run: 1, Failures: 0, Errors: 0, Skipped: 0, Time elapsed: 8.058 sec - in org.apache.phoenix.end2end.index.DropViewIT
Running org.apache.phoenix.end2end.index.LocalIndexIT
Tests run: 3, Failures: 0, Errors: 0, Skipped: 0, Time elapsed: 18.633 sec - in org.apache.phoenix.end2end.index.SaltedIndexIT
Running org.apache.phoenix.end2end.index.IndexExpressionIT
Tests run: 6, Failures: 0, Errors: 0, Skipped: 0, Time elapsed: 37.418 sec - in org.apache.phoenix.end2end.index.GlobalIndexOptimizationIT
Running org.apache.phoenix.end2end.index.ViewIndexIT
Tests run: 1, Failures: 0, Errors: 0, Skipped: 0, Time elapsed: 5.48 sec - in org.apache.phoenix.end2end.index.ViewIndexIT
Running org.apache.phoenix.end2end.index.LocalMutableIndexIT
Tests run: 28, Failures: 0, Errors: 0, Skipped: 0, Time elapsed: 164.081 sec - in org.apache.phoenix.end2end.InListIT
Running org.apache.phoenix.end2end.index.ImmutableIndexIT
Tests run: 13, Failures: 0, Errors: 0, Skipped: 0, Time elapsed: 37.872 sec - in org.apache.phoenix.end2end.index.ImmutableIndexIT
Running org.apache.phoenix.end2end.index.IndexMetadataIT
Tests run: 16, Failures: 0, Errors: 0, Skipped: 0, Time elapsed: 71.634 sec - in org.apache.phoenix.end2end.index.LocalMutableIndexIT
Running org.apache.phoenix.end2end.index.GlobalMutableIndexIT
Tests run: 6, Failures: 0, Errors: 0, Skipped: 0, Time elapsed: 44.034 sec - in org.apache.phoenix.end2end.index.IndexMetadataIT
Running org.apache.phoenix.end2end.CSVCommonsLoaderIT
Tests run: 20, Failures: 0, Errors: 0, Skipped: 0, Time elapsed: 164.625 sec - in org.apache.phoenix.end2end.index.LocalIndexIT
Running org.apache.phoenix.end2end.OctetLengthFunctionEnd2EndIT
Tests run: 16, Failures: 0, Errors: 0, Skipped: 0, Time elapsed: 26.603 sec - in org.apache.phoenix.end2end.CSVCommonsLoaderIT
Tests run: 1, Failures: 0, Errors: 0, Skipped: 0, Time elapsed: 2.364 sec - in org.apache.phoenix.end2end.OctetLengthFunctionEnd2EndIT
Running org.apache.phoenix.end2end.MinMaxAggregateFunctionIT
Running org.apache.phoenix.end2end.LpadFunctionIT
Tests run: 1, Failures: 0, Errors: 0, Skipped: 0, Time elapsed: 2.516 sec - in org.apache.phoenix.end2end.MinMaxAggregateFunctionIT
Running org.apache.phoenix.end2end.TimezoneOffsetFunctionIT
Tests run: 7, Failures: 0, Errors: 0, Skipped: 0, Time elapsed: 5.632 sec - in org.apache.phoenix.end2end.TimezoneOffsetFunctionIT
Running org.apache.phoenix.end2end.RegexpSubstrFunctionIT
Tests run: 2, Failures: 0, Errors: 0, Skipped: 0, Time elapsed: 2.408 sec - in org.apache.phoenix.end2end.RegexpSubstrFunctionIT
Running org.apache.phoenix.end2end.BinaryRowKeyIT
Tests run: 16, Failures: 0, Errors: 0, Skipped: 0, Time elapsed: 70.371 sec - in org.apache.phoenix.end2end.index.GlobalMutableIndexIT
Running org.apache.phoenix.end2end.SignFunctionEnd2EndIT
Tests run: 3, Failures: 0, Errors: 0, Skipped: 0, Time elapsed: 3.433 sec - in org.apache.phoenix.end2end.BinaryRowKeyIT
Running org.apache.phoenix.end2end.SortMergeJoinIT
Tests run: 2, Failures: 0, Errors: 0, Skipped: 0, Time elapsed: 5.199 sec - in org.apache.phoenix.end2end.SignFunctionEnd2EndIT
Running org.apache.phoenix.end2end.DecodeFunctionIT
Tests run: 6, Failures: 0, Errors: 0, Skipped: 0, Time elapsed: 3.398 sec - in org.apache.phoenix.end2end.DecodeFunctionIT
Running org.apache.phoenix.end2end.RTrimFunctionIT
Tests run: 12, Failures: 0, Errors: 0, Skipped: 0, Time elapsed: 23.357 sec - in org.apache.phoenix.end2end.LpadFunctionIT
Running org.apache.phoenix.end2end.DisableLocalIndexIT
Tests run: 2, Failures: 0, Errors: 0, Skipped: 0, Time elapsed: 2.727 sec - in org.apache.phoenix.end2end.RTrimFunctionIT
Running org.apache.phoenix.end2end.HashJoinIT
Tests run: 1, Failures: 0, Errors: 0, Skipped: 0, Time elapsed: 5.589 sec - in org.apache.phoenix.end2end.DisableLocalIndexIT
Running org.apache.phoenix.end2end.HashJoinLocalIndexIT
Tests run: 62, Failures: 0, Errors: 0, Skipped: 0, Time elapsed: 199.709 sec - in org.apache.phoenix.end2end.index.IndexExpressionIT
Running org.apache.phoenix.end2end.ModulusExpressionIT
Tests run: 1, Failures: 0, Errors: 0, Skipped: 0, Time elapsed: 18.315 sec - in org.apache.phoenix.end2end.HashJoinLocalIndexIT
Running org.apache.phoenix.end2end.ArrayToStringFunctionIT
Tests run: 11, Failures: 0, Errors: 0, Skipped: 0, Time elapsed: 11.69 sec - in org.apache.phoenix.end2end.ModulusExpressionIT
Running org.apache.phoenix.end2end.StoreNullsIT
Tests run: 3, Failures: 0, Errors: 0, Skipped: 0, Time elapsed: 23.17 sec - in org.apache.phoenix.end2end.StoreNullsIT
Running org.apache.phoenix.end2end.EvaluationOfORIT
Tests run: 2, Failures: 0, Errors: 0, Skipped: 0, Time elapsed: 3.478 sec - in org.apache.phoenix.end2end.EvaluationOfORIT
Running org.apache.phoenix.end2end.ExecuteStatementsIT
Tests run: 36, Failures: 0, Errors: 0, Skipped: 0, Time elapsed: 34.349 sec - in org.apache.phoenix.end2end.ArrayToStringFunctionIT
Running org.apache.phoenix.end2end.ConvertTimezoneFunctionIT
Tests run: 7, Failures: 0, Errors: 0, Skipped: 0, Time elapsed: 6.94 sec - in org.apache.phoenix.end2end.ConvertTimezoneFunctionIT
Running org.apache.phoenix.end2end.ExpFunctionEnd2EndIT
Tests run: 2, Failures: 0, Errors: 0, Skipped: 0, Time elapsed: 20.092 sec - in org.apache.phoenix.end2end.ExecuteStatementsIT
Running org.apache.phoenix.end2end.PowerFunctionEnd2EndIT
Tests run: 3, Failures: 0, Errors: 0, Skipped: 0, Time elapsed: 8.941 sec - in org.apache.phoenix.end2end.ExpFunctionEnd2EndIT
Running org.apache.phoenix.end2end.StddevIT
Tests run: 1, Failures: 0, Errors: 0, Skipped: 0, Time elapsed: 5.295 sec - in org.apache.phoenix.end2end.PowerFunctionEnd2EndIT
Running org.apache.phoenix.end2end.TenantSpecificViewIndexSaltedIT
Tests run: 4, Failures: 0, Errors: 0, Skipped: 0, Time elapsed: 5.849 sec - in org.apache.phoenix.end2end.StddevIT
Running org.apache.phoenix.end2end.AlterSessionIT
Tests run: 2, Failures: 0, Errors: 0, Skipped: 0, Time elapsed: 3.122 sec - in org.apache.phoenix.end2end.AlterSessionIT
Running org.apache.phoenix.end2end.FirstValueFunctionIT
Tests run: 7, Failures: 0, Errors: 0, Skipped: 0, Time elapsed: 6.948 sec - in org.apache.phoenix.end2end.FirstValueFunctionIT
Tests run: 4, Failures: 0, Errors: 0, Skipped: 0, Time elapsed: 13.82 sec - in org.apache.phoenix.end2end.TenantSpecificViewIndexSaltedIT
Running org.apache.phoenix.end2end.SkipScanAfterManualSplitIT
Running org.apache.phoenix.end2end.ArrayAppendFunctionIT
Tests run: 34, Failures: 0, Errors: 0, Skipped: 0, Time elapsed: 31.2 sec - in org.apache.phoenix.end2end.ArrayAppendFunctionIT
Running org.apache.phoenix.end2end.TenantSpecificViewIndexIT
Tests run: 3, Failures: 0, Errors: 0, Skipped: 0, Time elapsed: 32.529 sec - in org.apache.phoenix.end2end.SkipScanAfterManualSplitIT
Running org.apache.phoenix.end2end.GetSetByteBitFunctionEnd2EndIT
Tests run: 108, Failures: 0, Errors: 0, Skipped: 0, Time elapsed: 486.094 sec - in org.apache.phoenix.end2end.SpooledSortMergeJoinIT
Running org.apache.phoenix.end2end.UpgradeIT
Tests run: 1, Failures: 0, Errors: 0, Skipped: 0, Time elapsed: 3.466 sec - in org.apache.phoenix.end2end.GetSetByteBitFunctionEnd2EndIT
Running org.apache.phoenix.end2end.LnLogFunctionEnd2EndIT
Tests run: 1, Failures: 0, Errors: 0, Skipped: 0, Time elapsed: 4.632 sec - in org.apache.phoenix.end2end.LnLogFunctionEnd2EndIT
Running org.apache.phoenix.end2end.SpooledTmpFileDeleteIT
Tests run: 1, Failures: 0, Errors: 0, Skipped: 0, Time elapsed: 3.573 sec - in org.apache.phoenix.end2end.SpooledTmpFileDeleteIT
Running org.apache.phoenix.end2end.SkipScanQueryIT
Tests run: 8, Failures: 0, Errors: 0, Skipped: 0, Time elapsed: 21.889 sec - in org.apache.phoenix.end2end.TenantSpecificViewIndexIT
Running org.apache.phoenix.end2end.ArrayConcatFunctionIT
Tests run: 108, Failures: 0, Errors: 0, Skipped: 0, Time elapsed: 166.854 sec - in org.apache.phoenix.end2end.SortMergeJoinIT
Running org.apache.phoenix.end2end.DateTimeIT
Tests run: 9, Failures: 0, Errors: 0, Skipped: 0, Time elapsed: 18.108 sec - in org.apache.phoenix.end2end.SkipScanQueryIT
Running org.apache.phoenix.end2end.ArrayFillFunctionIT
Tests run: 19, Failures: 0, Errors: 0, Skipped: 0, Time elapsed: 11.133 sec - in org.apache.phoenix.end2end.DateTimeIT
Running org.apache.phoenix.end2end.QueryExecWithoutSCNIT
Tests run: 1, Failures: 0, Errors: 0, Skipped: 0, Time elapsed: 3.098 sec - in org.apache.phoenix.end2end.QueryExecWithoutSCNIT
Running org.apache.phoenix.end2end.SubqueryIT
Tests run: 111, Failures: 0, Errors: 0, Skipped: 0, Time elapsed: 173.004 sec - in org.apache.phoenix.end2end.HashJoinIT
Running org.apache.phoenix.trace.PhoenixTracingEndToEndIT
Tests run: 30, Failures: 0, Errors: 0, Skipped: 0, Time elapsed: 26.432 sec - in org.apache.phoenix.end2end.ArrayConcatFunctionIT
Running org.apache.phoenix.trace.PhoenixTraceReaderIT
Tests run: 2, Failures: 0, Errors: 0, Skipped: 0, Time elapsed: 1.105 sec - in org.apache.phoenix.trace.PhoenixTraceReaderIT
Running org.apache.phoenix.trace.PhoenixTableMetricsWriterIT
Tests run: 2, Failures: 0, Errors: 0, Skipped: 0, Time elapsed: 1.356 sec - in org.apache.phoenix.trace.PhoenixTableMetricsWriterIT
Tests run: 6, Failures: 0, Errors: 0, Skipped: 0, Time elapsed: 51.21 sec - in org.apache.phoenix.end2end.UpgradeIT
Tests run: 26, Failures: 0, Errors: 0, Skipped: 0, Time elapsed: 24.242 sec - in org.apache.phoenix.end2end.ArrayFillFunctionIT

Results :

Tests run: 1152, Failures: 0, Errors: 0, Skipped: 0

[INFO] 
[INFO] --- maven-failsafe-plugin:2.19:integration-test (NeedTheirOwnClusterTests) @ phoenix-core ---

-------------------------------------------------------
 T E S T S
-------------------------------------------------------
Running org.apache.phoenix.rpc.PhoenixServerRpcIT
Running org.apache.phoenix.rpc.PhoenixClientRpcIT
Running org.apache.phoenix.monitoring.PhoenixMetricsIT
Running org.apache.phoenix.iterate.RoundRobinResultIteratorWithStatsIT
Tests run: 2, Failures: 0, Errors: 0, Skipped: 0, Time elapsed: 6.971 sec - in org.apache.phoenix.rpc.PhoenixClientRpcIT
Tests run: 1, Failures: 0, Errors: 0, Skipped: 0, Time elapsed: 13.642 sec - in org.apache.phoenix.iterate.RoundRobinResultIteratorWithStatsIT
Tests run: 2, Failures: 0, Errors: 0, Skipped: 0, Time elapsed: 16.997 sec - in org.apache.phoenix.rpc.PhoenixServerRpcIT
Running org.apache.phoenix.end2end.ConnectionUtilIT
Running org.apache.phoenix.mapreduce.IndexToolIT
Running org.apache.phoenix.end2end.MultiCfQueryExecIT
Running org.apache.phoenix.mapreduce.CsvBulkLoadToolIT
Tests run: 1, Failures: 0, Errors: 0, Skipped: 0, Time elapsed: 18.839 sec - in org.apache.phoenix.end2end.ConnectionUtilIT
Tests run: 7, Failures: 0, Errors: 0, Skipped: 0, Time elapsed: 18.578 sec - in org.apache.phoenix.end2end.MultiCfQueryExecIT
Tests run: 17, Failures: 2, Errors: 0, Skipped: 0, Time elapsed: 55.952 sec <<< FAILURE! - in org.apache.phoenix.monitoring.PhoenixMetricsIT
testMetricsForUpsertSelectWithAutoCommit(org.apache.phoenix.monitoring.PhoenixMetricsIT)  Time elapsed: 4.834 sec  <<< FAILURE!
java.lang.AssertionError: Unequal values for metric MUTATION_BYTES expected:<5600> but was:<16240>
	at org.apache.phoenix.monitoring.PhoenixMetricsIT.assertMetricsHaveSameValues(PhoenixMetricsIT.java:654)
	at org.apache.phoenix.monitoring.PhoenixMetricsIT.assertMetricsAreSame(PhoenixMetricsIT.java:643)
	at org.apache.phoenix.monitoring.PhoenixMetricsIT.testMetricsForUpsertSelectWithAutoCommit(PhoenixMetricsIT.java:462)

testMetricsForUpsertSelectSameTable(org.apache.phoenix.monitoring.PhoenixMetricsIT)  Time elapsed: 2.851 sec  <<< FAILURE!
java.lang.AssertionError: Unequal values for metric MUTATION_BYTES expected:<5600> but was:<16240>
	at org.apache.phoenix.monitoring.PhoenixMetricsIT.assertMetricsHaveSameValues(PhoenixMetricsIT.java:654)
	at org.apache.phoenix.monitoring.PhoenixMetricsIT.assertMetricsAreSame(PhoenixMetricsIT.java:643)
	at org.apache.phoenix.monitoring.PhoenixMetricsIT.testMetricsForUpsertSelectSameTable(PhoenixMetricsIT.java:615)

Running org.apache.phoenix.end2end.ViewIT
Running org.apache.phoenix.end2end.SaltedViewIT
Running org.apache.phoenix.end2end.StatsCollectorIT
Tests run: 2, Failures: 0, Errors: 0, Skipped: 0, Time elapsed: 18.689 sec - in org.apache.phoenix.end2end.SaltedViewIT
Running org.apache.phoenix.end2end.ParallelIteratorsIT
Tests run: 3, Failures: 0, Errors: 0, Skipped: 0, Time elapsed: 21.01 sec - in org.apache.phoenix.end2end.ParallelIteratorsIT
Tests run: 22, Failures: 0, Errors: 0, Skipped: 0, Time elapsed: 57.05 sec - in org.apache.phoenix.end2end.ViewIT
Tests run: 4, Failures: 0, Errors: 0, Skipped: 0, Time elapsed: 60.141 sec - in org.apache.phoenix.end2end.StatsCollectorIT
Running org.apache.phoenix.end2end.QueryWithLimitIT
Running org.apache.phoenix.end2end.QueryTimeoutIT
Tests run: 2, Failures: 0, Errors: 0, Skipped: 0, Time elapsed: 10.071 sec - in org.apache.phoenix.end2end.QueryWithLimitIT
Running org.apache.phoenix.end2end.ContextClassloaderIT
Tests run: 1, Failures: 0, Errors: 0, Skipped: 0, Time elapsed: 18.96 sec - in org.apache.phoenix.end2end.QueryTimeoutIT
Running org.apache.phoenix.end2end.index.MutableIndexFailureIT
Tests run: 3, Failures: 0, Errors: 0, Skipped: 0, Time elapsed: 7.326 sec - in org.apache.phoenix.end2end.ContextClassloaderIT
Running org.apache.phoenix.end2end.index.ImmutableIndexWithStatsIT
Tests run: 1, Failures: 0, Errors: 0, Skipped: 0, Time elapsed: 8.964 sec - in org.apache.phoenix.end2end.index.ImmutableIndexWithStatsIT
Running org.apache.phoenix.end2end.index.MutableIndexReplicationIT
Tests run: 3, Failures: 0, Errors: 0, Skipped: 2, Time elapsed: 35.783 sec - in org.apache.phoenix.end2end.index.MutableIndexFailureIT
Tests run: 1, Failures: 0, Errors: 0, Skipped: 0, Time elapsed: 18.826 sec - in org.apache.phoenix.end2end.index.MutableIndexReplicationIT
Running org.apache.phoenix.end2end.UserDefinedFunctionsIT
Tests run: 5, Failures: 0, Errors: 0, Skipped: 0, Time elapsed: 171.4 sec - in org.apache.phoenix.mapreduce.CsvBulkLoadToolIT
Running org.apache.phoenix.end2end.AlterTableIT
Tests run: 13, Failures: 0, Errors: 0, Skipped: 0, Time elapsed: 16.061 sec - in org.apache.phoenix.end2end.UserDefinedFunctionsIT
Running org.apache.phoenix.end2end.UnionAllIT
Running org.apache.phoenix.end2end.TenantSpecificTablesDDLIT
Running org.apache.phoenix.end2end.KeyOnlyIT
Tests run: 12, Failures: 0, Errors: 0, Skipped: 0, Time elapsed: 27.271 sec - in org.apache.phoenix.end2end.UnionAllIT
Tests run: 3, Failures: 0, Errors: 0, Skipped: 0, Time elapsed: 18.719 sec - in org.apache.phoenix.end2end.KeyOnlyIT
Tests run: 17, Failures: 0, Errors: 0, Skipped: 0, Time elapsed: 37.228 sec - in org.apache.phoenix.end2end.TenantSpecificTablesDDLIT
Running org.apache.phoenix.end2end.CountDistinctCompressionIT
Tests run: 1, Failures: 0, Errors: 0, Skipped: 0, Time elapsed: 8.376 sec - in org.apache.phoenix.end2end.CountDistinctCompressionIT
Running org.apache.phoenix.end2end.SpillableGroupByIT
Tests run: 1, Failures: 0, Errors: 0, Skipped: 0, Time elapsed: 7.014 sec - in org.apache.phoenix.end2end.SpillableGroupByIT
Running org.apache.phoenix.hbase.index.FailForUnsupportedHBaseVersionsIT
Running org.apache.phoenix.end2end.TenantSpecificTablesDMLIT
Running org.apache.phoenix.end2end.StatsCollectorWithSplitsAndMultiCFIT
Tests run: 2, Failures: 0, Errors: 0, Skipped: 0, Time elapsed: 17.508 sec - in org.apache.phoenix.hbase.index.FailForUnsupportedHBaseVersionsIT
Running org.apache.phoenix.hbase.index.covered.EndToEndCoveredColumnsIndexBuilderIT
Tests run: 2, Failures: 0, Errors: 0, Skipped: 0, Time elapsed: 9.368 sec - in org.apache.phoenix.hbase.index.covered.EndToEndCoveredColumnsIndexBuilderIT
Tests run: 16, Failures: 0, Errors: 0, Skipped: 0, Time elapsed: 36.546 sec - in org.apache.phoenix.end2end.TenantSpecificTablesDMLIT
Tests run: 2, Failures: 0, Errors: 0, Skipped: 0, Time elapsed: 29.165 sec - in org.apache.phoenix.end2end.StatsCollectorWithSplitsAndMultiCFIT
Running org.apache.phoenix.hbase.index.covered.example.FailWithoutRetriesIT
Tests run: 1, Failures: 0, Errors: 0, Skipped: 0, Time elapsed: 9.338 sec - in org.apache.phoenix.hbase.index.covered.example.FailWithoutRetriesIT
Running org.apache.phoenix.hbase.index.covered.example.EndToEndCoveredIndexingIT
Running org.apache.phoenix.hbase.index.covered.example.EndtoEndIndexingWithCompressionIT
Running org.apache.phoenix.hbase.index.balancer.IndexLoadBalancerIT
Tests run: 11, Failures: 0, Errors: 0, Skipped: 0, Time elapsed: 50.328 sec - in org.apache.phoenix.hbase.index.covered.example.EndToEndCoveredIndexingIT
Tests run: 11, Failures: 0, Errors: 0, Skipped: 0, Time elapsed: 56.549 sec - in org.apache.phoenix.hbase.index.covered.example.EndtoEndIndexingWithCompressionIT
Running org.apache.hadoop.hbase.regionserver.wal.WALReplayWithIndexWritesAndUncompressedWALInHBase_094_9_IT
Tests run: 9, Failures: 0, Errors: 0, Skipped: 0, Time elapsed: 373.057 sec - in org.apache.phoenix.mapreduce.IndexToolIT
Running org.apache.hadoop.hbase.regionserver.wal.WALReplayWithIndexWritesAndCompressedWALIT
Tests run: 1, Failures: 0, Errors: 0, Skipped: 0, Time elapsed: 14.449 sec - in org.apache.hadoop.hbase.regionserver.wal.WALReplayWithIndexWritesAndUncompressedWALInHBase_094_9_IT
Tests run: 1, Failures: 0, Errors: 0, Skipped: 0, Time elapsed: 17.765 sec - in org.apache.hadoop.hbase.regionserver.wal.WALReplayWithIndexWritesAndCompressedWALIT
Tests run: 9, Failures: 0, Errors: 0, Skipped: 0, Time elapsed: 104.918 sec - in org.apache.phoenix.hbase.index.balancer.IndexLoadBalancerIT
Tests run: 55, Failures: 0, Errors: 0, Skipped: 0, Time elapsed: 321.87 sec - in org.apache.phoenix.end2end.AlterTableIT
Running org.apache.phoenix.execute.PartialCommitIT
Tests run: 6, Failures: 0, Errors: 0, Skipped: 0, Time elapsed: 6.222 sec - in org.apache.phoenix.execute.PartialCommitIT

Results :

Failed tests: 
  PhoenixMetricsIT.testMetricsForUpsertSelectSameTable:615->assertMetricsAreSame:643->assertMetricsHaveSameValues:654 Unequal values for metric MUTATION_BYTES expected:<5600> but was:<16240>
  PhoenixMetricsIT.testMetricsForUpsertSelectWithAutoCommit:462->assertMetricsAreSame:643->assertMetricsHaveSameValues:654 Unequal values for metric MUTATION_BYTES expected:<5600> but was:<16240>

Tests run: 250, Failures: 2, Errors: 0, Skipped: 2

[INFO] 
[INFO] --- maven-failsafe-plugin:2.19:verify (ClientManagedTimeTests) @ phoenix-core ---
[INFO] ------------------------------------------------------------------------
[INFO] Reactor Summary:
[INFO] 
[INFO] Apache Phoenix .................................... SUCCESS [2.690s]
[INFO] Phoenix Core ...................................... FAILURE [46:10.684s]
[INFO] Phoenix - Flume ................................... SKIPPED
[INFO] Phoenix - Pig ..................................... SKIPPED
[INFO] Phoenix Query Server Client ....................... SKIPPED
[INFO] Phoenix Query Server .............................. SKIPPED
[INFO] Phoenix - Pherf ................................... SKIPPED
[INFO] Phoenix - Spark ................................... SKIPPED
[INFO] Phoenix Assembly .................................. SKIPPED
[INFO] Phoenix - Tracing Web Application ................. SKIPPED
[INFO] ------------------------------------------------------------------------
[INFO] BUILD FAILURE
[INFO] ------------------------------------------------------------------------
[INFO] Total time: 46:13.915s
[INFO] Finished at: Thu Nov 12 23:56:49 UTC 2015
[INFO] Final Memory: 61M/1229M
[INFO] ------------------------------------------------------------------------
[ERROR] Failed to execute goal org.apache.maven.plugins:maven-failsafe-plugin:2.19:verify (ClientManagedTimeTests) on project phoenix-core: There was a timeout or other error in the fork -> [Help 1]
[ERROR] 
[ERROR] To see the full stack trace of the errors, re-run Maven with the -e switch.
[ERROR] Re-run Maven using the -X switch to enable full debug logging.
[ERROR] 
[ERROR] For more information about the errors and possible solutions, please read the following articles:
[ERROR] [Help 1] http://cwiki.apache.org/confluence/display/MAVEN/MojoExecutionException
[ERROR] 
[ERROR] After correcting the problems, you can resume the build with the command
[ERROR]   mvn <goals> -rf :phoenix-core
Build step 'Invoke top-level Maven targets' marked build as failure
Archiving artifacts
Compressed 1.18 GB of artifacts by 50.4% relative to #214
Recording test results

Jenkins build is back to normal : Phoenix-4.x-HBase-1.0 #223

Posted by Apache Jenkins Server <je...@builds.apache.org>.
See <https://builds.apache.org/job/Phoenix-4.x-HBase-1.0/223/changes>


Build failed in Jenkins: Phoenix-4.x-HBase-1.0 #222

Posted by Apache Jenkins Server <je...@builds.apache.org>.
See <https://builds.apache.org/job/Phoenix-4.x-HBase-1.0/222/changes>

Changes:

[samarth] Fix test failures due to use of priority queue for merge sort (Ankit

------------------------------------------
[...truncated 1389 lines...]
[INFO] Installing <https://builds.apache.org/job/Phoenix-4.x-HBase-1.0/222/artifact/phoenix-core/target/phoenix-core-4.7.0-HBase-1.0-SNAPSHOT-sources.jar> to /home/jenkins/.m2/repository/org/apache/phoenix/phoenix-core/4.7.0-HBase-1.0-SNAPSHOT/phoenix-core-4.7.0-HBase-1.0-SNAPSHOT-sources.jar
[INFO] Installing <https://builds.apache.org/job/Phoenix-4.x-HBase-1.0/222/artifact/phoenix-core/target/phoenix-core-4.7.0-HBase-1.0-SNAPSHOT-tests.jar> to /home/jenkins/.m2/repository/org/apache/phoenix/phoenix-core/4.7.0-HBase-1.0-SNAPSHOT/phoenix-core-4.7.0-HBase-1.0-SNAPSHOT-tests.jar
[INFO]                                                                         
[INFO] ------------------------------------------------------------------------
[INFO] Building Phoenix - Flume 4.7.0-HBase-1.0-SNAPSHOT
[INFO] ------------------------------------------------------------------------
[INFO] 
[INFO] --- maven-clean-plugin:2.5:clean (default-clean) @ phoenix-flume ---
[INFO] Deleting <https://builds.apache.org/job/Phoenix-4.x-HBase-1.0/ws/phoenix-flume/target>
[INFO] 
[INFO] --- maven-checkstyle-plugin:2.13:check (validate) @ phoenix-flume ---
[INFO] 
[INFO] --- build-helper-maven-plugin:1.9.1:add-test-source (add-test-source) @ phoenix-flume ---
[INFO] Test Source directory: <https://builds.apache.org/job/Phoenix-4.x-HBase-1.0/ws/phoenix-flume/src/it/java> added.
[INFO] 
[INFO] --- build-helper-maven-plugin:1.9.1:add-test-resource (add-test-resource) @ phoenix-flume ---
[INFO] 
[INFO] --- maven-remote-resources-plugin:1.5:process (default) @ phoenix-flume ---
[INFO] 
[INFO] --- maven-resources-plugin:2.6:resources (default-resources) @ phoenix-flume ---
[INFO] Using 'UTF-8' encoding to copy filtered resources.
[INFO] skip non existing resourceDirectory <https://builds.apache.org/job/Phoenix-4.x-HBase-1.0/ws/phoenix-flume/src/main/resources>
[INFO] Copying 3 resources
[INFO] 
[INFO] --- maven-compiler-plugin:3.0:compile (default-compile) @ phoenix-flume ---
[INFO] Changes detected - recompiling the module!
[INFO] Compiling 9 source files to <https://builds.apache.org/job/Phoenix-4.x-HBase-1.0/ws/phoenix-flume/target/classes>
[WARNING] <https://builds.apache.org/job/Phoenix-4.x-HBase-1.0/ws/phoenix-flume/src/main/java/org/apache/phoenix/flume/sink/PhoenixSink.java>: <https://builds.apache.org/job/Phoenix-4.x-HBase-1.0/ws/phoenix-flume/src/main/java/org/apache/phoenix/flume/sink/PhoenixSink.java> uses unchecked or unsafe operations.
[WARNING] <https://builds.apache.org/job/Phoenix-4.x-HBase-1.0/ws/phoenix-flume/src/main/java/org/apache/phoenix/flume/sink/PhoenixSink.java>: Recompile with -Xlint:unchecked for details.
[INFO] 
[INFO] --- maven-dependency-plugin:2.1:build-classpath (create-mrapp-generated-classpath) @ phoenix-flume ---
[INFO] Wrote classpath file '<https://builds.apache.org/job/Phoenix-4.x-HBase-1.0/ws/phoenix-flume/target/classes/mrapp-generated-classpath'.>
[INFO] 
[INFO] --- maven-resources-plugin:2.6:testResources (default-testResources) @ phoenix-flume ---
[INFO] Using 'UTF-8' encoding to copy filtered resources.
[INFO] skip non existing resourceDirectory <https://builds.apache.org/job/Phoenix-4.x-HBase-1.0/ws/phoenix-flume/src/test/resources>
[INFO] skip non existing resourceDirectory <https://builds.apache.org/job/Phoenix-4.x-HBase-1.0/ws/phoenix-flume/src/it/resources>
[INFO] Copying 3 resources
[INFO] 
[INFO] --- maven-compiler-plugin:3.0:testCompile (default-testCompile) @ phoenix-flume ---
[INFO] Changes detected - recompiling the module!
[INFO] Compiling 4 source files to <https://builds.apache.org/job/Phoenix-4.x-HBase-1.0/ws/phoenix-flume/target/test-classes>
[INFO] 
[INFO] --- maven-surefire-plugin:2.19:test (default-test) @ phoenix-flume ---
[INFO] 
[INFO] --- maven-source-plugin:2.2.1:jar-no-fork (attach-sources) @ phoenix-flume ---
[INFO] Building jar: <https://builds.apache.org/job/Phoenix-4.x-HBase-1.0/222/artifact/phoenix-flume/target/phoenix-flume-4.7.0-HBase-1.0-SNAPSHOT-sources.jar>
[INFO] 
[INFO] --- maven-jar-plugin:2.4:test-jar (default) @ phoenix-flume ---
[INFO] Building jar: <https://builds.apache.org/job/Phoenix-4.x-HBase-1.0/222/artifact/phoenix-flume/target/phoenix-flume-4.7.0-HBase-1.0-SNAPSHOT-tests.jar>
[INFO] 
[INFO] --- maven-jar-plugin:2.4:jar (default-jar) @ phoenix-flume ---
[INFO] Building jar: <https://builds.apache.org/job/Phoenix-4.x-HBase-1.0/222/artifact/phoenix-flume/target/phoenix-flume-4.7.0-HBase-1.0-SNAPSHOT.jar>
[INFO] 
[INFO] --- maven-site-plugin:3.2:attach-descriptor (attach-descriptor) @ phoenix-flume ---
[INFO] 
[INFO] --- maven-failsafe-plugin:2.19:integration-test (ClientManagedTimeTests) @ phoenix-flume ---

-------------------------------------------------------
 T E S T S
-------------------------------------------------------

Results :

Tests run: 0, Failures: 0, Errors: 0, Skipped: 0

[INFO] 
[INFO] --- maven-failsafe-plugin:2.19:integration-test (HBaseManagedTimeTests) @ phoenix-flume ---

-------------------------------------------------------
 T E S T S
-------------------------------------------------------
Running org.apache.phoenix.flume.PhoenixSinkIT
Running org.apache.phoenix.flume.RegexEventSerializerIT
Tests run: 9, Failures: 0, Errors: 0, Skipped: 0, Time elapsed: 9.783 sec - in org.apache.phoenix.flume.PhoenixSinkIT
Tests run: 6, Failures: 0, Errors: 0, Skipped: 0, Time elapsed: 31.401 sec - in org.apache.phoenix.flume.RegexEventSerializerIT

Results :

Tests run: 15, Failures: 0, Errors: 0, Skipped: 0

[INFO] 
[INFO] --- maven-failsafe-plugin:2.19:integration-test (NeedTheirOwnClusterTests) @ phoenix-flume ---

-------------------------------------------------------
 T E S T S
-------------------------------------------------------

Results :

Tests run: 0, Failures: 0, Errors: 0, Skipped: 0

[INFO] 
[INFO] --- maven-failsafe-plugin:2.19:verify (ClientManagedTimeTests) @ phoenix-flume ---
[INFO] 
[INFO] --- maven-failsafe-plugin:2.19:verify (HBaseManagedTimeTests) @ phoenix-flume ---
[INFO] 
[INFO] --- maven-failsafe-plugin:2.19:verify (NeedTheirOwnClusterTests) @ phoenix-flume ---
[INFO] 
[INFO] --- maven-install-plugin:2.5.1:install (default-install) @ phoenix-flume ---
[INFO] Installing <https://builds.apache.org/job/Phoenix-4.x-HBase-1.0/222/artifact/phoenix-flume/target/phoenix-flume-4.7.0-HBase-1.0-SNAPSHOT.jar> to /home/jenkins/.m2/repository/org/apache/phoenix/phoenix-flume/4.7.0-HBase-1.0-SNAPSHOT/phoenix-flume-4.7.0-HBase-1.0-SNAPSHOT.jar
[INFO] Installing <https://builds.apache.org/job/Phoenix-4.x-HBase-1.0/ws/phoenix-flume/pom.xml> to /home/jenkins/.m2/repository/org/apache/phoenix/phoenix-flume/4.7.0-HBase-1.0-SNAPSHOT/phoenix-flume-4.7.0-HBase-1.0-SNAPSHOT.pom
[INFO] Installing <https://builds.apache.org/job/Phoenix-4.x-HBase-1.0/222/artifact/phoenix-flume/target/phoenix-flume-4.7.0-HBase-1.0-SNAPSHOT-sources.jar> to /home/jenkins/.m2/repository/org/apache/phoenix/phoenix-flume/4.7.0-HBase-1.0-SNAPSHOT/phoenix-flume-4.7.0-HBase-1.0-SNAPSHOT-sources.jar
[INFO] Installing <https://builds.apache.org/job/Phoenix-4.x-HBase-1.0/222/artifact/phoenix-flume/target/phoenix-flume-4.7.0-HBase-1.0-SNAPSHOT-tests.jar> to /home/jenkins/.m2/repository/org/apache/phoenix/phoenix-flume/4.7.0-HBase-1.0-SNAPSHOT/phoenix-flume-4.7.0-HBase-1.0-SNAPSHOT-tests.jar
[INFO]                                                                         
[INFO] ------------------------------------------------------------------------
[INFO] Building Phoenix - Pig 4.7.0-HBase-1.0-SNAPSHOT
[INFO] ------------------------------------------------------------------------
[INFO] 
[INFO] --- maven-clean-plugin:2.5:clean (default-clean) @ phoenix-pig ---
[INFO] Deleting <https://builds.apache.org/job/Phoenix-4.x-HBase-1.0/ws/phoenix-pig/target>
[INFO] 
[INFO] --- maven-checkstyle-plugin:2.13:check (validate) @ phoenix-pig ---
[INFO] 
[INFO] --- build-helper-maven-plugin:1.9.1:add-test-source (add-test-source) @ phoenix-pig ---
[INFO] Test Source directory: <https://builds.apache.org/job/Phoenix-4.x-HBase-1.0/ws/phoenix-pig/src/it/java> added.
[INFO] 
[INFO] --- build-helper-maven-plugin:1.9.1:add-test-resource (add-test-resource) @ phoenix-pig ---
[INFO] 
[INFO] --- maven-remote-resources-plugin:1.5:process (default) @ phoenix-pig ---
[INFO] 
[INFO] --- maven-resources-plugin:2.6:resources (default-resources) @ phoenix-pig ---
[INFO] Using 'UTF-8' encoding to copy filtered resources.
[INFO] skip non existing resourceDirectory <https://builds.apache.org/job/Phoenix-4.x-HBase-1.0/ws/phoenix-pig/src/main/resources>
[INFO] Copying 3 resources
[INFO] 
[INFO] --- maven-compiler-plugin:3.0:compile (default-compile) @ phoenix-pig ---
[INFO] Changes detected - recompiling the module!
[INFO] Compiling 9 source files to <https://builds.apache.org/job/Phoenix-4.x-HBase-1.0/ws/phoenix-pig/target/classes>
[INFO] 
[INFO] --- maven-dependency-plugin:2.1:build-classpath (create-mrapp-generated-classpath) @ phoenix-pig ---
[INFO] Wrote classpath file '<https://builds.apache.org/job/Phoenix-4.x-HBase-1.0/ws/phoenix-pig/target/classes/mrapp-generated-classpath'.>
[INFO] 
[INFO] --- maven-resources-plugin:2.6:testResources (default-testResources) @ phoenix-pig ---
[INFO] Using 'UTF-8' encoding to copy filtered resources.
[INFO] skip non existing resourceDirectory <https://builds.apache.org/job/Phoenix-4.x-HBase-1.0/ws/phoenix-pig/src/test/resources>
[INFO] skip non existing resourceDirectory <https://builds.apache.org/job/Phoenix-4.x-HBase-1.0/ws/phoenix-pig/src/it/resources>
[INFO] Copying 3 resources
[INFO] 
[INFO] --- maven-compiler-plugin:3.0:testCompile (default-testCompile) @ phoenix-pig ---
[INFO] Changes detected - recompiling the module!
[INFO] Compiling 8 source files to <https://builds.apache.org/job/Phoenix-4.x-HBase-1.0/ws/phoenix-pig/target/test-classes>
[INFO] 
[INFO] --- maven-surefire-plugin:2.19:test (default-test) @ phoenix-pig ---

-------------------------------------------------------
 T E S T S
-------------------------------------------------------
Running org.apache.phoenix.pig.util.PhoenixPigSchemaUtilTest
Running org.apache.phoenix.pig.util.TableSchemaParserFunctionTest
Running org.apache.phoenix.pig.util.TypeUtilTest
Tests run: 3, Failures: 0, Errors: 0, Skipped: 0, Time elapsed: 0.13 sec - in org.apache.phoenix.pig.util.TableSchemaParserFunctionTest
Running org.apache.phoenix.pig.util.QuerySchemaParserFunctionTest
Tests run: 1, Failures: 0, Errors: 0, Skipped: 0, Time elapsed: 0.517 sec - in org.apache.phoenix.pig.util.TypeUtilTest
Running org.apache.phoenix.pig.util.SqlQueryToColumnInfoFunctionTest
Tests run: 2, Failures: 0, Errors: 0, Skipped: 0, Time elapsed: 0.67 sec - in org.apache.phoenix.pig.util.PhoenixPigSchemaUtilTest
Tests run: 4, Failures: 0, Errors: 0, Skipped: 0, Time elapsed: 2.242 sec - in org.apache.phoenix.pig.util.QuerySchemaParserFunctionTest
Tests run: 1, Failures: 0, Errors: 0, Skipped: 0, Time elapsed: 1.854 sec - in org.apache.phoenix.pig.util.SqlQueryToColumnInfoFunctionTest

Results :

Tests run: 11, Failures: 0, Errors: 0, Skipped: 0

[INFO] 
[INFO] --- maven-source-plugin:2.2.1:jar-no-fork (attach-sources) @ phoenix-pig ---
[INFO] Building jar: <https://builds.apache.org/job/Phoenix-4.x-HBase-1.0/222/artifact/phoenix-pig/target/phoenix-pig-4.7.0-HBase-1.0-SNAPSHOT-sources.jar>
[INFO] 
[INFO] --- maven-jar-plugin:2.4:test-jar (default) @ phoenix-pig ---
[INFO] Building jar: <https://builds.apache.org/job/Phoenix-4.x-HBase-1.0/222/artifact/phoenix-pig/target/phoenix-pig-4.7.0-HBase-1.0-SNAPSHOT-tests.jar>
[INFO] 
[INFO] --- maven-jar-plugin:2.4:jar (default-jar) @ phoenix-pig ---
[INFO] Building jar: <https://builds.apache.org/job/Phoenix-4.x-HBase-1.0/222/artifact/phoenix-pig/target/phoenix-pig-4.7.0-HBase-1.0-SNAPSHOT.jar>
[INFO] 
[INFO] --- maven-site-plugin:3.2:attach-descriptor (attach-descriptor) @ phoenix-pig ---
[INFO] 
[INFO] --- maven-failsafe-plugin:2.19:integration-test (ClientManagedTimeTests) @ phoenix-pig ---

-------------------------------------------------------
 T E S T S
-------------------------------------------------------

Results :

Tests run: 0, Failures: 0, Errors: 0, Skipped: 0

[INFO] 
[INFO] --- maven-failsafe-plugin:2.19:integration-test (HBaseManagedTimeTests) @ phoenix-pig ---

-------------------------------------------------------
 T E S T S
-------------------------------------------------------
Running org.apache.phoenix.pig.PhoenixHBaseStorerIT
Running org.apache.phoenix.pig.PhoenixHBaseLoaderIT
Running org.apache.phoenix.pig.udf.ReserveNSequenceTestIT
Tests run: 10, Failures: 0, Errors: 0, Skipped: 0, Time elapsed: 2.47 sec - in org.apache.phoenix.pig.udf.ReserveNSequenceTestIT
Tests run: 4, Failures: 0, Errors: 0, Skipped: 0, Time elapsed: 15.619 sec - in org.apache.phoenix.pig.PhoenixHBaseStorerIT
Tests run: 16, Failures: 0, Errors: 0, Skipped: 0, Time elapsed: 51.057 sec - in org.apache.phoenix.pig.PhoenixHBaseLoaderIT

Results :

Tests run: 30, Failures: 0, Errors: 0, Skipped: 0

[INFO] 
[INFO] --- maven-failsafe-plugin:2.19:integration-test (NeedTheirOwnClusterTests) @ phoenix-pig ---

-------------------------------------------------------
 T E S T S
-------------------------------------------------------

Results :

Tests run: 0, Failures: 0, Errors: 0, Skipped: 0

[INFO] 
[INFO] --- maven-failsafe-plugin:2.19:verify (ClientManagedTimeTests) @ phoenix-pig ---
[INFO] ------------------------------------------------------------------------
[INFO] Reactor Summary:
[INFO] 
[INFO] Apache Phoenix .................................... SUCCESS [3.701s]
[INFO] Phoenix Core ...................................... SUCCESS [46:15.577s]
[INFO] Phoenix - Flume ................................... SUCCESS [1:01.364s]
[INFO] Phoenix - Pig ..................................... FAILURE [1:45.720s]
[INFO] Phoenix Query Server Client ....................... SKIPPED
[INFO] Phoenix Query Server .............................. SKIPPED
[INFO] Phoenix - Pherf ................................... SKIPPED
[INFO] Phoenix - Spark ................................... SKIPPED
[INFO] Phoenix Assembly .................................. SKIPPED
[INFO] Phoenix - Tracing Web Application ................. SKIPPED
[INFO] ------------------------------------------------------------------------
[INFO] BUILD FAILURE
[INFO] ------------------------------------------------------------------------
[INFO] Total time: 49:06.970s
[INFO] Finished at: Fri Nov 13 19:35:13 UTC 2015
[INFO] Final Memory: 74M/995M
[INFO] ------------------------------------------------------------------------
[ERROR] Failed to execute goal org.apache.maven.plugins:maven-failsafe-plugin:2.19:verify (ClientManagedTimeTests) on project phoenix-pig: There was a timeout or other error in the fork -> [Help 1]
[ERROR] 
[ERROR] To see the full stack trace of the errors, re-run Maven with the -e switch.
[ERROR] Re-run Maven using the -X switch to enable full debug logging.
[ERROR] 
[ERROR] For more information about the errors and possible solutions, please read the following articles:
[ERROR] [Help 1] http://cwiki.apache.org/confluence/display/MAVEN/MojoExecutionException
[ERROR] 
[ERROR] After correcting the problems, you can resume the build with the command
[ERROR]   mvn <goals> -rf :phoenix-pig
Build step 'Invoke top-level Maven targets' marked build as failure
Archiving artifacts
Compressed 1.25 GB of artifacts by 51.8% relative to #214
Recording test results

Build failed in Jenkins: Phoenix-4.x-HBase-1.0 #221

Posted by Apache Jenkins Server <je...@builds.apache.org>.
See <https://builds.apache.org/job/Phoenix-4.x-HBase-1.0/221/changes>

Changes:

[jmahonin] PHOENIX-2288: PDecimal precision and scale aren't carried through to

------------------------------------------
[...truncated 1185 lines...]
Running org.apache.phoenix.end2end.index.DropViewIT
Tests run: 3, Failures: 0, Errors: 0, Skipped: 0, Time elapsed: 11.92 sec - in org.apache.phoenix.end2end.UpsertSelectAutoCommitIT
Running org.apache.phoenix.end2end.index.GlobalIndexOptimizationIT
Tests run: 1, Failures: 0, Errors: 0, Skipped: 0, Time elapsed: 8.031 sec - in org.apache.phoenix.end2end.index.DropViewIT
Running org.apache.phoenix.end2end.index.IndexIT
Tests run: 3, Failures: 0, Errors: 0, Skipped: 0, Time elapsed: 18.379 sec - in org.apache.phoenix.end2end.index.SaltedIndexIT
Running org.apache.phoenix.end2end.index.LocalIndexIT
Tests run: 6, Failures: 0, Errors: 0, Skipped: 0, Time elapsed: 36.523 sec - in org.apache.phoenix.end2end.index.GlobalIndexOptimizationIT
Running org.apache.phoenix.end2end.index.IndexExpressionIT
Tests run: 28, Failures: 0, Errors: 0, Skipped: 0, Time elapsed: 162.625 sec - in org.apache.phoenix.end2end.InListIT
Running org.apache.phoenix.end2end.index.ViewIndexIT
Tests run: 1, Failures: 0, Errors: 0, Skipped: 0, Time elapsed: 4.747 sec - in org.apache.phoenix.end2end.index.ViewIndexIT
Running org.apache.phoenix.end2end.index.ImmutableIndexIT
Tests run: 2, Failures: 0, Errors: 0, Skipped: 0, Time elapsed: 8.531 sec - in org.apache.phoenix.end2end.index.ImmutableIndexIT
Running org.apache.phoenix.end2end.index.IndexMetadataIT
Tests run: 6, Failures: 0, Errors: 0, Skipped: 0, Time elapsed: 38.204 sec - in org.apache.phoenix.end2end.index.IndexMetadataIT
Running org.apache.phoenix.end2end.index.MutableIndexIT
Tests run: 20, Failures: 0, Errors: 0, Skipped: 0, Time elapsed: 145.886 sec - in org.apache.phoenix.end2end.index.LocalIndexIT
Running org.apache.phoenix.end2end.CSVCommonsLoaderIT
Tests run: 12, Failures: 0, Errors: 0, Skipped: 0, Time elapsed: 50.638 sec - in org.apache.phoenix.end2end.index.MutableIndexIT
Running org.apache.phoenix.end2end.OctetLengthFunctionEnd2EndIT
Tests run: 1, Failures: 0, Errors: 0, Skipped: 0, Time elapsed: 2.215 sec - in org.apache.phoenix.end2end.OctetLengthFunctionEnd2EndIT
Running org.apache.phoenix.end2end.LpadFunctionIT
Tests run: 16, Failures: 0, Errors: 0, Skipped: 0, Time elapsed: 17.425 sec - in org.apache.phoenix.end2end.CSVCommonsLoaderIT
Running org.apache.phoenix.end2end.MinMaxAggregateFunctionIT
Tests run: 1, Failures: 0, Errors: 0, Skipped: 0, Time elapsed: 2.831 sec - in org.apache.phoenix.end2end.MinMaxAggregateFunctionIT
Running org.apache.phoenix.end2end.TimezoneOffsetFunctionIT
Tests run: 12, Failures: 0, Errors: 0, Skipped: 0, Time elapsed: 13.957 sec - in org.apache.phoenix.end2end.LpadFunctionIT
Running org.apache.phoenix.end2end.RegexpSubstrFunctionIT
Tests run: 2, Failures: 0, Errors: 0, Skipped: 0, Time elapsed: 3.075 sec - in org.apache.phoenix.end2end.RegexpSubstrFunctionIT
Running org.apache.phoenix.end2end.BinaryRowKeyIT
Tests run: 7, Failures: 0, Errors: 0, Skipped: 0, Time elapsed: 5.631 sec - in org.apache.phoenix.end2end.TimezoneOffsetFunctionIT
Running org.apache.phoenix.end2end.SignFunctionEnd2EndIT
Tests run: 3, Failures: 0, Errors: 0, Skipped: 0, Time elapsed: 2.899 sec - in org.apache.phoenix.end2end.BinaryRowKeyIT
Running org.apache.phoenix.end2end.SortMergeJoinIT
Tests run: 2, Failures: 0, Errors: 0, Skipped: 0, Time elapsed: 4.664 sec - in org.apache.phoenix.end2end.SignFunctionEnd2EndIT
Running org.apache.phoenix.end2end.DecodeFunctionIT
Tests run: 6, Failures: 0, Errors: 0, Skipped: 0, Time elapsed: 2.837 sec - in org.apache.phoenix.end2end.DecodeFunctionIT
Running org.apache.phoenix.end2end.RTrimFunctionIT
Tests run: 2, Failures: 0, Errors: 0, Skipped: 0, Time elapsed: 2.489 sec - in org.apache.phoenix.end2end.RTrimFunctionIT
Running org.apache.phoenix.end2end.DisableLocalIndexIT
Tests run: 1, Failures: 0, Errors: 0, Skipped: 0, Time elapsed: 3.86 sec - in org.apache.phoenix.end2end.DisableLocalIndexIT
Running org.apache.phoenix.end2end.HashJoinIT
Tests run: 62, Failures: 0, Errors: 0, Skipped: 0, Time elapsed: 171.052 sec - in org.apache.phoenix.end2end.index.IndexExpressionIT
Running org.apache.phoenix.end2end.HashJoinLocalIndexIT
Tests run: 1, Failures: 0, Errors: 0, Skipped: 0, Time elapsed: 13.881 sec - in org.apache.phoenix.end2end.HashJoinLocalIndexIT
Running org.apache.phoenix.end2end.ModulusExpressionIT
Tests run: 11, Failures: 0, Errors: 0, Skipped: 0, Time elapsed: 5.832 sec - in org.apache.phoenix.end2end.ModulusExpressionIT
Running org.apache.phoenix.end2end.ArrayToStringFunctionIT
Tests run: 36, Failures: 0, Errors: 0, Skipped: 0, Time elapsed: 14.87 sec - in org.apache.phoenix.end2end.ArrayToStringFunctionIT
Running org.apache.phoenix.end2end.StoreNullsIT
Tests run: 3, Failures: 0, Errors: 0, Skipped: 0, Time elapsed: 20.81 sec - in org.apache.phoenix.end2end.StoreNullsIT
Running org.apache.phoenix.end2end.EvaluationOfORIT
Tests run: 2, Failures: 0, Errors: 0, Skipped: 0, Time elapsed: 2.602 sec - in org.apache.phoenix.end2end.EvaluationOfORIT
Running org.apache.phoenix.end2end.ExecuteStatementsIT
Tests run: 2, Failures: 0, Errors: 0, Skipped: 0, Time elapsed: 15.746 sec - in org.apache.phoenix.end2end.ExecuteStatementsIT
Running org.apache.phoenix.end2end.ConvertTimezoneFunctionIT
Tests run: 60, Failures: 0, Errors: 0, Skipped: 4, Time elapsed: 280.188 sec - in org.apache.phoenix.end2end.index.IndexIT
Tests run: 7, Failures: 0, Errors: 0, Skipped: 0, Time elapsed: 4.282 sec - in org.apache.phoenix.end2end.ConvertTimezoneFunctionIT
Running org.apache.phoenix.end2end.ExpFunctionEnd2EndIT
Running org.apache.phoenix.end2end.PowerFunctionEnd2EndIT
Tests run: 1, Failures: 0, Errors: 0, Skipped: 0, Time elapsed: 4.69 sec - in org.apache.phoenix.end2end.PowerFunctionEnd2EndIT
Running org.apache.phoenix.end2end.StddevIT
Tests run: 4, Failures: 0, Errors: 0, Skipped: 0, Time elapsed: 5.023 sec - in org.apache.phoenix.end2end.StddevIT
Running org.apache.phoenix.end2end.TenantSpecificViewIndexSaltedIT
Tests run: 3, Failures: 0, Errors: 0, Skipped: 0, Time elapsed: 11.147 sec - in org.apache.phoenix.end2end.ExpFunctionEnd2EndIT
Running org.apache.phoenix.end2end.AlterSessionIT
Tests run: 2, Failures: 0, Errors: 0, Skipped: 0, Time elapsed: 3.825 sec - in org.apache.phoenix.end2end.AlterSessionIT
Running org.apache.phoenix.end2end.FirstValueFunctionIT
Tests run: 4, Failures: 0, Errors: 0, Skipped: 0, Time elapsed: 9.243 sec - in org.apache.phoenix.end2end.TenantSpecificViewIndexSaltedIT
Running org.apache.phoenix.end2end.SkipScanAfterManualSplitIT
Tests run: 7, Failures: 0, Errors: 0, Skipped: 0, Time elapsed: 6.766 sec - in org.apache.phoenix.end2end.FirstValueFunctionIT
Running org.apache.phoenix.end2end.ArrayAppendFunctionIT
Tests run: 108, Failures: 0, Errors: 0, Skipped: 0, Time elapsed: 488.168 sec - in org.apache.phoenix.end2end.SpooledSortMergeJoinIT
Running org.apache.phoenix.end2end.TenantSpecificViewIndexIT
Tests run: 3, Failures: 0, Errors: 0, Skipped: 0, Time elapsed: 31.261 sec - in org.apache.phoenix.end2end.SkipScanAfterManualSplitIT
Running org.apache.phoenix.end2end.GetSetByteBitFunctionEnd2EndIT
Tests run: 1, Failures: 0, Errors: 0, Skipped: 0, Time elapsed: 2.002 sec - in org.apache.phoenix.end2end.GetSetByteBitFunctionEnd2EndIT
Running org.apache.phoenix.end2end.UpgradeIT
Tests run: 34, Failures: 0, Errors: 0, Skipped: 0, Time elapsed: 30.795 sec - in org.apache.phoenix.end2end.ArrayAppendFunctionIT
Running org.apache.phoenix.end2end.LnLogFunctionEnd2EndIT
Tests run: 8, Failures: 0, Errors: 0, Skipped: 0, Time elapsed: 20.089 sec - in org.apache.phoenix.end2end.TenantSpecificViewIndexIT
Running org.apache.phoenix.end2end.SpooledTmpFileDeleteIT
Tests run: 1, Failures: 0, Errors: 0, Skipped: 0, Time elapsed: 6.403 sec - in org.apache.phoenix.end2end.LnLogFunctionEnd2EndIT
Running org.apache.phoenix.end2end.SkipScanQueryIT
Tests run: 1, Failures: 0, Errors: 0, Skipped: 0, Time elapsed: 3.649 sec - in org.apache.phoenix.end2end.SpooledTmpFileDeleteIT
Running org.apache.phoenix.end2end.ArrayConcatFunctionIT
Tests run: 108, Failures: 0, Errors: 0, Skipped: 0, Time elapsed: 178.237 sec - in org.apache.phoenix.end2end.SortMergeJoinIT
Running org.apache.phoenix.end2end.DateTimeIT
Tests run: 9, Failures: 0, Errors: 0, Skipped: 0, Time elapsed: 19.72 sec - in org.apache.phoenix.end2end.SkipScanQueryIT
Running org.apache.phoenix.end2end.ArrayFillFunctionIT
Tests run: 111, Failures: 0, Errors: 0, Skipped: 0, Time elapsed: 173.269 sec - in org.apache.phoenix.end2end.HashJoinIT
Running org.apache.phoenix.end2end.QueryExecWithoutSCNIT
Tests run: 1, Failures: 0, Errors: 0, Skipped: 0, Time elapsed: 3.132 sec - in org.apache.phoenix.end2end.QueryExecWithoutSCNIT
Running org.apache.phoenix.end2end.SubqueryIT
Tests run: 19, Failures: 0, Errors: 0, Skipped: 0, Time elapsed: 12.14 sec - in org.apache.phoenix.end2end.DateTimeIT
Running org.apache.phoenix.trace.PhoenixTracingEndToEndIT
Tests run: 30, Failures: 0, Errors: 0, Skipped: 0, Time elapsed: 26.084 sec - in org.apache.phoenix.end2end.ArrayConcatFunctionIT
Tests run: 6, Failures: 0, Errors: 0, Skipped: 0, Time elapsed: 39.242 sec - in org.apache.phoenix.end2end.UpgradeIT
Running org.apache.phoenix.trace.PhoenixTraceReaderIT
Running org.apache.phoenix.trace.PhoenixTableMetricsWriterIT
Tests run: 2, Failures: 0, Errors: 0, Skipped: 0, Time elapsed: 0.766 sec - in org.apache.phoenix.trace.PhoenixTableMetricsWriterIT
Tests run: 2, Failures: 0, Errors: 0, Skipped: 0, Time elapsed: 1.557 sec - in org.apache.phoenix.trace.PhoenixTraceReaderIT
Tests run: 26, Failures: 0, Errors: 0, Skipped: 0, Time elapsed: 24.894 sec - in org.apache.phoenix.end2end.ArrayFillFunctionIT
Tests run: 21, Failures: 0, Errors: 0, Skipped: 0, Time elapsed: 50.578 sec - in org.apache.phoenix.end2end.SubqueryIT
Tests run: 6, Failures: 0, Errors: 0, Skipped: 0, Time elapsed: 84.586 sec - in org.apache.phoenix.trace.PhoenixTracingEndToEndIT

Results :

Tests run: 1208, Failures: 0, Errors: 0, Skipped: 4

[INFO] 
[INFO] --- maven-failsafe-plugin:2.19:integration-test (NeedTheirOwnClusterTests) @ phoenix-core ---

-------------------------------------------------------
 T E S T S
-------------------------------------------------------
Running org.apache.phoenix.rpc.PhoenixServerRpcIT
Running org.apache.phoenix.rpc.PhoenixClientRpcIT
Running org.apache.phoenix.monitoring.PhoenixMetricsIT
Running org.apache.phoenix.iterate.RoundRobinResultIteratorWithStatsIT
Tests run: 2, Failures: 0, Errors: 0, Skipped: 0, Time elapsed: 6.896 sec - in org.apache.phoenix.rpc.PhoenixClientRpcIT
Tests run: 1, Failures: 0, Errors: 0, Skipped: 0, Time elapsed: 15.339 sec - in org.apache.phoenix.iterate.RoundRobinResultIteratorWithStatsIT
Tests run: 2, Failures: 0, Errors: 0, Skipped: 0, Time elapsed: 17.22 sec - in org.apache.phoenix.rpc.PhoenixServerRpcIT
Running org.apache.phoenix.end2end.ConnectionUtilIT
Running org.apache.phoenix.mapreduce.IndexToolIT
Running org.apache.phoenix.mapreduce.CsvBulkLoadToolIT
Running org.apache.phoenix.end2end.MultiCfQueryExecIT
Tests run: 1, Failures: 0, Errors: 0, Skipped: 0, Time elapsed: 19.258 sec - in org.apache.phoenix.end2end.ConnectionUtilIT
Tests run: 7, Failures: 0, Errors: 0, Skipped: 0, Time elapsed: 18.715 sec - in org.apache.phoenix.end2end.MultiCfQueryExecIT
Tests run: 17, Failures: 2, Errors: 0, Skipped: 0, Time elapsed: 55.6 sec <<< FAILURE! - in org.apache.phoenix.monitoring.PhoenixMetricsIT
testMetricsForUpsertSelectWithAutoCommit(org.apache.phoenix.monitoring.PhoenixMetricsIT)  Time elapsed: 6.063 sec  <<< FAILURE!
java.lang.AssertionError: Unequal values for metric MUTATION_BYTES expected:<5600> but was:<16240>
	at org.apache.phoenix.monitoring.PhoenixMetricsIT.assertMetricsHaveSameValues(PhoenixMetricsIT.java:654)
	at org.apache.phoenix.monitoring.PhoenixMetricsIT.assertMetricsAreSame(PhoenixMetricsIT.java:643)
	at org.apache.phoenix.monitoring.PhoenixMetricsIT.testMetricsForUpsertSelectWithAutoCommit(PhoenixMetricsIT.java:462)

testMetricsForUpsertSelectSameTable(org.apache.phoenix.monitoring.PhoenixMetricsIT)  Time elapsed: 2.698 sec  <<< FAILURE!
java.lang.AssertionError: Unequal values for metric MUTATION_BYTES expected:<5600> but was:<16240>
	at org.apache.phoenix.monitoring.PhoenixMetricsIT.assertMetricsHaveSameValues(PhoenixMetricsIT.java:654)
	at org.apache.phoenix.monitoring.PhoenixMetricsIT.assertMetricsAreSame(PhoenixMetricsIT.java:643)
	at org.apache.phoenix.monitoring.PhoenixMetricsIT.testMetricsForUpsertSelectSameTable(PhoenixMetricsIT.java:615)

Running org.apache.phoenix.end2end.ViewIT
Running org.apache.phoenix.end2end.SaltedViewIT
Running org.apache.phoenix.end2end.StatsCollectorIT
Tests run: 2, Failures: 0, Errors: 0, Skipped: 0, Time elapsed: 20.621 sec - in org.apache.phoenix.end2end.SaltedViewIT
Running org.apache.phoenix.end2end.ParallelIteratorsIT
Tests run: 22, Failures: 0, Errors: 0, Skipped: 0, Time elapsed: 56.871 sec - in org.apache.phoenix.end2end.ViewIT
Tests run: 3, Failures: 0, Errors: 0, Skipped: 0, Time elapsed: 21.125 sec - in org.apache.phoenix.end2end.ParallelIteratorsIT
Running org.apache.phoenix.end2end.QueryWithLimitIT
Tests run: 4, Failures: 0, Errors: 0, Skipped: 0, Time elapsed: 58.419 sec - in org.apache.phoenix.end2end.StatsCollectorIT
Running org.apache.phoenix.end2end.QueryTimeoutIT
Tests run: 2, Failures: 0, Errors: 0, Skipped: 0, Time elapsed: 11.835 sec - in org.apache.phoenix.end2end.QueryWithLimitIT
Running org.apache.phoenix.end2end.ContextClassloaderIT
Tests run: 1, Failures: 0, Errors: 0, Skipped: 0, Time elapsed: 18.556 sec - in org.apache.phoenix.end2end.QueryTimeoutIT
Running org.apache.phoenix.end2end.index.MutableIndexFailureIT
Running org.apache.phoenix.end2end.index.ImmutableIndexWithStatsIT
Tests run: 3, Failures: 0, Errors: 0, Skipped: 0, Time elapsed: 6.955 sec - in org.apache.phoenix.end2end.ContextClassloaderIT
Tests run: 1, Failures: 0, Errors: 0, Skipped: 0, Time elapsed: 10.581 sec - in org.apache.phoenix.end2end.index.ImmutableIndexWithStatsIT
Running org.apache.phoenix.end2end.index.MutableIndexReplicationIT
Running org.apache.phoenix.end2end.UserDefinedFunctionsIT
Tests run: 3, Failures: 0, Errors: 0, Skipped: 2, Time elapsed: 35.053 sec - in org.apache.phoenix.end2end.index.MutableIndexFailureIT
Tests run: 1, Failures: 0, Errors: 0, Skipped: 0, Time elapsed: 19.097 sec - in org.apache.phoenix.end2end.index.MutableIndexReplicationIT
Tests run: 5, Failures: 0, Errors: 0, Skipped: 0, Time elapsed: 172.568 sec - in org.apache.phoenix.mapreduce.CsvBulkLoadToolIT
Tests run: 13, Failures: 0, Errors: 0, Skipped: 0, Time elapsed: 16.992 sec - in org.apache.phoenix.end2end.UserDefinedFunctionsIT
Running org.apache.phoenix.end2end.AlterTableIT
Running org.apache.phoenix.end2end.KeyOnlyIT
Running org.apache.phoenix.end2end.UnionAllIT
Running org.apache.phoenix.end2end.TenantSpecificTablesDDLIT
Tests run: 3, Failures: 0, Errors: 0, Skipped: 0, Time elapsed: 11.069 sec - in org.apache.phoenix.end2end.KeyOnlyIT
Running org.apache.phoenix.end2end.CountDistinctCompressionIT
Tests run: 12, Failures: 0, Errors: 0, Skipped: 0, Time elapsed: 29.011 sec - in org.apache.phoenix.end2end.UnionAllIT
Tests run: 1, Failures: 0, Errors: 0, Skipped: 0, Time elapsed: 11.794 sec - in org.apache.phoenix.end2end.CountDistinctCompressionIT
Tests run: 17, Failures: 0, Errors: 0, Skipped: 0, Time elapsed: 38.447 sec - in org.apache.phoenix.end2end.TenantSpecificTablesDDLIT
Running org.apache.phoenix.end2end.TenantSpecificTablesDMLIT
Running org.apache.phoenix.end2end.SpillableGroupByIT
Tests run: 1, Failures: 0, Errors: 0, Skipped: 0, Time elapsed: 7.9 sec - in org.apache.phoenix.end2end.SpillableGroupByIT
Running org.apache.phoenix.hbase.index.FailForUnsupportedHBaseVersionsIT
Running org.apache.phoenix.end2end.StatsCollectorWithSplitsAndMultiCFIT
Tests run: 2, Failures: 0, Errors: 0, Skipped: 0, Time elapsed: 17.08 sec - in org.apache.phoenix.hbase.index.FailForUnsupportedHBaseVersionsIT
Running org.apache.phoenix.hbase.index.covered.EndToEndCoveredColumnsIndexBuilderIT
Tests run: 2, Failures: 0, Errors: 0, Skipped: 0, Time elapsed: 28.959 sec - in org.apache.phoenix.end2end.StatsCollectorWithSplitsAndMultiCFIT
Tests run: 2, Failures: 0, Errors: 0, Skipped: 0, Time elapsed: 9.573 sec - in org.apache.phoenix.hbase.index.covered.EndToEndCoveredColumnsIndexBuilderIT
Running org.apache.phoenix.hbase.index.covered.example.FailWithoutRetriesIT
Tests run: 16, Failures: 0, Errors: 0, Skipped: 0, Time elapsed: 51.241 sec - in org.apache.phoenix.end2end.TenantSpecificTablesDMLIT
Running org.apache.phoenix.hbase.index.covered.example.EndtoEndIndexingWithCompressionIT
Tests run: 1, Failures: 0, Errors: 0, Skipped: 0, Time elapsed: 8.957 sec - in org.apache.phoenix.hbase.index.covered.example.FailWithoutRetriesIT
Running org.apache.phoenix.hbase.index.balancer.IndexLoadBalancerIT
Running org.apache.phoenix.hbase.index.covered.example.EndToEndCoveredIndexingIT
Tests run: 11, Failures: 0, Errors: 0, Skipped: 0, Time elapsed: 51.102 sec - in org.apache.phoenix.hbase.index.covered.example.EndtoEndIndexingWithCompressionIT
Tests run: 11, Failures: 0, Errors: 0, Skipped: 0, Time elapsed: 50.402 sec - in org.apache.phoenix.hbase.index.covered.example.EndToEndCoveredIndexingIT
Running org.apache.hadoop.hbase.regionserver.wal.WALReplayWithIndexWritesAndUncompressedWALInHBase_094_9_IT
Tests run: 9, Failures: 0, Errors: 0, Skipped: 0, Time elapsed: 362.413 sec - in org.apache.phoenix.mapreduce.IndexToolIT
Running org.apache.hadoop.hbase.regionserver.wal.WALReplayWithIndexWritesAndCompressedWALIT
Tests run: 1, Failures: 0, Errors: 0, Skipped: 0, Time elapsed: 16.79 sec - in org.apache.hadoop.hbase.regionserver.wal.WALReplayWithIndexWritesAndUncompressedWALInHBase_094_9_IT
Tests run: 1, Failures: 0, Errors: 0, Skipped: 0, Time elapsed: 17.477 sec - in org.apache.hadoop.hbase.regionserver.wal.WALReplayWithIndexWritesAndCompressedWALIT
Tests run: 9, Failures: 0, Errors: 0, Skipped: 0, Time elapsed: 103.176 sec - in org.apache.phoenix.hbase.index.balancer.IndexLoadBalancerIT
Tests run: 55, Failures: 0, Errors: 0, Skipped: 0, Time elapsed: 347.068 sec - in org.apache.phoenix.end2end.AlterTableIT
Running org.apache.phoenix.execute.PartialCommitIT
Tests run: 6, Failures: 0, Errors: 0, Skipped: 0, Time elapsed: 8.877 sec - in org.apache.phoenix.execute.PartialCommitIT

Results :

Failed tests: 
  PhoenixMetricsIT.testMetricsForUpsertSelectSameTable:615->assertMetricsAreSame:643->assertMetricsHaveSameValues:654 Unequal values for metric MUTATION_BYTES expected:<5600> but was:<16240>
  PhoenixMetricsIT.testMetricsForUpsertSelectWithAutoCommit:462->assertMetricsAreSame:643->assertMetricsHaveSameValues:654 Unequal values for metric MUTATION_BYTES expected:<5600> but was:<16240>

Tests run: 250, Failures: 2, Errors: 0, Skipped: 2

[INFO] 
[INFO] --- maven-failsafe-plugin:2.19:verify (ClientManagedTimeTests) @ phoenix-core ---
[INFO] ------------------------------------------------------------------------
[INFO] Reactor Summary:
[INFO] 
[INFO] Apache Phoenix .................................... SUCCESS [3.213s]
[INFO] Phoenix Core ...................................... FAILURE [46:26.058s]
[INFO] Phoenix - Flume ................................... SKIPPED
[INFO] Phoenix - Pig ..................................... SKIPPED
[INFO] Phoenix Query Server Client ....................... SKIPPED
[INFO] Phoenix Query Server .............................. SKIPPED
[INFO] Phoenix - Pherf ................................... SKIPPED
[INFO] Phoenix - Spark ................................... SKIPPED
[INFO] Phoenix Assembly .................................. SKIPPED
[INFO] Phoenix - Tracing Web Application ................. SKIPPED
[INFO] ------------------------------------------------------------------------
[INFO] BUILD FAILURE
[INFO] ------------------------------------------------------------------------
[INFO] Total time: 46:29.827s
[INFO] Finished at: Fri Nov 13 18:41:59 UTC 2015
[INFO] Final Memory: 61M/1230M
[INFO] ------------------------------------------------------------------------
[ERROR] Failed to execute goal org.apache.maven.plugins:maven-failsafe-plugin:2.19:verify (ClientManagedTimeTests) on project phoenix-core: There are test failures.
[ERROR] 
[ERROR] Please refer to <https://builds.apache.org/job/Phoenix-4.x-HBase-1.0/ws/phoenix-core/target/failsafe-reports> for the individual test results.
[ERROR] -> [Help 1]
[ERROR] 
[ERROR] To see the full stack trace of the errors, re-run Maven with the -e switch.
[ERROR] Re-run Maven using the -X switch to enable full debug logging.
[ERROR] 
[ERROR] For more information about the errors and possible solutions, please read the following articles:
[ERROR] [Help 1] http://cwiki.apache.org/confluence/display/MAVEN/MojoFailureException
[ERROR] 
[ERROR] After correcting the problems, you can resume the build with the command
[ERROR]   mvn <goals> -rf :phoenix-core
Build step 'Invoke top-level Maven targets' marked build as failure
Archiving artifacts
Compressed 1.21 GB of artifacts by 50.8% relative to #214
Recording test results

Build failed in Jenkins: Phoenix-4.x-HBase-1.0 #220

Posted by Apache Jenkins Server <je...@builds.apache.org>.
See <https://builds.apache.org/job/Phoenix-4.x-HBase-1.0/220/changes>

Changes:

[jtaylor] PHOENIX-2414 Parameterize index tests

------------------------------------------
[...truncated 1186 lines...]
Running org.apache.phoenix.end2end.index.DropViewIT
Tests run: 3, Failures: 0, Errors: 0, Skipped: 0, Time elapsed: 11.464 sec - in org.apache.phoenix.end2end.UpsertSelectAutoCommitIT
Running org.apache.phoenix.end2end.index.GlobalIndexOptimizationIT
Tests run: 1, Failures: 0, Errors: 0, Skipped: 0, Time elapsed: 7.581 sec - in org.apache.phoenix.end2end.index.DropViewIT
Running org.apache.phoenix.end2end.index.IndexIT
Tests run: 3, Failures: 0, Errors: 0, Skipped: 0, Time elapsed: 19.115 sec - in org.apache.phoenix.end2end.index.SaltedIndexIT
Running org.apache.phoenix.end2end.index.LocalIndexIT
Tests run: 6, Failures: 0, Errors: 0, Skipped: 0, Time elapsed: 36.542 sec - in org.apache.phoenix.end2end.index.GlobalIndexOptimizationIT
Running org.apache.phoenix.end2end.index.IndexExpressionIT
Tests run: 28, Failures: 0, Errors: 0, Skipped: 0, Time elapsed: 160.559 sec - in org.apache.phoenix.end2end.InListIT
Running org.apache.phoenix.end2end.index.ViewIndexIT
Tests run: 1, Failures: 0, Errors: 0, Skipped: 0, Time elapsed: 5.071 sec - in org.apache.phoenix.end2end.index.ViewIndexIT
Running org.apache.phoenix.end2end.index.ImmutableIndexIT
Tests run: 2, Failures: 0, Errors: 0, Skipped: 0, Time elapsed: 9.134 sec - in org.apache.phoenix.end2end.index.ImmutableIndexIT
Running org.apache.phoenix.end2end.index.IndexMetadataIT
Tests run: 6, Failures: 0, Errors: 0, Skipped: 0, Time elapsed: 39.508 sec - in org.apache.phoenix.end2end.index.IndexMetadataIT
Running org.apache.phoenix.end2end.index.MutableIndexIT
Tests run: 12, Failures: 0, Errors: 0, Skipped: 0, Time elapsed: 54.242 sec - in org.apache.phoenix.end2end.index.MutableIndexIT
Running org.apache.phoenix.end2end.CSVCommonsLoaderIT
Tests run: 20, Failures: 0, Errors: 0, Skipped: 0, Time elapsed: 175.32 sec - in org.apache.phoenix.end2end.index.LocalIndexIT
Running org.apache.phoenix.end2end.OctetLengthFunctionEnd2EndIT
Tests run: 1, Failures: 0, Errors: 0, Skipped: 0, Time elapsed: 2.213 sec - in org.apache.phoenix.end2end.OctetLengthFunctionEnd2EndIT
Running org.apache.phoenix.end2end.LpadFunctionIT
Tests run: 16, Failures: 0, Errors: 0, Skipped: 0, Time elapsed: 19.944 sec - in org.apache.phoenix.end2end.CSVCommonsLoaderIT
Running org.apache.phoenix.end2end.MinMaxAggregateFunctionIT
Tests run: 1, Failures: 0, Errors: 0, Skipped: 0, Time elapsed: 2.357 sec - in org.apache.phoenix.end2end.MinMaxAggregateFunctionIT
Running org.apache.phoenix.end2end.TimezoneOffsetFunctionIT
Tests run: 62, Failures: 0, Errors: 0, Skipped: 0, Time elapsed: 163.577 sec - in org.apache.phoenix.end2end.index.IndexExpressionIT
Running org.apache.phoenix.end2end.RegexpSubstrFunctionIT
Tests run: 2, Failures: 0, Errors: 0, Skipped: 0, Time elapsed: 2.682 sec - in org.apache.phoenix.end2end.RegexpSubstrFunctionIT
Running org.apache.phoenix.end2end.BinaryRowKeyIT
Tests run: 7, Failures: 0, Errors: 0, Skipped: 0, Time elapsed: 7.454 sec - in org.apache.phoenix.end2end.TimezoneOffsetFunctionIT
Running org.apache.phoenix.end2end.SignFunctionEnd2EndIT
Tests run: 12, Failures: 0, Errors: 0, Skipped: 0, Time elapsed: 13.314 sec - in org.apache.phoenix.end2end.LpadFunctionIT
Running org.apache.phoenix.end2end.SortMergeJoinIT
Tests run: 3, Failures: 0, Errors: 0, Skipped: 0, Time elapsed: 2.604 sec - in org.apache.phoenix.end2end.BinaryRowKeyIT
Running org.apache.phoenix.end2end.DecodeFunctionIT
Tests run: 6, Failures: 0, Errors: 0, Skipped: 0, Time elapsed: 3.199 sec - in org.apache.phoenix.end2end.DecodeFunctionIT
Running org.apache.phoenix.end2end.RTrimFunctionIT
Tests run: 2, Failures: 0, Errors: 0, Skipped: 0, Time elapsed: 6.114 sec - in org.apache.phoenix.end2end.SignFunctionEnd2EndIT
Running org.apache.phoenix.end2end.DisableLocalIndexIT
Tests run: 2, Failures: 0, Errors: 0, Skipped: 0, Time elapsed: 3.271 sec - in org.apache.phoenix.end2end.RTrimFunctionIT
Running org.apache.phoenix.end2end.HashJoinIT
Tests run: 1, Failures: 0, Errors: 0, Skipped: 0, Time elapsed: 5 sec - in org.apache.phoenix.end2end.DisableLocalIndexIT
Running org.apache.phoenix.end2end.HashJoinLocalIndexIT
Tests run: 1, Failures: 0, Errors: 0, Skipped: 0, Time elapsed: 18.238 sec - in org.apache.phoenix.end2end.HashJoinLocalIndexIT
Running org.apache.phoenix.end2end.ModulusExpressionIT
Tests run: 11, Failures: 0, Errors: 0, Skipped: 0, Time elapsed: 6.939 sec - in org.apache.phoenix.end2end.ModulusExpressionIT
Running org.apache.phoenix.end2end.ArrayToStringFunctionIT
Tests run: 36, Failures: 0, Errors: 0, Skipped: 0, Time elapsed: 17.574 sec - in org.apache.phoenix.end2end.ArrayToStringFunctionIT
Running org.apache.phoenix.end2end.StoreNullsIT
Tests run: 3, Failures: 0, Errors: 0, Skipped: 0, Time elapsed: 20.442 sec - in org.apache.phoenix.end2end.StoreNullsIT
Running org.apache.phoenix.end2end.EvaluationOfORIT
Tests run: 2, Failures: 0, Errors: 0, Skipped: 0, Time elapsed: 2.659 sec - in org.apache.phoenix.end2end.EvaluationOfORIT
Running org.apache.phoenix.end2end.ExecuteStatementsIT
Tests run: 60, Failures: 0, Errors: 0, Skipped: 4, Time elapsed: 291.184 sec - in org.apache.phoenix.end2end.index.IndexIT
Running org.apache.phoenix.end2end.ConvertTimezoneFunctionIT
Tests run: 2, Failures: 0, Errors: 0, Skipped: 0, Time elapsed: 17.567 sec - in org.apache.phoenix.end2end.ExecuteStatementsIT
Running org.apache.phoenix.end2end.ExpFunctionEnd2EndIT
Tests run: 7, Failures: 0, Errors: 0, Skipped: 0, Time elapsed: 8.042 sec - in org.apache.phoenix.end2end.ConvertTimezoneFunctionIT
Running org.apache.phoenix.end2end.PowerFunctionEnd2EndIT
Tests run: 3, Failures: 0, Errors: 0, Skipped: 0, Time elapsed: 9.625 sec - in org.apache.phoenix.end2end.ExpFunctionEnd2EndIT
Running org.apache.phoenix.end2end.StddevIT
Tests run: 1, Failures: 0, Errors: 0, Skipped: 0, Time elapsed: 6.165 sec - in org.apache.phoenix.end2end.PowerFunctionEnd2EndIT
Running org.apache.phoenix.end2end.TenantSpecificViewIndexSaltedIT
Tests run: 4, Failures: 0, Errors: 0, Skipped: 0, Time elapsed: 5.664 sec - in org.apache.phoenix.end2end.StddevIT
Running org.apache.phoenix.end2end.AlterSessionIT
Tests run: 2, Failures: 0, Errors: 0, Skipped: 0, Time elapsed: 2.801 sec - in org.apache.phoenix.end2end.AlterSessionIT
Running org.apache.phoenix.end2end.FirstValueFunctionIT
Tests run: 7, Failures: 0, Errors: 0, Skipped: 0, Time elapsed: 5.197 sec - in org.apache.phoenix.end2end.FirstValueFunctionIT
Running org.apache.phoenix.end2end.SkipScanAfterManualSplitIT
Tests run: 4, Failures: 0, Errors: 0, Skipped: 0, Time elapsed: 13.987 sec - in org.apache.phoenix.end2end.TenantSpecificViewIndexSaltedIT
Running org.apache.phoenix.end2end.ArrayAppendFunctionIT
Tests run: 108, Failures: 0, Errors: 0, Skipped: 0, Time elapsed: 505.206 sec - in org.apache.phoenix.end2end.SpooledSortMergeJoinIT
Running org.apache.phoenix.end2end.TenantSpecificViewIndexIT
Tests run: 3, Failures: 0, Errors: 0, Skipped: 0, Time elapsed: 34.804 sec - in org.apache.phoenix.end2end.SkipScanAfterManualSplitIT
Running org.apache.phoenix.end2end.GetSetByteBitFunctionEnd2EndIT
Tests run: 34, Failures: 0, Errors: 0, Skipped: 0, Time elapsed: 33.476 sec - in org.apache.phoenix.end2end.ArrayAppendFunctionIT
Running org.apache.phoenix.end2end.UpgradeIT
Tests run: 1, Failures: 0, Errors: 0, Skipped: 0, Time elapsed: 2.082 sec - in org.apache.phoenix.end2end.GetSetByteBitFunctionEnd2EndIT
Running org.apache.phoenix.end2end.LnLogFunctionEnd2EndIT
Tests run: 1, Failures: 0, Errors: 0, Skipped: 0, Time elapsed: 3.975 sec - in org.apache.phoenix.end2end.LnLogFunctionEnd2EndIT
Running org.apache.phoenix.end2end.SpooledTmpFileDeleteIT
Tests run: 8, Failures: 0, Errors: 0, Skipped: 0, Time elapsed: 22 sec - in org.apache.phoenix.end2end.TenantSpecificViewIndexIT
Tests run: 1, Failures: 0, Errors: 0, Skipped: 0, Time elapsed: 3.216 sec - in org.apache.phoenix.end2end.SpooledTmpFileDeleteIT
Running org.apache.phoenix.end2end.ArrayConcatFunctionIT
Running org.apache.phoenix.end2end.SkipScanQueryIT
Tests run: 108, Failures: 0, Errors: 0, Skipped: 0, Time elapsed: 169.934 sec - in org.apache.phoenix.end2end.SortMergeJoinIT
Running org.apache.phoenix.end2end.DateTimeIT
Tests run: 19, Failures: 0, Errors: 0, Skipped: 0, Time elapsed: 10.619 sec - in org.apache.phoenix.end2end.DateTimeIT
Running org.apache.phoenix.end2end.ArrayFillFunctionIT
Tests run: 30, Failures: 0, Errors: 0, Skipped: 0, Time elapsed: 17.234 sec - in org.apache.phoenix.end2end.ArrayConcatFunctionIT
Running org.apache.phoenix.end2end.QueryExecWithoutSCNIT
Tests run: 9, Failures: 0, Errors: 0, Skipped: 0, Time elapsed: 17.767 sec - in org.apache.phoenix.end2end.SkipScanQueryIT
Running org.apache.phoenix.end2end.SubqueryIT
Tests run: 1, Failures: 0, Errors: 0, Skipped: 0, Time elapsed: 3.24 sec - in org.apache.phoenix.end2end.QueryExecWithoutSCNIT
Running org.apache.phoenix.trace.PhoenixTracingEndToEndIT
Tests run: 26, Failures: 0, Errors: 0, Skipped: 0, Time elapsed: 13.157 sec - in org.apache.phoenix.end2end.ArrayFillFunctionIT
Running org.apache.phoenix.trace.PhoenixTraceReaderIT
Tests run: 2, Failures: 0, Errors: 0, Skipped: 0, Time elapsed: 1.272 sec - in org.apache.phoenix.trace.PhoenixTraceReaderIT
Running org.apache.phoenix.trace.PhoenixTableMetricsWriterIT
Tests run: 2, Failures: 0, Errors: 0, Skipped: 0, Time elapsed: 0.523 sec - in org.apache.phoenix.trace.PhoenixTableMetricsWriterIT
Tests run: 111, Failures: 0, Errors: 0, Skipped: 0, Time elapsed: 191.461 sec - in org.apache.phoenix.end2end.HashJoinIT
Tests run: 6, Failures: 0, Errors: 0, Skipped: 0, Time elapsed: 58.241 sec - in org.apache.phoenix.end2end.UpgradeIT
Tests run: 6, Failures: 0, Errors: 0, Skipped: 0, Time elapsed: 88.705 sec - in org.apache.phoenix.trace.PhoenixTracingEndToEndIT
Tests run: 21, Failures: 0, Errors: 0, Skipped: 0, Time elapsed: 103.306 sec - in org.apache.phoenix.end2end.SubqueryIT

Results :

Tests run: 1208, Failures: 0, Errors: 0, Skipped: 4

[INFO] 
[INFO] --- maven-failsafe-plugin:2.19:integration-test (NeedTheirOwnClusterTests) @ phoenix-core ---

-------------------------------------------------------
 T E S T S
-------------------------------------------------------
Running org.apache.phoenix.rpc.PhoenixServerRpcIT
Running org.apache.phoenix.rpc.PhoenixClientRpcIT
Running org.apache.phoenix.iterate.RoundRobinResultIteratorWithStatsIT
Running org.apache.phoenix.monitoring.PhoenixMetricsIT
Tests run: 2, Failures: 0, Errors: 0, Skipped: 0, Time elapsed: 6.627 sec - in org.apache.phoenix.rpc.PhoenixClientRpcIT
Tests run: 1, Failures: 0, Errors: 0, Skipped: 0, Time elapsed: 14.74 sec - in org.apache.phoenix.iterate.RoundRobinResultIteratorWithStatsIT
Tests run: 2, Failures: 0, Errors: 0, Skipped: 0, Time elapsed: 16.897 sec - in org.apache.phoenix.rpc.PhoenixServerRpcIT
Running org.apache.phoenix.end2end.ConnectionUtilIT
Running org.apache.phoenix.end2end.MultiCfQueryExecIT
Running org.apache.phoenix.mapreduce.IndexToolIT
Running org.apache.phoenix.mapreduce.CsvBulkLoadToolIT
Tests run: 1, Failures: 0, Errors: 0, Skipped: 0, Time elapsed: 19.786 sec - in org.apache.phoenix.end2end.ConnectionUtilIT
Tests run: 7, Failures: 0, Errors: 0, Skipped: 0, Time elapsed: 20.462 sec - in org.apache.phoenix.end2end.MultiCfQueryExecIT
Tests run: 17, Failures: 2, Errors: 0, Skipped: 0, Time elapsed: 56.243 sec <<< FAILURE! - in org.apache.phoenix.monitoring.PhoenixMetricsIT
testMetricsForUpsertSelectWithAutoCommit(org.apache.phoenix.monitoring.PhoenixMetricsIT)  Time elapsed: 3.695 sec  <<< FAILURE!
java.lang.AssertionError: Unequal values for metric MUTATION_BYTES expected:<5600> but was:<16240>
	at org.apache.phoenix.monitoring.PhoenixMetricsIT.assertMetricsHaveSameValues(PhoenixMetricsIT.java:654)
	at org.apache.phoenix.monitoring.PhoenixMetricsIT.assertMetricsAreSame(PhoenixMetricsIT.java:643)
	at org.apache.phoenix.monitoring.PhoenixMetricsIT.testMetricsForUpsertSelectWithAutoCommit(PhoenixMetricsIT.java:462)

testMetricsForUpsertSelectSameTable(org.apache.phoenix.monitoring.PhoenixMetricsIT)  Time elapsed: 3.825 sec  <<< FAILURE!
java.lang.AssertionError: Unequal values for metric MUTATION_BYTES expected:<5600> but was:<16240>
	at org.apache.phoenix.monitoring.PhoenixMetricsIT.assertMetricsHaveSameValues(PhoenixMetricsIT.java:654)
	at org.apache.phoenix.monitoring.PhoenixMetricsIT.assertMetricsAreSame(PhoenixMetricsIT.java:643)
	at org.apache.phoenix.monitoring.PhoenixMetricsIT.testMetricsForUpsertSelectSameTable(PhoenixMetricsIT.java:615)

Running org.apache.phoenix.end2end.ViewIT
Running org.apache.phoenix.end2end.SaltedViewIT
Running org.apache.phoenix.end2end.StatsCollectorIT
Tests run: 2, Failures: 0, Errors: 0, Skipped: 0, Time elapsed: 18.839 sec - in org.apache.phoenix.end2end.SaltedViewIT
Running org.apache.phoenix.end2end.ParallelIteratorsIT
Tests run: 22, Failures: 0, Errors: 0, Skipped: 0, Time elapsed: 57.222 sec - in org.apache.phoenix.end2end.ViewIT
Tests run: 3, Failures: 0, Errors: 0, Skipped: 0, Time elapsed: 21 sec - in org.apache.phoenix.end2end.ParallelIteratorsIT
Tests run: 4, Failures: 0, Errors: 0, Skipped: 0, Time elapsed: 57.396 sec - in org.apache.phoenix.end2end.StatsCollectorIT
Running org.apache.phoenix.end2end.QueryWithLimitIT
Running org.apache.phoenix.end2end.QueryTimeoutIT
Tests run: 2, Failures: 0, Errors: 0, Skipped: 0, Time elapsed: 10.017 sec - in org.apache.phoenix.end2end.QueryWithLimitIT
Running org.apache.phoenix.end2end.ContextClassloaderIT
Tests run: 1, Failures: 0, Errors: 0, Skipped: 0, Time elapsed: 16.893 sec - in org.apache.phoenix.end2end.QueryTimeoutIT
Running org.apache.phoenix.end2end.index.MutableIndexFailureIT
Tests run: 3, Failures: 0, Errors: 0, Skipped: 0, Time elapsed: 5.802 sec - in org.apache.phoenix.end2end.ContextClassloaderIT
Running org.apache.phoenix.end2end.index.ImmutableIndexWithStatsIT
Tests run: 1, Failures: 0, Errors: 0, Skipped: 0, Time elapsed: 11.22 sec - in org.apache.phoenix.end2end.index.ImmutableIndexWithStatsIT
Running org.apache.phoenix.end2end.index.MutableIndexReplicationIT
Tests run: 3, Failures: 0, Errors: 0, Skipped: 2, Time elapsed: 35 sec - in org.apache.phoenix.end2end.index.MutableIndexFailureIT
Tests run: 5, Failures: 0, Errors: 0, Skipped: 0, Time elapsed: 161.894 sec - in org.apache.phoenix.mapreduce.CsvBulkLoadToolIT
Running org.apache.phoenix.end2end.UserDefinedFunctionsIT
Tests run: 1, Failures: 0, Errors: 0, Skipped: 0, Time elapsed: 17.965 sec - in org.apache.phoenix.end2end.index.MutableIndexReplicationIT
Tests run: 13, Failures: 0, Errors: 0, Skipped: 0, Time elapsed: 14.961 sec - in org.apache.phoenix.end2end.UserDefinedFunctionsIT
Running org.apache.phoenix.end2end.AlterTableIT
Running org.apache.phoenix.end2end.UnionAllIT
Running org.apache.phoenix.end2end.TenantSpecificTablesDDLIT
Running org.apache.phoenix.end2end.KeyOnlyIT
Tests run: 3, Failures: 0, Errors: 0, Skipped: 0, Time elapsed: 10.88 sec - in org.apache.phoenix.end2end.KeyOnlyIT
Tests run: 12, Failures: 0, Errors: 0, Skipped: 0, Time elapsed: 27.555 sec - in org.apache.phoenix.end2end.UnionAllIT
Running org.apache.phoenix.end2end.CountDistinctCompressionIT
Tests run: 17, Failures: 0, Errors: 0, Skipped: 0, Time elapsed: 38.499 sec - in org.apache.phoenix.end2end.TenantSpecificTablesDDLIT
Tests run: 1, Failures: 0, Errors: 0, Skipped: 0, Time elapsed: 11.769 sec - in org.apache.phoenix.end2end.CountDistinctCompressionIT
Running org.apache.phoenix.end2end.SpillableGroupByIT
Tests run: 1, Failures: 0, Errors: 0, Skipped: 0, Time elapsed: 9.48 sec - in org.apache.phoenix.end2end.SpillableGroupByIT
Running org.apache.phoenix.hbase.index.FailForUnsupportedHBaseVersionsIT
Running org.apache.phoenix.end2end.StatsCollectorWithSplitsAndMultiCFIT
Running org.apache.phoenix.end2end.TenantSpecificTablesDMLIT
Tests run: 2, Failures: 0, Errors: 0, Skipped: 0, Time elapsed: 13.972 sec - in org.apache.phoenix.hbase.index.FailForUnsupportedHBaseVersionsIT
Running org.apache.phoenix.hbase.index.covered.EndToEndCoveredColumnsIndexBuilderIT
Tests run: 2, Failures: 0, Errors: 0, Skipped: 0, Time elapsed: 9.347 sec - in org.apache.phoenix.hbase.index.covered.EndToEndCoveredColumnsIndexBuilderIT
Tests run: 2, Failures: 0, Errors: 0, Skipped: 0, Time elapsed: 31.309 sec - in org.apache.phoenix.end2end.StatsCollectorWithSplitsAndMultiCFIT
Running org.apache.phoenix.hbase.index.covered.example.FailWithoutRetriesIT
Tests run: 16, Failures: 0, Errors: 0, Skipped: 0, Time elapsed: 40.431 sec - in org.apache.phoenix.end2end.TenantSpecificTablesDMLIT
Tests run: 1, Failures: 0, Errors: 0, Skipped: 0, Time elapsed: 9.335 sec - in org.apache.phoenix.hbase.index.covered.example.FailWithoutRetriesIT
Running org.apache.phoenix.hbase.index.covered.example.EndtoEndIndexingWithCompressionIT
Running org.apache.phoenix.hbase.index.balancer.IndexLoadBalancerIT
Running org.apache.phoenix.hbase.index.covered.example.EndToEndCoveredIndexingIT
Tests run: 11, Failures: 0, Errors: 0, Skipped: 0, Time elapsed: 58.421 sec - in org.apache.phoenix.hbase.index.covered.example.EndtoEndIndexingWithCompressionIT
Tests run: 11, Failures: 0, Errors: 0, Skipped: 0, Time elapsed: 59.858 sec - in org.apache.phoenix.hbase.index.covered.example.EndToEndCoveredIndexingIT
Running org.apache.hadoop.hbase.regionserver.wal.WALReplayWithIndexWritesAndUncompressedWALInHBase_094_9_IT
Tests run: 9, Failures: 0, Errors: 0, Skipped: 0, Time elapsed: 374.874 sec - in org.apache.phoenix.mapreduce.IndexToolIT
Running org.apache.hadoop.hbase.regionserver.wal.WALReplayWithIndexWritesAndCompressedWALIT
Tests run: 1, Failures: 0, Errors: 0, Skipped: 0, Time elapsed: 17.632 sec - in org.apache.hadoop.hbase.regionserver.wal.WALReplayWithIndexWritesAndUncompressedWALInHBase_094_9_IT
Tests run: 1, Failures: 0, Errors: 0, Skipped: 0, Time elapsed: 17.102 sec - in org.apache.hadoop.hbase.regionserver.wal.WALReplayWithIndexWritesAndCompressedWALIT
Tests run: 9, Failures: 0, Errors: 0, Skipped: 0, Time elapsed: 103.57 sec - in org.apache.phoenix.hbase.index.balancer.IndexLoadBalancerIT
Tests run: 55, Failures: 0, Errors: 0, Skipped: 0, Time elapsed: 349.233 sec - in org.apache.phoenix.end2end.AlterTableIT
Running org.apache.phoenix.execute.PartialCommitIT
Tests run: 6, Failures: 0, Errors: 0, Skipped: 0, Time elapsed: 4.314 sec - in org.apache.phoenix.execute.PartialCommitIT

Results :

Failed tests: 
  PhoenixMetricsIT.testMetricsForUpsertSelectSameTable:615->assertMetricsAreSame:643->assertMetricsHaveSameValues:654 Unequal values for metric MUTATION_BYTES expected:<5600> but was:<16240>
  PhoenixMetricsIT.testMetricsForUpsertSelectWithAutoCommit:462->assertMetricsAreSame:643->assertMetricsHaveSameValues:654 Unequal values for metric MUTATION_BYTES expected:<5600> but was:<16240>

Tests run: 250, Failures: 2, Errors: 0, Skipped: 2

[INFO] 
[INFO] --- maven-failsafe-plugin:2.19:verify (ClientManagedTimeTests) @ phoenix-core ---
[INFO] ------------------------------------------------------------------------
[INFO] Reactor Summary:
[INFO] 
[INFO] Apache Phoenix .................................... SUCCESS [3.445s]
[INFO] Phoenix Core ...................................... FAILURE [46:48.554s]
[INFO] Phoenix - Flume ................................... SKIPPED
[INFO] Phoenix - Pig ..................................... SKIPPED
[INFO] Phoenix Query Server Client ....................... SKIPPED
[INFO] Phoenix Query Server .............................. SKIPPED
[INFO] Phoenix - Pherf ................................... SKIPPED
[INFO] Phoenix - Spark ................................... SKIPPED
[INFO] Phoenix Assembly .................................. SKIPPED
[INFO] Phoenix - Tracing Web Application ................. SKIPPED
[INFO] ------------------------------------------------------------------------
[INFO] BUILD FAILURE
[INFO] ------------------------------------------------------------------------
[INFO] Total time: 46:52.601s
[INFO] Finished at: Fri Nov 13 09:12:24 UTC 2015
[INFO] Final Memory: 60M/1018M
[INFO] ------------------------------------------------------------------------
[ERROR] Failed to execute goal org.apache.maven.plugins:maven-failsafe-plugin:2.19:verify (ClientManagedTimeTests) on project phoenix-core: There are test failures.
[ERROR] 
[ERROR] Please refer to <https://builds.apache.org/job/Phoenix-4.x-HBase-1.0/ws/phoenix-core/target/failsafe-reports> for the individual test results.
[ERROR] -> [Help 1]
[ERROR] 
[ERROR] To see the full stack trace of the errors, re-run Maven with the -e switch.
[ERROR] Re-run Maven using the -X switch to enable full debug logging.
[ERROR] 
[ERROR] For more information about the errors and possible solutions, please read the following articles:
[ERROR] [Help 1] http://cwiki.apache.org/confluence/display/MAVEN/MojoFailureException
[ERROR] 
[ERROR] After correcting the problems, you can resume the build with the command
[ERROR]   mvn <goals> -rf :phoenix-core
Build step 'Invoke top-level Maven targets' marked build as failure
Archiving artifacts
Compressed 1.19 GB of artifacts by 50.1% relative to #214
Recording test results

Build failed in Jenkins: Phoenix-4.x-HBase-1.0 #219

Posted by Apache Jenkins Server <je...@builds.apache.org>.
See <https://builds.apache.org/job/Phoenix-4.x-HBase-1.0/219/changes>

Changes:

[jtaylor] PHOENIX-2413 Implement BaseMutationPlan for common method implementation

------------------------------------------
[...truncated 6685 lines...]
Running org.apache.phoenix.end2end.index.LocalIndexIT
Tests run: 15, Failures: 0, Errors: 0, Skipped: 0, Time elapsed: 158.4 sec - in org.apache.phoenix.end2end.AlterTableWithViewsIT
Running org.apache.phoenix.end2end.index.GlobalMutableIndexIT
Tests run: 111, Failures: 0, Errors: 0, Skipped: 0, Time elapsed: 406.806 sec - in org.apache.phoenix.end2end.HashJoinIT
Running org.apache.phoenix.end2end.index.SaltedIndexIT
Tests run: 3, Failures: 0, Errors: 0, Skipped: 0, Time elapsed: 19.406 sec - in org.apache.phoenix.end2end.index.SaltedIndexIT
Tests run: 108, Failures: 0, Errors: 0, Skipped: 0, Time elapsed: 384.525 sec - in org.apache.phoenix.end2end.SortMergeJoinIT
Running org.apache.phoenix.end2end.index.IndexMetadataIT
Running org.apache.phoenix.end2end.index.IndexExpressionIT
Tests run: 6, Failures: 0, Errors: 0, Skipped: 0, Time elapsed: 42.765 sec - in org.apache.phoenix.end2end.index.IndexMetadataIT
Running org.apache.phoenix.end2end.index.DropViewIT
Tests run: 16, Failures: 0, Errors: 0, Skipped: 0, Time elapsed: 74.058 sec - in org.apache.phoenix.end2end.index.GlobalMutableIndexIT
Running org.apache.phoenix.end2end.index.LocalMutableIndexIT
Tests run: 1, Failures: 0, Errors: 0, Skipped: 0, Time elapsed: 7.713 sec - in org.apache.phoenix.end2end.index.DropViewIT
Running org.apache.phoenix.end2end.index.ViewIndexIT
Tests run: 1, Failures: 0, Errors: 0, Skipped: 0, Time elapsed: 4.657 sec - in org.apache.phoenix.end2end.index.ViewIndexIT
Running org.apache.phoenix.end2end.index.ImmutableIndexIT
Tests run: 13, Failures: 0, Errors: 0, Skipped: 0, Time elapsed: 30.21 sec - in org.apache.phoenix.end2end.index.ImmutableIndexIT
Running org.apache.phoenix.end2end.ServerExceptionIT
Tests run: 1, Failures: 0, Errors: 0, Skipped: 0, Time elapsed: 1.934 sec - in org.apache.phoenix.end2end.ServerExceptionIT
Running org.apache.phoenix.end2end.CSVCommonsLoaderIT
Tests run: 16, Failures: 0, Errors: 0, Skipped: 0, Time elapsed: 18.267 sec - in org.apache.phoenix.end2end.CSVCommonsLoaderIT
Running org.apache.phoenix.end2end.ReverseFunctionIT
Tests run: 5, Failures: 0, Errors: 0, Skipped: 0, Time elapsed: 3.907 sec - in org.apache.phoenix.end2end.ReverseFunctionIT
Running org.apache.phoenix.end2end.GetSetByteBitFunctionEnd2EndIT
Tests run: 20, Failures: 0, Errors: 0, Skipped: 0, Time elapsed: 155.927 sec - in org.apache.phoenix.end2end.index.LocalIndexIT
Running org.apache.phoenix.end2end.ArrayAppendFunctionIT
Tests run: 1, Failures: 0, Errors: 0, Skipped: 0, Time elapsed: 2.758 sec - in org.apache.phoenix.end2end.GetSetByteBitFunctionEnd2EndIT
Running org.apache.phoenix.end2end.LnLogFunctionEnd2EndIT
Tests run: 16, Failures: 0, Errors: 0, Skipped: 0, Time elapsed: 69.341 sec - in org.apache.phoenix.end2end.index.LocalMutableIndexIT
Running org.apache.phoenix.end2end.AutoCommitIT
Tests run: 1, Failures: 0, Errors: 0, Skipped: 0, Time elapsed: 4.613 sec - in org.apache.phoenix.end2end.LnLogFunctionEnd2EndIT
Running org.apache.phoenix.end2end.TenantIdTypeIT
Tests run: 1, Failures: 0, Errors: 0, Skipped: 0, Time elapsed: 2.131 sec - in org.apache.phoenix.end2end.AutoCommitIT
Running org.apache.phoenix.end2end.PowerFunctionEnd2EndIT
Tests run: 1, Failures: 0, Errors: 0, Skipped: 0, Time elapsed: 4.941 sec - in org.apache.phoenix.end2end.PowerFunctionEnd2EndIT
Running org.apache.phoenix.end2end.TenantSpecificViewIndexSaltedIT
Tests run: 34, Failures: 0, Errors: 0, Skipped: 0, Time elapsed: 13.851 sec - in org.apache.phoenix.end2end.ArrayAppendFunctionIT
Running org.apache.phoenix.end2end.DateTimeIT
Tests run: 4, Failures: 0, Errors: 0, Skipped: 0, Time elapsed: 9.647 sec - in org.apache.phoenix.end2end.TenantSpecificViewIndexSaltedIT
Running org.apache.phoenix.end2end.SpooledTmpFileDeleteIT
Tests run: 19, Failures: 0, Errors: 0, Skipped: 0, Time elapsed: 10.936 sec - in org.apache.phoenix.end2end.DateTimeIT
Running org.apache.phoenix.end2end.CbrtFunctionEnd2EndIT
Tests run: 1, Failures: 0, Errors: 0, Skipped: 0, Time elapsed: 3.386 sec - in org.apache.phoenix.end2end.SpooledTmpFileDeleteIT
Running org.apache.phoenix.end2end.DecodeFunctionIT
Tests run: 2, Failures: 0, Errors: 0, Skipped: 0, Time elapsed: 4.499 sec - in org.apache.phoenix.end2end.CbrtFunctionEnd2EndIT
Running org.apache.phoenix.end2end.ModulusExpressionIT
Tests run: 6, Failures: 0, Errors: 0, Skipped: 0, Time elapsed: 4.042 sec - in org.apache.phoenix.end2end.DecodeFunctionIT
Running org.apache.phoenix.end2end.OctetLengthFunctionEnd2EndIT
Tests run: 1, Failures: 0, Errors: 0, Skipped: 0, Time elapsed: 2.187 sec - in org.apache.phoenix.end2end.OctetLengthFunctionEnd2EndIT
Running org.apache.phoenix.end2end.LastValueFunctionIT
Tests run: 11, Failures: 0, Errors: 0, Skipped: 0, Time elapsed: 5.452 sec - in org.apache.phoenix.end2end.ModulusExpressionIT
Running org.apache.phoenix.end2end.UpgradeIT
Tests run: 11, Failures: 0, Errors: 0, Skipped: 0, Time elapsed: 7.332 sec - in org.apache.phoenix.end2end.LastValueFunctionIT
Running org.apache.phoenix.end2end.FirstValueFunctionIT
Tests run: 7, Failures: 0, Errors: 0, Skipped: 0, Time elapsed: 4.055 sec - in org.apache.phoenix.end2end.FirstValueFunctionIT
Running org.apache.phoenix.end2end.DisableLocalIndexIT
Tests run: 1, Failures: 0, Errors: 0, Skipped: 0, Time elapsed: 4.339 sec - in org.apache.phoenix.end2end.DisableLocalIndexIT
Running org.apache.phoenix.end2end.HashJoinLocalIndexIT
Tests run: 1, Failures: 0, Errors: 0, Skipped: 0, Time elapsed: 14.191 sec - in org.apache.phoenix.end2end.HashJoinLocalIndexIT
Running org.apache.phoenix.end2end.UpsertBigValuesIT
Tests run: 15, Failures: 0, Errors: 0, Skipped: 0, Time elapsed: 64.464 sec - in org.apache.phoenix.end2end.TenantIdTypeIT
Running org.apache.phoenix.end2end.MD5FunctionIT
Tests run: 6, Failures: 0, Errors: 0, Skipped: 0, Time elapsed: 36.569 sec - in org.apache.phoenix.end2end.UpgradeIT
Running org.apache.phoenix.end2end.LpadFunctionIT
Tests run: 4, Failures: 0, Errors: 0, Skipped: 0, Time elapsed: 10.038 sec - in org.apache.phoenix.end2end.UpsertBigValuesIT
Running org.apache.phoenix.end2end.SignFunctionEnd2EndIT
Tests run: 3, Failures: 0, Errors: 0, Skipped: 0, Time elapsed: 5.316 sec - in org.apache.phoenix.end2end.MD5FunctionIT
Running org.apache.phoenix.end2end.SortOrderIT
Tests run: 2, Failures: 0, Errors: 0, Skipped: 0, Time elapsed: 4.273 sec - in org.apache.phoenix.end2end.SignFunctionEnd2EndIT
Running org.apache.phoenix.end2end.ArrayToStringFunctionIT
Tests run: 12, Failures: 0, Errors: 0, Skipped: 0, Time elapsed: 11.859 sec - in org.apache.phoenix.end2end.LpadFunctionIT
Running org.apache.phoenix.end2end.QueryExecWithoutSCNIT
Tests run: 62, Failures: 0, Errors: 0, Skipped: 0, Time elapsed: 202.277 sec - in org.apache.phoenix.end2end.index.IndexExpressionIT
Tests run: 1, Failures: 0, Errors: 0, Skipped: 0, Time elapsed: 3.436 sec - in org.apache.phoenix.end2end.QueryExecWithoutSCNIT
Running org.apache.phoenix.end2end.DynamicFamilyIT
Running org.apache.phoenix.end2end.RegexpReplaceFunctionIT
Tests run: 2, Failures: 0, Errors: 0, Skipped: 0, Time elapsed: 3.442 sec - in org.apache.phoenix.end2end.RegexpReplaceFunctionIT
Running org.apache.phoenix.end2end.RoundFloorCeilFunctionsEnd2EndIT
Tests run: 4, Failures: 0, Errors: 0, Skipped: 0, Time elapsed: 5.776 sec - in org.apache.phoenix.end2end.DynamicFamilyIT
Running org.apache.phoenix.end2end.DeleteIT
Tests run: 36, Failures: 0, Errors: 0, Skipped: 0, Time elapsed: 16.73 sec - in org.apache.phoenix.end2end.ArrayToStringFunctionIT
Running org.apache.phoenix.end2end.InListIT
Tests run: 108, Failures: 0, Errors: 0, Skipped: 0, Time elapsed: 499.95 sec - in org.apache.phoenix.end2end.SpooledSortMergeJoinIT
Running org.apache.phoenix.end2end.EvaluationOfORIT
Tests run: 2, Failures: 0, Errors: 0, Skipped: 0, Time elapsed: 2.523 sec - in org.apache.phoenix.end2end.EvaluationOfORIT
Running org.apache.phoenix.end2end.ReverseScanIT
Tests run: 3, Failures: 0, Errors: 0, Skipped: 0, Time elapsed: 8.842 sec - in org.apache.phoenix.end2end.ReverseScanIT
Running org.apache.phoenix.end2end.RTrimFunctionIT
Tests run: 45, Failures: 0, Errors: 0, Skipped: 0, Time elapsed: 40.61 sec - in org.apache.phoenix.end2end.SortOrderIT
Running org.apache.phoenix.end2end.NthValueFunctionIT
Tests run: 31, Failures: 0, Errors: 0, Skipped: 0, Time elapsed: 24.09 sec - in org.apache.phoenix.end2end.RoundFloorCeilFunctionsEnd2EndIT
Running org.apache.phoenix.end2end.ReadOnlyIT
Tests run: 2, Failures: 0, Errors: 0, Skipped: 0, Time elapsed: 3.74 sec - in org.apache.phoenix.end2end.RTrimFunctionIT
Running org.apache.phoenix.end2end.ArrayPrependFunctionIT
Tests run: 11, Failures: 0, Errors: 0, Skipped: 0, Time elapsed: 7.136 sec - in org.apache.phoenix.end2end.NthValueFunctionIT
Running org.apache.phoenix.end2end.ExecuteStatementsIT
Tests run: 1, Failures: 0, Errors: 0, Skipped: 0, Time elapsed: 8.608 sec - in org.apache.phoenix.end2end.ReadOnlyIT
Tests run: 22, Failures: 0, Errors: 0, Skipped: 0, Time elapsed: 32.533 sec - in org.apache.phoenix.end2end.DeleteIT
Running org.apache.phoenix.iterate.RoundRobinResultIteratorIT
Running org.apache.phoenix.iterate.PhoenixQueryTimeoutIT
Tests run: 2, Failures: 0, Errors: 0, Skipped: 0, Time elapsed: 3.874 sec - in org.apache.phoenix.iterate.PhoenixQueryTimeoutIT
Tests run: 2, Failures: 0, Errors: 0, Skipped: 0, Time elapsed: 15.942 sec - in org.apache.phoenix.end2end.ExecuteStatementsIT
Tests run: 34, Failures: 0, Errors: 0, Skipped: 0, Time elapsed: 29.628 sec - in org.apache.phoenix.end2end.ArrayPrependFunctionIT
Tests run: 28, Failures: 0, Errors: 0, Skipped: 0, Time elapsed: 69.119 sec - in org.apache.phoenix.end2end.InListIT
Tests run: 9, Failures: 0, Errors: 0, Skipped: 0, Time elapsed: 57.967 sec - in org.apache.phoenix.iterate.RoundRobinResultIteratorIT

Results :

Tests run: 1179, Failures: 0, Errors: 0, Skipped: 0

[INFO] 
[INFO] --- maven-failsafe-plugin:2.19:integration-test (NeedTheirOwnClusterTests) @ phoenix-core ---

-------------------------------------------------------
 T E S T S
-------------------------------------------------------
Running org.apache.phoenix.rpc.PhoenixClientRpcIT
Running org.apache.phoenix.rpc.PhoenixServerRpcIT
Running org.apache.phoenix.mapreduce.IndexToolIT
Running org.apache.phoenix.execute.PartialCommitIT
Tests run: 2, Failures: 0, Errors: 0, Skipped: 0, Time elapsed: 5.893 sec - in org.apache.phoenix.rpc.PhoenixClientRpcIT
Tests run: 2, Failures: 0, Errors: 0, Skipped: 0, Time elapsed: 14.397 sec - in org.apache.phoenix.rpc.PhoenixServerRpcIT
Tests run: 6, Failures: 0, Errors: 0, Skipped: 0, Time elapsed: 11.335 sec - in org.apache.phoenix.execute.PartialCommitIT
Running org.apache.phoenix.end2end.MultiCfQueryExecIT
Running org.apache.phoenix.end2end.ConnectionUtilIT
Running org.apache.phoenix.mapreduce.CsvBulkLoadToolIT
Running org.apache.phoenix.end2end.ViewIT
Tests run: 7, Failures: 0, Errors: 0, Skipped: 0, Time elapsed: 19.662 sec - in org.apache.phoenix.end2end.MultiCfQueryExecIT
Tests run: 1, Failures: 0, Errors: 0, Skipped: 0, Time elapsed: 19.448 sec - in org.apache.phoenix.end2end.ConnectionUtilIT
Running org.apache.phoenix.end2end.StatsCollectorIT
Tests run: 22, Failures: 0, Errors: 0, Skipped: 0, Time elapsed: 68.208 sec - in org.apache.phoenix.end2end.ViewIT
Tests run: 4, Failures: 0, Errors: 0, Skipped: 0, Time elapsed: 58.602 sec - in org.apache.phoenix.end2end.StatsCollectorIT
Running org.apache.phoenix.end2end.SaltedViewIT
Running org.apache.phoenix.end2end.index.ImmutableIndexWithStatsIT
Tests run: 2, Failures: 0, Errors: 0, Skipped: 0, Time elapsed: 20.828 sec - in org.apache.phoenix.end2end.SaltedViewIT
Tests run: 1, Failures: 0, Errors: 0, Skipped: 0, Time elapsed: 10.873 sec - in org.apache.phoenix.end2end.index.ImmutableIndexWithStatsIT
Running org.apache.phoenix.end2end.index.MutableIndexFailureIT
Running org.apache.phoenix.end2end.index.MutableIndexReplicationIT
Tests run: 3, Failures: 0, Errors: 0, Skipped: 2, Time elapsed: 35.365 sec - in org.apache.phoenix.end2end.index.MutableIndexFailureIT
Tests run: 1, Failures: 0, Errors: 0, Skipped: 0, Time elapsed: 21.452 sec - in org.apache.phoenix.end2end.index.MutableIndexReplicationIT
Running org.apache.phoenix.end2end.SpillableGroupByIT
Tests run: 1, Failures: 0, Errors: 0, Skipped: 0, Time elapsed: 10.973 sec - in org.apache.phoenix.end2end.SpillableGroupByIT
Tests run: 5, Failures: 0, Errors: 0, Skipped: 0, Time elapsed: 171.176 sec - in org.apache.phoenix.mapreduce.CsvBulkLoadToolIT
Running org.apache.phoenix.end2end.CountDistinctCompressionIT
Tests run: 1, Failures: 0, Errors: 0, Skipped: 0, Time elapsed: 8.945 sec - in org.apache.phoenix.end2end.CountDistinctCompressionIT
Running org.apache.phoenix.end2end.KeyOnlyIT
Running org.apache.phoenix.end2end.TenantSpecificTablesDDLIT
Running org.apache.phoenix.end2end.TenantSpecificTablesDMLIT
Tests run: 3, Failures: 0, Errors: 0, Skipped: 0, Time elapsed: 19.122 sec - in org.apache.phoenix.end2end.KeyOnlyIT
Running org.apache.phoenix.end2end.ContextClassloaderIT
Tests run: 17, Failures: 0, Errors: 0, Skipped: 0, Time elapsed: 38.137 sec - in org.apache.phoenix.end2end.TenantSpecificTablesDDLIT
Tests run: 3, Failures: 0, Errors: 0, Skipped: 0, Time elapsed: 8.704 sec - in org.apache.phoenix.end2end.ContextClassloaderIT
Tests run: 16, Failures: 0, Errors: 0, Skipped: 0, Time elapsed: 40.76 sec - in org.apache.phoenix.end2end.TenantSpecificTablesDMLIT
Running org.apache.phoenix.end2end.QueryTimeoutIT
Running org.apache.phoenix.end2end.QueryWithLimitIT
Running org.apache.phoenix.end2end.UserDefinedFunctionsIT
Tests run: 2, Failures: 0, Errors: 0, Skipped: 0, Time elapsed: 12.523 sec - in org.apache.phoenix.end2end.QueryWithLimitIT
Tests run: 1, Failures: 0, Errors: 0, Skipped: 0, Time elapsed: 18.825 sec - in org.apache.phoenix.end2end.QueryTimeoutIT
Tests run: 13, Failures: 0, Errors: 0, Skipped: 0, Time elapsed: 16.732 sec - in org.apache.phoenix.end2end.UserDefinedFunctionsIT
Running org.apache.phoenix.end2end.StatsCollectorWithSplitsAndMultiCFIT
Running org.apache.phoenix.end2end.ParallelIteratorsIT
Running org.apache.phoenix.end2end.UnionAllIT
Tests run: 3, Failures: 0, Errors: 0, Skipped: 0, Time elapsed: 21.362 sec - in org.apache.phoenix.end2end.ParallelIteratorsIT
Tests run: 2, Failures: 0, Errors: 0, Skipped: 0, Time elapsed: 31.301 sec - in org.apache.phoenix.end2end.StatsCollectorWithSplitsAndMultiCFIT
Running org.apache.phoenix.hbase.index.covered.EndToEndCoveredColumnsIndexBuilderIT
Tests run: 12, Failures: 0, Errors: 0, Skipped: 0, Time elapsed: 27.415 sec - in org.apache.phoenix.end2end.UnionAllIT
Running org.apache.phoenix.iterate.RoundRobinResultIteratorWithStatsIT
Tests run: 2, Failures: 0, Errors: 0, Skipped: 0, Time elapsed: 9.765 sec - in org.apache.phoenix.hbase.index.covered.EndToEndCoveredColumnsIndexBuilderIT
Tests run: 1, Failures: 0, Errors: 0, Skipped: 0, Time elapsed: 9.733 sec - in org.apache.phoenix.iterate.RoundRobinResultIteratorWithStatsIT
Running org.apache.phoenix.hbase.index.covered.example.EndtoEndIndexingWithCompressionIT
Running org.apache.phoenix.hbase.index.covered.example.FailWithoutRetriesIT
Running org.apache.phoenix.hbase.index.covered.example.EndToEndCoveredIndexingIT
Tests run: 9, Failures: 0, Errors: 0, Skipped: 0, Time elapsed: 374.508 sec - in org.apache.phoenix.mapreduce.IndexToolIT
Tests run: 1, Failures: 0, Errors: 0, Skipped: 0, Time elapsed: 10.005 sec - in org.apache.phoenix.hbase.index.covered.example.FailWithoutRetriesIT
Running org.apache.phoenix.hbase.index.FailForUnsupportedHBaseVersionsIT
Running org.apache.phoenix.hbase.index.balancer.IndexLoadBalancerIT
Tests run: 2, Failures: 0, Errors: 0, Skipped: 0, Time elapsed: 17.808 sec - in org.apache.phoenix.hbase.index.FailForUnsupportedHBaseVersionsIT
Running org.apache.phoenix.monitoring.PhoenixMetricsIT
Tests run: 11, Failures: 0, Errors: 0, Skipped: 0, Time elapsed: 57.15 sec - in org.apache.phoenix.hbase.index.covered.example.EndtoEndIndexingWithCompressionIT
Running org.apache.hadoop.hbase.regionserver.wal.WALReplayWithIndexWritesAndCompressedWALIT
Tests run: 11, Failures: 0, Errors: 0, Skipped: 0, Time elapsed: 58.857 sec - in org.apache.phoenix.hbase.index.covered.example.EndToEndCoveredIndexingIT
Running org.apache.hadoop.hbase.regionserver.wal.WALReplayWithIndexWritesAndUncompressedWALInHBase_094_9_IT
Tests run: 1, Failures: 0, Errors: 0, Skipped: 0, Time elapsed: 18.039 sec - in org.apache.hadoop.hbase.regionserver.wal.WALReplayWithIndexWritesAndCompressedWALIT
Tests run: 1, Failures: 0, Errors: 0, Skipped: 0, Time elapsed: 18.903 sec - in org.apache.hadoop.hbase.regionserver.wal.WALReplayWithIndexWritesAndUncompressedWALInHBase_094_9_IT
Tests run: 17, Failures: 2, Errors: 0, Skipped: 0, Time elapsed: 42.973 sec <<< FAILURE! - in org.apache.phoenix.monitoring.PhoenixMetricsIT
testMetricsForUpsertSelectWithAutoCommit(org.apache.phoenix.monitoring.PhoenixMetricsIT)  Time elapsed: 4.002 sec  <<< FAILURE!
java.lang.AssertionError: Unequal values for metric MUTATION_BYTES expected:<5600> but was:<16240>
	at org.apache.phoenix.monitoring.PhoenixMetricsIT.assertMetricsHaveSameValues(PhoenixMetricsIT.java:654)
	at org.apache.phoenix.monitoring.PhoenixMetricsIT.assertMetricsAreSame(PhoenixMetricsIT.java:643)
	at org.apache.phoenix.monitoring.PhoenixMetricsIT.testMetricsForUpsertSelectWithAutoCommit(PhoenixMetricsIT.java:462)

testMetricsForUpsertSelectSameTable(org.apache.phoenix.monitoring.PhoenixMetricsIT)  Time elapsed: 2.912 sec  <<< FAILURE!
java.lang.AssertionError: Unequal values for metric MUTATION_BYTES expected:<5600> but was:<16240>
	at org.apache.phoenix.monitoring.PhoenixMetricsIT.assertMetricsHaveSameValues(PhoenixMetricsIT.java:654)
	at org.apache.phoenix.monitoring.PhoenixMetricsIT.assertMetricsAreSame(PhoenixMetricsIT.java:643)
	at org.apache.phoenix.monitoring.PhoenixMetricsIT.testMetricsForUpsertSelectSameTable(PhoenixMetricsIT.java:615)

Tests run: 9, Failures: 0, Errors: 0, Skipped: 0, Time elapsed: 102.923 sec - in org.apache.phoenix.hbase.index.balancer.IndexLoadBalancerIT
Running org.apache.phoenix.end2end.AlterTableIT
Tests run: 55, Failures: 0, Errors: 0, Skipped: 0, Time elapsed: 334.654 sec - in org.apache.phoenix.end2end.AlterTableIT

Results :

Failed tests: 
  PhoenixMetricsIT.testMetricsForUpsertSelectSameTable:615->assertMetricsAreSame:643->assertMetricsHaveSameValues:654 Unequal values for metric MUTATION_BYTES expected:<5600> but was:<16240>
  PhoenixMetricsIT.testMetricsForUpsertSelectWithAutoCommit:462->assertMetricsAreSame:643->assertMetricsHaveSameValues:654 Unequal values for metric MUTATION_BYTES expected:<5600> but was:<16240>

Tests run: 250, Failures: 2, Errors: 0, Skipped: 2

[INFO] 
[INFO] --- maven-failsafe-plugin:2.19:verify (ClientManagedTimeTests) @ phoenix-core ---
[INFO] ------------------------------------------------------------------------
[INFO] Reactor Summary:
[INFO] 
[INFO] Apache Phoenix .................................... SUCCESS [5.551s]
[INFO] Phoenix Core ...................................... FAILURE [48:26.674s]
[INFO] Phoenix - Flume ................................... SKIPPED
[INFO] Phoenix - Pig ..................................... SKIPPED
[INFO] Phoenix Query Server Client ....................... SKIPPED
[INFO] Phoenix Query Server .............................. SKIPPED
[INFO] Phoenix - Pherf ................................... SKIPPED
[INFO] Phoenix - Spark ................................... SKIPPED
[INFO] Phoenix Assembly .................................. SKIPPED
[INFO] Phoenix - Tracing Web Application ................. SKIPPED
[INFO] ------------------------------------------------------------------------
[INFO] BUILD FAILURE
[INFO] ------------------------------------------------------------------------
[INFO] Total time: 48:32.896s
[INFO] Finished at: Fri Nov 13 07:14:05 UTC 2015
[INFO] Final Memory: 48M/1246M
[INFO] ------------------------------------------------------------------------
[ERROR] Failed to execute goal org.apache.maven.plugins:maven-failsafe-plugin:2.19:verify (ClientManagedTimeTests) on project phoenix-core: There are test failures.
[ERROR] 
[ERROR] Please refer to <https://builds.apache.org/job/Phoenix-4.x-HBase-1.0/ws/phoenix-core/target/failsafe-reports> for the individual test results.
[ERROR] -> [Help 1]
[ERROR] 
[ERROR] To see the full stack trace of the errors, re-run Maven with the -e switch.
[ERROR] Re-run Maven using the -X switch to enable full debug logging.
[ERROR] 
[ERROR] For more information about the errors and possible solutions, please read the following articles:
[ERROR] [Help 1] http://cwiki.apache.org/confluence/display/MAVEN/MojoFailureException
[ERROR] 
[ERROR] After correcting the problems, you can resume the build with the command
[ERROR]   mvn <goals> -rf :phoenix-core
Build step 'Invoke top-level Maven targets' marked build as failure
Archiving artifacts
Compressed 905.25 MB of artifacts by 39.1% relative to #214
Recording test results

Build failed in Jenkins: Phoenix-4.x-HBase-1.0 #218

Posted by Apache Jenkins Server <je...@builds.apache.org>.
See <https://builds.apache.org/job/Phoenix-4.x-HBase-1.0/218/changes>

Changes:

[jtaylor] PHOENIX-2410 Move NUM_MILLIS_IN_DAY constant to TestUtil

------------------------------------------
[...truncated 1183 lines...]
Running org.apache.phoenix.end2end.StoreNullsIT
Tests run: 1, Failures: 0, Errors: 0, Skipped: 0, Time elapsed: 17.265 sec - in org.apache.phoenix.end2end.HashJoinLocalIndexIT
Running org.apache.phoenix.end2end.ExpFunctionEnd2EndIT
Tests run: 3, Failures: 0, Errors: 0, Skipped: 0, Time elapsed: 9.968 sec - in org.apache.phoenix.end2end.ExpFunctionEnd2EndIT
Running org.apache.phoenix.end2end.GetSetByteBitFunctionEnd2EndIT
Tests run: 1, Failures: 0, Errors: 0, Skipped: 0, Time elapsed: 2.567 sec - in org.apache.phoenix.end2end.GetSetByteBitFunctionEnd2EndIT
Tests run: 3, Failures: 0, Errors: 0, Skipped: 0, Time elapsed: 21.553 sec - in org.apache.phoenix.end2end.StoreNullsIT
Running org.apache.phoenix.end2end.PowerFunctionEnd2EndIT
Running org.apache.phoenix.end2end.ArithmeticQueryIT
Tests run: 1, Failures: 0, Errors: 0, Skipped: 0, Time elapsed: 5.641 sec - in org.apache.phoenix.end2end.PowerFunctionEnd2EndIT
Running org.apache.phoenix.end2end.UpgradeIT
Tests run: 15, Failures: 0, Errors: 0, Skipped: 0, Time elapsed: 149.868 sec - in org.apache.phoenix.end2end.AlterTableWithViewsIT
Tests run: 26, Failures: 0, Errors: 0, Skipped: 0, Time elapsed: 35.964 sec - in org.apache.phoenix.end2end.ArithmeticQueryIT
Running org.apache.phoenix.end2end.LikeExpressionIT
Running org.apache.phoenix.end2end.DecodeFunctionIT
Tests run: 2, Failures: 0, Errors: 0, Skipped: 0, Time elapsed: 4.684 sec - in org.apache.phoenix.end2end.LikeExpressionIT
Running org.apache.phoenix.end2end.ExecuteStatementsIT
Tests run: 6, Failures: 0, Errors: 0, Skipped: 0, Time elapsed: 5.659 sec - in org.apache.phoenix.end2end.DecodeFunctionIT
Running org.apache.phoenix.end2end.ArraysWithNullsIT
Tests run: 2, Failures: 0, Errors: 0, Skipped: 0, Time elapsed: 16.341 sec - in org.apache.phoenix.end2end.ExecuteStatementsIT
Running org.apache.phoenix.end2end.SpooledTmpFileDeleteIT
Tests run: 1, Failures: 0, Errors: 0, Skipped: 0, Time elapsed: 3.289 sec - in org.apache.phoenix.end2end.SpooledTmpFileDeleteIT
Running org.apache.phoenix.end2end.ServerExceptionIT
Tests run: 6, Failures: 0, Errors: 0, Skipped: 0, Time elapsed: 55.857 sec - in org.apache.phoenix.end2end.UpgradeIT
Running org.apache.phoenix.end2end.ToDateFunctionIT
Tests run: 1, Failures: 0, Errors: 0, Skipped: 0, Time elapsed: 2.621 sec - in org.apache.phoenix.end2end.ServerExceptionIT
Running org.apache.phoenix.end2end.CSVCommonsLoaderIT
Tests run: 11, Failures: 0, Errors: 0, Skipped: 0, Time elapsed: 7.712 sec - in org.apache.phoenix.end2end.ToDateFunctionIT
Running org.apache.phoenix.end2end.CbrtFunctionEnd2EndIT
Tests run: 2, Failures: 0, Errors: 0, Skipped: 0, Time elapsed: 6.975 sec - in org.apache.phoenix.end2end.CbrtFunctionEnd2EndIT
Running org.apache.phoenix.end2end.AlterSessionIT
Tests run: 16, Failures: 0, Errors: 0, Skipped: 0, Time elapsed: 17.366 sec - in org.apache.phoenix.end2end.CSVCommonsLoaderIT
Running org.apache.phoenix.end2end.MappingTableDataTypeIT
Tests run: 2, Failures: 0, Errors: 0, Skipped: 0, Time elapsed: 3.79 sec - in org.apache.phoenix.end2end.AlterSessionIT
Tests run: 16, Failures: 0, Errors: 0, Skipped: 0, Time elapsed: 40.289 sec - in org.apache.phoenix.end2end.ArraysWithNullsIT
Running org.apache.phoenix.end2end.TenantSpecificViewIndexIT
Running org.apache.phoenix.end2end.AbsFunctionEnd2EndIT
Tests run: 1, Failures: 0, Errors: 0, Skipped: 0, Time elapsed: 2.722 sec - in org.apache.phoenix.end2end.AbsFunctionEnd2EndIT
Running org.apache.phoenix.end2end.InListIT
Tests run: 1, Failures: 0, Errors: 0, Skipped: 0, Time elapsed: 8.382 sec - in org.apache.phoenix.end2end.MappingTableDataTypeIT
Running org.apache.phoenix.end2end.StatementHintsIT
Tests run: 2, Failures: 0, Errors: 0, Skipped: 0, Time elapsed: 2.892 sec - in org.apache.phoenix.end2end.StatementHintsIT
Running org.apache.phoenix.end2end.TenantSpecificViewIndexSaltedIT
Tests run: 111, Failures: 0, Errors: 0, Skipped: 0, Time elapsed: 178.379 sec - in org.apache.phoenix.end2end.HashJoinIT
Running org.apache.phoenix.end2end.TimezoneOffsetFunctionIT
Tests run: 7, Failures: 0, Errors: 0, Skipped: 0, Time elapsed: 5.946 sec - in org.apache.phoenix.end2end.TimezoneOffsetFunctionIT
Running org.apache.phoenix.end2end.QueryExecWithoutSCNIT
Tests run: 4, Failures: 0, Errors: 0, Skipped: 0, Time elapsed: 9.725 sec - in org.apache.phoenix.end2end.TenantSpecificViewIndexSaltedIT
Running org.apache.phoenix.end2end.LpadFunctionIT
Tests run: 8, Failures: 0, Errors: 0, Skipped: 0, Time elapsed: 20.367 sec - in org.apache.phoenix.end2end.TenantSpecificViewIndexIT
Running org.apache.phoenix.end2end.SortOrderIT
Tests run: 1, Failures: 0, Errors: 0, Skipped: 0, Time elapsed: 3.213 sec - in org.apache.phoenix.end2end.QueryExecWithoutSCNIT
Running org.apache.phoenix.end2end.CoalesceFunctionIT
Tests run: 10, Failures: 0, Errors: 0, Skipped: 0, Time elapsed: 9.678 sec - in org.apache.phoenix.end2end.CoalesceFunctionIT
Running org.apache.phoenix.end2end.RegexpReplaceFunctionIT
Tests run: 12, Failures: 0, Errors: 0, Skipped: 0, Time elapsed: 13.366 sec - in org.apache.phoenix.end2end.LpadFunctionIT
Running org.apache.phoenix.end2end.EvaluationOfORIT
Tests run: 2, Failures: 0, Errors: 0, Skipped: 0, Time elapsed: 2.864 sec - in org.apache.phoenix.end2end.RegexpReplaceFunctionIT
Running org.apache.phoenix.end2end.LastValueFunctionIT
Tests run: 2, Failures: 0, Errors: 0, Skipped: 0, Time elapsed: 3.064 sec - in org.apache.phoenix.end2end.EvaluationOfORIT
Running org.apache.phoenix.end2end.SkipScanAfterManualSplitIT
Tests run: 11, Failures: 0, Errors: 0, Skipped: 0, Time elapsed: 6.958 sec - in org.apache.phoenix.end2end.LastValueFunctionIT
Running org.apache.phoenix.end2end.salted.SaltedTableVarLengthRowKeyIT
Tests run: 1, Failures: 0, Errors: 0, Skipped: 0, Time elapsed: 3.102 sec - in org.apache.phoenix.end2end.salted.SaltedTableVarLengthRowKeyIT
Running org.apache.phoenix.end2end.salted.SaltedTableUpsertSelectIT
Tests run: 5, Failures: 0, Errors: 0, Skipped: 0, Time elapsed: 10.1 sec - in org.apache.phoenix.end2end.salted.SaltedTableUpsertSelectIT
Running org.apache.phoenix.end2end.DynamicFamilyIT
Tests run: 4, Failures: 0, Errors: 0, Skipped: 0, Time elapsed: 6.119 sec - in org.apache.phoenix.end2end.DynamicFamilyIT
Running org.apache.phoenix.end2end.MinMaxAggregateFunctionIT
Tests run: 1, Failures: 0, Errors: 0, Skipped: 0, Time elapsed: 2.14 sec - in org.apache.phoenix.end2end.MinMaxAggregateFunctionIT
Running org.apache.phoenix.end2end.ArrayToStringFunctionIT
Tests run: 3, Failures: 0, Errors: 0, Skipped: 0, Time elapsed: 31.416 sec - in org.apache.phoenix.end2end.SkipScanAfterManualSplitIT
Running org.apache.phoenix.end2end.SubqueryIT
Tests run: 36, Failures: 0, Errors: 0, Skipped: 0, Time elapsed: 17.357 sec - in org.apache.phoenix.end2end.ArrayToStringFunctionIT
Running org.apache.phoenix.end2end.ArrayAppendFunctionIT
Tests run: 45, Failures: 0, Errors: 0, Skipped: 0, Time elapsed: 74.499 sec - in org.apache.phoenix.end2end.SortOrderIT
Running org.apache.phoenix.end2end.ReverseScanIT
Tests run: 34, Failures: 0, Errors: 0, Skipped: 0, Time elapsed: 15.008 sec - in org.apache.phoenix.end2end.ArrayAppendFunctionIT
Running org.apache.phoenix.end2end.RTrimFunctionIT
Tests run: 108, Failures: 0, Errors: 0, Skipped: 0, Time elapsed: 272.518 sec - in org.apache.phoenix.end2end.SpooledSortMergeJoinIT
Running org.apache.phoenix.end2end.SortMergeJoinIT
Tests run: 2, Failures: 0, Errors: 0, Skipped: 0, Time elapsed: 2.599 sec - in org.apache.phoenix.end2end.RTrimFunctionIT
Running org.apache.phoenix.end2end.SignFunctionEnd2EndIT
Tests run: 3, Failures: 0, Errors: 0, Skipped: 0, Time elapsed: 6.875 sec - in org.apache.phoenix.end2end.ReverseScanIT
Running org.apache.phoenix.end2end.QueryMoreIT
Tests run: 2, Failures: 0, Errors: 0, Skipped: 0, Time elapsed: 4.758 sec - in org.apache.phoenix.end2end.SignFunctionEnd2EndIT
Running org.apache.phoenix.end2end.TenantIdTypeIT
Tests run: 21, Failures: 0, Errors: 0, Skipped: 0, Time elapsed: 49.202 sec - in org.apache.phoenix.end2end.SubqueryIT
Running org.apache.phoenix.end2end.ArrayConcatFunctionIT
Tests run: 5, Failures: 0, Errors: 0, Skipped: 0, Time elapsed: 22.465 sec - in org.apache.phoenix.end2end.QueryMoreIT
Running org.apache.phoenix.end2end.ConvertTimezoneFunctionIT
Tests run: 30, Failures: 0, Errors: 0, Skipped: 0, Time elapsed: 11.422 sec - in org.apache.phoenix.end2end.ArrayConcatFunctionIT
Running org.apache.phoenix.end2end.LnLogFunctionEnd2EndIT
Tests run: 1, Failures: 0, Errors: 0, Skipped: 0, Time elapsed: 4.187 sec - in org.apache.phoenix.end2end.LnLogFunctionEnd2EndIT
Tests run: 7, Failures: 0, Errors: 0, Skipped: 0, Time elapsed: 6.5 sec - in org.apache.phoenix.end2end.ConvertTimezoneFunctionIT
Running org.apache.phoenix.trace.PhoenixTraceReaderIT
Tests run: 2, Failures: 0, Errors: 0, Skipped: 0, Time elapsed: 0.922 sec - in org.apache.phoenix.trace.PhoenixTraceReaderIT
Running org.apache.phoenix.trace.PhoenixTracingEndToEndIT
Running org.apache.phoenix.trace.PhoenixTableMetricsWriterIT
Tests run: 2, Failures: 0, Errors: 0, Skipped: 0, Time elapsed: 0.448 sec - in org.apache.phoenix.trace.PhoenixTableMetricsWriterIT
Running org.apache.phoenix.rpc.UpdateCacheIT
Tests run: 1, Failures: 0, Errors: 0, Skipped: 0, Time elapsed: 2.67 sec - in org.apache.phoenix.rpc.UpdateCacheIT
Tests run: 28, Failures: 0, Errors: 0, Skipped: 0, Time elapsed: 160.645 sec - in org.apache.phoenix.end2end.InListIT
Tests run: 15, Failures: 0, Errors: 0, Skipped: 0, Time elapsed: 70.097 sec - in org.apache.phoenix.end2end.TenantIdTypeIT
Tests run: 6, Failures: 0, Errors: 0, Skipped: 0, Time elapsed: 91.186 sec - in org.apache.phoenix.trace.PhoenixTracingEndToEndIT
Tests run: 108, Failures: 0, Errors: 0, Skipped: 0, Time elapsed: 158.448 sec - in org.apache.phoenix.end2end.SortMergeJoinIT

Results :

Tests run: 1179, Failures: 0, Errors: 0, Skipped: 0

[INFO] 
[INFO] --- maven-failsafe-plugin:2.19:integration-test (NeedTheirOwnClusterTests) @ phoenix-core ---

-------------------------------------------------------
 T E S T S
-------------------------------------------------------
Running org.apache.phoenix.end2end.ConnectionUtilIT
Running org.apache.phoenix.end2end.ViewIT
Running org.apache.phoenix.end2end.TenantSpecificTablesDMLIT
Running org.apache.phoenix.iterate.RoundRobinResultIteratorWithStatsIT
Running org.apache.phoenix.execute.PartialCommitIT
Tests run: 1, Failures: 0, Errors: 0, Skipped: 0, Time elapsed: 18.517 sec - in org.apache.phoenix.end2end.ConnectionUtilIT
Running org.apache.phoenix.end2end.index.MutableIndexFailureIT
Tests run: 1, Failures: 0, Errors: 0, Skipped: 0, Time elapsed: 13.993 sec - in org.apache.phoenix.iterate.RoundRobinResultIteratorWithStatsIT
Tests run: 6, Failures: 0, Errors: 0, Skipped: 0, Time elapsed: 10.119 sec - in org.apache.phoenix.execute.PartialCommitIT
Running org.apache.phoenix.end2end.index.ImmutableIndexWithStatsIT
Tests run: 3, Failures: 0, Errors: 0, Skipped: 2, Time elapsed: 35.212 sec - in org.apache.phoenix.end2end.index.MutableIndexFailureIT
Tests run: 1, Failures: 0, Errors: 0, Skipped: 0, Time elapsed: 7.998 sec - in org.apache.phoenix.end2end.index.ImmutableIndexWithStatsIT
Tests run: 16, Failures: 0, Errors: 0, Skipped: 0, Time elapsed: 44.77 sec - in org.apache.phoenix.end2end.TenantSpecificTablesDMLIT
Tests run: 22, Failures: 0, Errors: 0, Skipped: 0, Time elapsed: 55.911 sec - in org.apache.phoenix.end2end.ViewIT
Running org.apache.phoenix.end2end.QueryWithLimitIT
Running org.apache.phoenix.end2end.QueryTimeoutIT
Running org.apache.phoenix.end2end.StatsCollectorIT
Tests run: 2, Failures: 0, Errors: 0, Skipped: 0, Time elapsed: 11.626 sec - in org.apache.phoenix.end2end.QueryWithLimitIT
Running org.apache.phoenix.end2end.KeyOnlyIT
Tests run: 1, Failures: 0, Errors: 0, Skipped: 0, Time elapsed: 16.452 sec - in org.apache.phoenix.end2end.QueryTimeoutIT
Tests run: 3, Failures: 0, Errors: 0, Skipped: 0, Time elapsed: 18.644 sec - in org.apache.phoenix.end2end.KeyOnlyIT
Running org.apache.phoenix.end2end.ContextClassloaderIT
Tests run: 3, Failures: 0, Errors: 0, Skipped: 0, Time elapsed: 6.07 sec - in org.apache.phoenix.end2end.ContextClassloaderIT
Running org.apache.phoenix.end2end.UnionAllIT
Running org.apache.phoenix.end2end.MultiCfQueryExecIT
Running org.apache.phoenix.end2end.UserDefinedFunctionsIT
Tests run: 4, Failures: 0, Errors: 0, Skipped: 0, Time elapsed: 57.417 sec - in org.apache.phoenix.end2end.StatsCollectorIT
Tests run: 12, Failures: 0, Errors: 0, Skipped: 0, Time elapsed: 27.552 sec - in org.apache.phoenix.end2end.UnionAllIT
Tests run: 7, Failures: 0, Errors: 0, Skipped: 0, Time elapsed: 17.394 sec - in org.apache.phoenix.end2end.MultiCfQueryExecIT
Tests run: 13, Failures: 0, Errors: 0, Skipped: 0, Time elapsed: 17.879 sec - in org.apache.phoenix.end2end.UserDefinedFunctionsIT
Running org.apache.phoenix.end2end.SaltedViewIT
Running org.apache.phoenix.end2end.AlterTableIT
Running org.apache.phoenix.end2end.TenantSpecificTablesDDLIT
Running org.apache.phoenix.end2end.CountDistinctCompressionIT
Tests run: 2, Failures: 0, Errors: 0, Skipped: 0, Time elapsed: 16.949 sec - in org.apache.phoenix.end2end.SaltedViewIT
Tests run: 1, Failures: 0, Errors: 0, Skipped: 0, Time elapsed: 6.794 sec - in org.apache.phoenix.end2end.CountDistinctCompressionIT
Running org.apache.phoenix.end2end.SpillableGroupByIT
Running org.apache.phoenix.end2end.StatsCollectorWithSplitsAndMultiCFIT
Tests run: 17, Failures: 0, Errors: 0, Skipped: 0, Time elapsed: 37.659 sec - in org.apache.phoenix.end2end.TenantSpecificTablesDDLIT
Tests run: 1, Failures: 0, Errors: 0, Skipped: 0, Time elapsed: 7.53 sec - in org.apache.phoenix.end2end.SpillableGroupByIT
Running org.apache.phoenix.end2end.ParallelIteratorsIT
Running org.apache.phoenix.mapreduce.IndexToolIT
Tests run: 2, Failures: 0, Errors: 0, Skipped: 0, Time elapsed: 27.25 sec - in org.apache.phoenix.end2end.StatsCollectorWithSplitsAndMultiCFIT
Tests run: 3, Failures: 0, Errors: 0, Skipped: 0, Time elapsed: 18.538 sec - in org.apache.phoenix.end2end.ParallelIteratorsIT
Running org.apache.phoenix.monitoring.PhoenixMetricsIT
Running org.apache.phoenix.mapreduce.CsvBulkLoadToolIT
Tests run: 17, Failures: 2, Errors: 0, Skipped: 0, Time elapsed: 42.661 sec <<< FAILURE! - in org.apache.phoenix.monitoring.PhoenixMetricsIT
testMetricsForUpsertSelectWithAutoCommit(org.apache.phoenix.monitoring.PhoenixMetricsIT)  Time elapsed: 4.094 sec  <<< FAILURE!
java.lang.AssertionError: Unequal values for metric MUTATION_BYTES expected:<5600> but was:<16240>
	at org.apache.phoenix.monitoring.PhoenixMetricsIT.assertMetricsHaveSameValues(PhoenixMetricsIT.java:654)
	at org.apache.phoenix.monitoring.PhoenixMetricsIT.assertMetricsAreSame(PhoenixMetricsIT.java:643)
	at org.apache.phoenix.monitoring.PhoenixMetricsIT.testMetricsForUpsertSelectWithAutoCommit(PhoenixMetricsIT.java:462)

testMetricsForUpsertSelectSameTable(org.apache.phoenix.monitoring.PhoenixMetricsIT)  Time elapsed: 1.766 sec  <<< FAILURE!
java.lang.AssertionError: Unequal values for metric MUTATION_BYTES expected:<5600> but was:<16240>
	at org.apache.phoenix.monitoring.PhoenixMetricsIT.assertMetricsHaveSameValues(PhoenixMetricsIT.java:654)
	at org.apache.phoenix.monitoring.PhoenixMetricsIT.assertMetricsAreSame(PhoenixMetricsIT.java:643)
	at org.apache.phoenix.monitoring.PhoenixMetricsIT.testMetricsForUpsertSelectSameTable(PhoenixMetricsIT.java:615)

Running org.apache.phoenix.hbase.index.FailForUnsupportedHBaseVersionsIT
Tests run: 2, Failures: 0, Errors: 0, Skipped: 0, Time elapsed: 17.516 sec - in org.apache.phoenix.hbase.index.FailForUnsupportedHBaseVersionsIT
Running org.apache.phoenix.hbase.index.covered.example.EndToEndCoveredIndexingIT
Tests run: 11, Failures: 0, Errors: 0, Skipped: 0, Time elapsed: 48.704 sec - in org.apache.phoenix.hbase.index.covered.example.EndToEndCoveredIndexingIT
Tests run: 5, Failures: 0, Errors: 0, Skipped: 0, Time elapsed: 164.718 sec - in org.apache.phoenix.mapreduce.CsvBulkLoadToolIT
Running org.apache.phoenix.hbase.index.covered.example.FailWithoutRetriesIT
Tests run: 1, Failures: 0, Errors: 0, Skipped: 0, Time elapsed: 9.893 sec - in org.apache.phoenix.hbase.index.covered.example.FailWithoutRetriesIT
Running org.apache.phoenix.hbase.index.covered.EndToEndCoveredColumnsIndexBuilderIT
Tests run: 2, Failures: 0, Errors: 0, Skipped: 0, Time elapsed: 9.828 sec - in org.apache.phoenix.hbase.index.covered.EndToEndCoveredColumnsIndexBuilderIT
Running org.apache.phoenix.hbase.index.balancer.IndexLoadBalancerIT
Tests run: 55, Failures: 0, Errors: 0, Skipped: 0, Time elapsed: 347.981 sec - in org.apache.phoenix.end2end.AlterTableIT
Running org.apache.phoenix.rpc.PhoenixClientRpcIT
Tests run: 2, Failures: 0, Errors: 0, Skipped: 0, Time elapsed: 9.876 sec - in org.apache.phoenix.rpc.PhoenixClientRpcIT
Running org.apache.phoenix.rpc.PhoenixServerRpcIT
Tests run: 2, Failures: 0, Errors: 0, Skipped: 0, Time elapsed: 11.317 sec - in org.apache.phoenix.rpc.PhoenixServerRpcIT
Running org.apache.hadoop.hbase.regionserver.wal.WALReplayWithIndexWritesAndCompressedWALIT
Tests run: 9, Failures: 0, Errors: 0, Skipped: 0, Time elapsed: 343.136 sec - in org.apache.phoenix.mapreduce.IndexToolIT
Running org.apache.hadoop.hbase.regionserver.wal.WALReplayWithIndexWritesAndUncompressedWALInHBase_094_9_IT
Tests run: 1, Failures: 0, Errors: 0, Skipped: 0, Time elapsed: 17.346 sec - in org.apache.hadoop.hbase.regionserver.wal.WALReplayWithIndexWritesAndCompressedWALIT
Tests run: 9, Failures: 0, Errors: 0, Skipped: 0, Time elapsed: 103.043 sec - in org.apache.phoenix.hbase.index.balancer.IndexLoadBalancerIT
Tests run: 1, Failures: 0, Errors: 0, Skipped: 0, Time elapsed: 16.818 sec - in org.apache.hadoop.hbase.regionserver.wal.WALReplayWithIndexWritesAndUncompressedWALInHBase_094_9_IT
Running org.apache.phoenix.end2end.index.MutableIndexReplicationIT
Tests run: 1, Failures: 0, Errors: 0, Skipped: 0, Time elapsed: 17.917 sec - in org.apache.phoenix.end2end.index.MutableIndexReplicationIT
Running org.apache.phoenix.hbase.index.covered.example.EndtoEndIndexingWithCompressionIT
Tests run: 11, Failures: 0, Errors: 0, Skipped: 0, Time elapsed: 53.036 sec - in org.apache.phoenix.hbase.index.covered.example.EndtoEndIndexingWithCompressionIT

Results :

Failed tests: 
  PhoenixMetricsIT.testMetricsForUpsertSelectSameTable:615->assertMetricsAreSame:643->assertMetricsHaveSameValues:654 Unequal values for metric MUTATION_BYTES expected:<5600> but was:<16240>
  PhoenixMetricsIT.testMetricsForUpsertSelectWithAutoCommit:462->assertMetricsAreSame:643->assertMetricsHaveSameValues:654 Unequal values for metric MUTATION_BYTES expected:<5600> but was:<16240>

Tests run: 250, Failures: 2, Errors: 0, Skipped: 2

[INFO] 
[INFO] --- maven-failsafe-plugin:2.19:verify (ClientManagedTimeTests) @ phoenix-core ---
[INFO] ------------------------------------------------------------------------
[INFO] Reactor Summary:
[INFO] 
[INFO] Apache Phoenix .................................... SUCCESS [2.760s]
[INFO] Phoenix Core ...................................... FAILURE [46:21.495s]
[INFO] Phoenix - Flume ................................... SKIPPED
[INFO] Phoenix - Pig ..................................... SKIPPED
[INFO] Phoenix Query Server Client ....................... SKIPPED
[INFO] Phoenix Query Server .............................. SKIPPED
[INFO] Phoenix - Pherf ................................... SKIPPED
[INFO] Phoenix - Spark ................................... SKIPPED
[INFO] Phoenix Assembly .................................. SKIPPED
[INFO] Phoenix - Tracing Web Application ................. SKIPPED
[INFO] ------------------------------------------------------------------------
[INFO] BUILD FAILURE
[INFO] ------------------------------------------------------------------------
[INFO] Total time: 46:24.778s
[INFO] Finished at: Fri Nov 13 02:33:03 UTC 2015
[INFO] Final Memory: 61M/1283M
[INFO] ------------------------------------------------------------------------
[ERROR] Failed to execute goal org.apache.maven.plugins:maven-failsafe-plugin:2.19:verify (ClientManagedTimeTests) on project phoenix-core: There are test failures.
[ERROR] 
[ERROR] Please refer to <https://builds.apache.org/job/Phoenix-4.x-HBase-1.0/ws/phoenix-core/target/failsafe-reports> for the individual test results.
[ERROR] -> [Help 1]
[ERROR] 
[ERROR] To see the full stack trace of the errors, re-run Maven with the -e switch.
[ERROR] Re-run Maven using the -X switch to enable full debug logging.
[ERROR] 
[ERROR] For more information about the errors and possible solutions, please read the following articles:
[ERROR] [Help 1] http://cwiki.apache.org/confluence/display/MAVEN/MojoFailureException
[ERROR] 
[ERROR] After correcting the problems, you can resume the build with the command
[ERROR]   mvn <goals> -rf :phoenix-core
Build step 'Invoke top-level Maven targets' marked build as failure
Archiving artifacts
Compressed 1013.44 MB of artifacts by 44.3% relative to #214
Recording test results

Build failed in Jenkins: Phoenix-4.x-HBase-1.0 #217

Posted by Apache Jenkins Server <je...@builds.apache.org>.
See <https://builds.apache.org/job/Phoenix-4.x-HBase-1.0/217/changes>

Changes:

[jtaylor] PHOENIX-2409 Create getTable() convenience method on PhoenixConnection

------------------------------------------
[...truncated 6681 lines...]
Running org.apache.phoenix.end2end.StoreNullsIT
Tests run: 1, Failures: 0, Errors: 0, Skipped: 0, Time elapsed: 14.788 sec - in org.apache.phoenix.end2end.HashJoinLocalIndexIT
Running org.apache.phoenix.end2end.ExpFunctionEnd2EndIT
Tests run: 3, Failures: 0, Errors: 0, Skipped: 0, Time elapsed: 7.528 sec - in org.apache.phoenix.end2end.ExpFunctionEnd2EndIT
Running org.apache.phoenix.end2end.GetSetByteBitFunctionEnd2EndIT
Tests run: 1, Failures: 0, Errors: 0, Skipped: 0, Time elapsed: 2.473 sec - in org.apache.phoenix.end2end.GetSetByteBitFunctionEnd2EndIT
Running org.apache.phoenix.end2end.PowerFunctionEnd2EndIT
Tests run: 3, Failures: 0, Errors: 0, Skipped: 0, Time elapsed: 22.4 sec - in org.apache.phoenix.end2end.StoreNullsIT
Running org.apache.phoenix.end2end.ArithmeticQueryIT
Tests run: 1, Failures: 0, Errors: 0, Skipped: 0, Time elapsed: 5.325 sec - in org.apache.phoenix.end2end.PowerFunctionEnd2EndIT
Running org.apache.phoenix.end2end.UpgradeIT
Tests run: 26, Failures: 0, Errors: 0, Skipped: 0, Time elapsed: 34.458 sec - in org.apache.phoenix.end2end.ArithmeticQueryIT
Running org.apache.phoenix.end2end.LikeExpressionIT
Tests run: 6, Failures: 0, Errors: 0, Skipped: 0, Time elapsed: 37.461 sec - in org.apache.phoenix.end2end.UpgradeIT
Running org.apache.phoenix.end2end.DecodeFunctionIT
Tests run: 2, Failures: 0, Errors: 0, Skipped: 0, Time elapsed: 5.672 sec - in org.apache.phoenix.end2end.LikeExpressionIT
Running org.apache.phoenix.end2end.ExecuteStatementsIT
Tests run: 6, Failures: 0, Errors: 0, Skipped: 0, Time elapsed: 3.405 sec - in org.apache.phoenix.end2end.DecodeFunctionIT
Running org.apache.phoenix.end2end.ArraysWithNullsIT
Tests run: 15, Failures: 0, Errors: 0, Skipped: 0, Time elapsed: 153.469 sec - in org.apache.phoenix.end2end.AlterTableWithViewsIT
Running org.apache.phoenix.end2end.SpooledTmpFileDeleteIT
Tests run: 1, Failures: 0, Errors: 0, Skipped: 0, Time elapsed: 2.919 sec - in org.apache.phoenix.end2end.SpooledTmpFileDeleteIT
Running org.apache.phoenix.end2end.ServerExceptionIT
Tests run: 1, Failures: 0, Errors: 0, Skipped: 0, Time elapsed: 2.624 sec - in org.apache.phoenix.end2end.ServerExceptionIT
Running org.apache.phoenix.end2end.ToDateFunctionIT
Tests run: 2, Failures: 0, Errors: 0, Skipped: 0, Time elapsed: 18.245 sec - in org.apache.phoenix.end2end.ExecuteStatementsIT
Running org.apache.phoenix.end2end.CSVCommonsLoaderIT
Tests run: 11, Failures: 0, Errors: 0, Skipped: 0, Time elapsed: 6.924 sec - in org.apache.phoenix.end2end.ToDateFunctionIT
Running org.apache.phoenix.end2end.CbrtFunctionEnd2EndIT
Tests run: 2, Failures: 0, Errors: 0, Skipped: 0, Time elapsed: 5.256 sec - in org.apache.phoenix.end2end.CbrtFunctionEnd2EndIT
Running org.apache.phoenix.end2end.AlterSessionIT
Tests run: 2, Failures: 0, Errors: 0, Skipped: 0, Time elapsed: 2.79 sec - in org.apache.phoenix.end2end.AlterSessionIT
Running org.apache.phoenix.end2end.MappingTableDataTypeIT
Tests run: 16, Failures: 0, Errors: 0, Skipped: 0, Time elapsed: 36.091 sec - in org.apache.phoenix.end2end.ArraysWithNullsIT
Running org.apache.phoenix.end2end.TenantSpecificViewIndexIT
Tests run: 1, Failures: 0, Errors: 0, Skipped: 0, Time elapsed: 8.93 sec - in org.apache.phoenix.end2end.MappingTableDataTypeIT
Running org.apache.phoenix.end2end.AbsFunctionEnd2EndIT
Tests run: 1, Failures: 0, Errors: 0, Skipped: 0, Time elapsed: 2.242 sec - in org.apache.phoenix.end2end.AbsFunctionEnd2EndIT
Running org.apache.phoenix.end2end.InListIT
Tests run: 16, Failures: 0, Errors: 0, Skipped: 0, Time elapsed: 24.42 sec - in org.apache.phoenix.end2end.CSVCommonsLoaderIT
Running org.apache.phoenix.end2end.StatementHintsIT
Tests run: 2, Failures: 0, Errors: 0, Skipped: 0, Time elapsed: 3.715 sec - in org.apache.phoenix.end2end.StatementHintsIT
Running org.apache.phoenix.end2end.TenantSpecificViewIndexSaltedIT
Tests run: 8, Failures: 0, Errors: 0, Skipped: 0, Time elapsed: 16.283 sec - in org.apache.phoenix.end2end.TenantSpecificViewIndexIT
Running org.apache.phoenix.end2end.TimezoneOffsetFunctionIT
Tests run: 7, Failures: 0, Errors: 0, Skipped: 0, Time elapsed: 5.489 sec - in org.apache.phoenix.end2end.TimezoneOffsetFunctionIT
Running org.apache.phoenix.end2end.QueryExecWithoutSCNIT
Tests run: 4, Failures: 0, Errors: 0, Skipped: 0, Time elapsed: 12.375 sec - in org.apache.phoenix.end2end.TenantSpecificViewIndexSaltedIT
Running org.apache.phoenix.end2end.LpadFunctionIT
Tests run: 1, Failures: 0, Errors: 0, Skipped: 0, Time elapsed: 3.127 sec - in org.apache.phoenix.end2end.QueryExecWithoutSCNIT
Running org.apache.phoenix.end2end.SortOrderIT
Tests run: 12, Failures: 0, Errors: 0, Skipped: 0, Time elapsed: 22.257 sec - in org.apache.phoenix.end2end.LpadFunctionIT
Running org.apache.phoenix.end2end.CoalesceFunctionIT
Tests run: 10, Failures: 0, Errors: 0, Skipped: 0, Time elapsed: 13.394 sec - in org.apache.phoenix.end2end.CoalesceFunctionIT
Running org.apache.phoenix.end2end.RegexpReplaceFunctionIT
Tests run: 2, Failures: 0, Errors: 0, Skipped: 0, Time elapsed: 3.618 sec - in org.apache.phoenix.end2end.RegexpReplaceFunctionIT
Running org.apache.phoenix.end2end.EvaluationOfORIT
Tests run: 2, Failures: 0, Errors: 0, Skipped: 0, Time elapsed: 2.783 sec - in org.apache.phoenix.end2end.EvaluationOfORIT
Running org.apache.phoenix.end2end.LastValueFunctionIT
Tests run: 45, Failures: 0, Errors: 0, Skipped: 0, Time elapsed: 43.288 sec - in org.apache.phoenix.end2end.SortOrderIT
Running org.apache.phoenix.end2end.SkipScanAfterManualSplitIT
Tests run: 28, Failures: 0, Errors: 0, Skipped: 0, Time elapsed: 70.945 sec - in org.apache.phoenix.end2end.InListIT
Running org.apache.phoenix.end2end.salted.SaltedTableVarLengthRowKeyIT
Tests run: 1, Failures: 0, Errors: 0, Skipped: 0, Time elapsed: 2.973 sec - in org.apache.phoenix.end2end.salted.SaltedTableVarLengthRowKeyIT
Running org.apache.phoenix.end2end.salted.SaltedTableUpsertSelectIT
Tests run: 11, Failures: 0, Errors: 0, Skipped: 0, Time elapsed: 12.06 sec - in org.apache.phoenix.end2end.LastValueFunctionIT
Running org.apache.phoenix.end2end.DynamicFamilyIT
Tests run: 5, Failures: 0, Errors: 0, Skipped: 0, Time elapsed: 9.64 sec - in org.apache.phoenix.end2end.salted.SaltedTableUpsertSelectIT
Running org.apache.phoenix.end2end.MinMaxAggregateFunctionIT
Tests run: 4, Failures: 0, Errors: 0, Skipped: 0, Time elapsed: 7.856 sec - in org.apache.phoenix.end2end.DynamicFamilyIT
Running org.apache.phoenix.end2end.ArrayToStringFunctionIT
Tests run: 1, Failures: 0, Errors: 0, Skipped: 0, Time elapsed: 2.143 sec - in org.apache.phoenix.end2end.MinMaxAggregateFunctionIT
Running org.apache.phoenix.end2end.SubqueryIT
Tests run: 108, Failures: 0, Errors: 0, Skipped: 0, Time elapsed: 253.092 sec - in org.apache.phoenix.end2end.SpooledSortMergeJoinIT
Running org.apache.phoenix.end2end.ArrayAppendFunctionIT
Tests run: 3, Failures: 0, Errors: 0, Skipped: 0, Time elapsed: 32.155 sec - in org.apache.phoenix.end2end.SkipScanAfterManualSplitIT
Running org.apache.phoenix.end2end.ReverseScanIT
Tests run: 3, Failures: 0, Errors: 0, Skipped: 0, Time elapsed: 5.407 sec - in org.apache.phoenix.end2end.ReverseScanIT
Running org.apache.phoenix.end2end.RTrimFunctionIT
Tests run: 2, Failures: 0, Errors: 0, Skipped: 0, Time elapsed: 2.208 sec - in org.apache.phoenix.end2end.RTrimFunctionIT
Running org.apache.phoenix.end2end.SortMergeJoinIT
Tests run: 34, Failures: 0, Errors: 0, Skipped: 0, Time elapsed: 14.724 sec - in org.apache.phoenix.end2end.ArrayAppendFunctionIT
Running org.apache.phoenix.end2end.SignFunctionEnd2EndIT
Tests run: 2, Failures: 0, Errors: 0, Skipped: 0, Time elapsed: 5.331 sec - in org.apache.phoenix.end2end.SignFunctionEnd2EndIT
Running org.apache.phoenix.end2end.QueryMoreIT
Tests run: 36, Failures: 0, Errors: 0, Skipped: 0, Time elapsed: 29.45 sec - in org.apache.phoenix.end2end.ArrayToStringFunctionIT
Running org.apache.phoenix.end2end.TenantIdTypeIT
Tests run: 5, Failures: 0, Errors: 0, Skipped: 0, Time elapsed: 15.957 sec - in org.apache.phoenix.end2end.QueryMoreIT
Running org.apache.phoenix.end2end.ArrayConcatFunctionIT
Tests run: 21, Failures: 0, Errors: 0, Skipped: 0, Time elapsed: 52.243 sec - in org.apache.phoenix.end2end.SubqueryIT
Running org.apache.phoenix.end2end.ConvertTimezoneFunctionIT
Tests run: 30, Failures: 0, Errors: 0, Skipped: 0, Time elapsed: 14.543 sec - in org.apache.phoenix.end2end.ArrayConcatFunctionIT
Running org.apache.phoenix.end2end.LnLogFunctionEnd2EndIT
Tests run: 7, Failures: 0, Errors: 0, Skipped: 0, Time elapsed: 4.784 sec - in org.apache.phoenix.end2end.ConvertTimezoneFunctionIT
Running org.apache.phoenix.trace.PhoenixTraceReaderIT
Tests run: 2, Failures: 0, Errors: 0, Skipped: 0, Time elapsed: 1 sec - in org.apache.phoenix.trace.PhoenixTraceReaderIT
Running org.apache.phoenix.trace.PhoenixTracingEndToEndIT
Tests run: 1, Failures: 0, Errors: 0, Skipped: 0, Time elapsed: 4.859 sec - in org.apache.phoenix.end2end.LnLogFunctionEnd2EndIT
Running org.apache.phoenix.trace.PhoenixTableMetricsWriterIT
Tests run: 2, Failures: 0, Errors: 0, Skipped: 0, Time elapsed: 0.673 sec - in org.apache.phoenix.trace.PhoenixTableMetricsWriterIT
Running org.apache.phoenix.rpc.UpdateCacheIT
Tests run: 1, Failures: 0, Errors: 0, Skipped: 0, Time elapsed: 2.805 sec - in org.apache.phoenix.rpc.UpdateCacheIT
Tests run: 15, Failures: 0, Errors: 0, Skipped: 0, Time elapsed: 76.267 sec - in org.apache.phoenix.end2end.TenantIdTypeIT
Tests run: 6, Failures: 0, Errors: 0, Skipped: 0, Time elapsed: 83.727 sec - in org.apache.phoenix.trace.PhoenixTracingEndToEndIT
Tests run: 111, Failures: 0, Errors: 0, Skipped: 0, Time elapsed: 395.667 sec - in org.apache.phoenix.end2end.HashJoinIT
Tests run: 108, Failures: 0, Errors: 0, Skipped: 0, Time elapsed: 156.106 sec - in org.apache.phoenix.end2end.SortMergeJoinIT

Results :

Tests run: 1179, Failures: 0, Errors: 0, Skipped: 0

[INFO] 
[INFO] --- maven-failsafe-plugin:2.19:integration-test (NeedTheirOwnClusterTests) @ phoenix-core ---

-------------------------------------------------------
 T E S T S
-------------------------------------------------------
Running org.apache.phoenix.end2end.ConnectionUtilIT
Running org.apache.phoenix.iterate.RoundRobinResultIteratorWithStatsIT
Running org.apache.phoenix.end2end.TenantSpecificTablesDMLIT
Running org.apache.phoenix.end2end.ViewIT
Running org.apache.phoenix.execute.PartialCommitIT
Tests run: 6, Failures: 0, Errors: 0, Skipped: 0, Time elapsed: 2.592 sec - in org.apache.phoenix.execute.PartialCommitIT
Running org.apache.phoenix.end2end.index.MutableIndexFailureIT
Tests run: 1, Failures: 0, Errors: 0, Skipped: 0, Time elapsed: 27.916 sec - in org.apache.phoenix.end2end.ConnectionUtilIT
Tests run: 1, Failures: 0, Errors: 0, Skipped: 0, Time elapsed: 15.503 sec - in org.apache.phoenix.iterate.RoundRobinResultIteratorWithStatsIT
Running org.apache.phoenix.end2end.index.ImmutableIndexWithStatsIT
Running org.apache.phoenix.end2end.index.MutableIndexReplicationIT
Tests run: 1, Failures: 0, Errors: 0, Skipped: 0, Time elapsed: 7.991 sec - in org.apache.phoenix.end2end.index.ImmutableIndexWithStatsIT
Tests run: 16, Failures: 0, Errors: 0, Skipped: 0, Time elapsed: 44.715 sec - in org.apache.phoenix.end2end.TenantSpecificTablesDMLIT
Tests run: 22, Failures: 0, Errors: 0, Skipped: 0, Time elapsed: 53.385 sec - in org.apache.phoenix.end2end.ViewIT
Tests run: 1, Failures: 0, Errors: 0, Skipped: 0, Time elapsed: 20.432 sec - in org.apache.phoenix.end2end.index.MutableIndexReplicationIT
Running org.apache.phoenix.end2end.QueryWithLimitIT
Running org.apache.phoenix.end2end.QueryTimeoutIT
Tests run: 2, Failures: 0, Errors: 0, Skipped: 0, Time elapsed: 9.251 sec - in org.apache.phoenix.end2end.QueryWithLimitIT
Running org.apache.phoenix.end2end.StatsCollectorIT
Running org.apache.phoenix.end2end.KeyOnlyIT
Tests run: 1, Failures: 0, Errors: 0, Skipped: 0, Time elapsed: 17.218 sec - in org.apache.phoenix.end2end.QueryTimeoutIT
Running org.apache.phoenix.end2end.ContextClassloaderIT
Tests run: 3, Failures: 0, Errors: 0, Skipped: 0, Time elapsed: 18.437 sec - in org.apache.phoenix.end2end.KeyOnlyIT
Running org.apache.phoenix.end2end.UnionAllIT
Tests run: 3, Failures: 0, Errors: 0, Skipped: 0, Time elapsed: 6.706 sec - in org.apache.phoenix.end2end.ContextClassloaderIT
Running org.apache.phoenix.end2end.MultiCfQueryExecIT
Running org.apache.phoenix.end2end.UserDefinedFunctionsIT
Tests run: 12, Failures: 0, Errors: 0, Skipped: 0, Time elapsed: 28.221 sec - in org.apache.phoenix.end2end.UnionAllIT
Tests run: 4, Failures: 0, Errors: 0, Skipped: 0, Time elapsed: 59.477 sec - in org.apache.phoenix.end2end.StatsCollectorIT
Tests run: 7, Failures: 0, Errors: 0, Skipped: 0, Time elapsed: 17.878 sec - in org.apache.phoenix.end2end.MultiCfQueryExecIT
Tests run: 13, Failures: 0, Errors: 0, Skipped: 0, Time elapsed: 15.815 sec - in org.apache.phoenix.end2end.UserDefinedFunctionsIT
Running org.apache.phoenix.end2end.SaltedViewIT
Running org.apache.phoenix.end2end.AlterTableIT
Running org.apache.phoenix.end2end.TenantSpecificTablesDDLIT
Running org.apache.phoenix.end2end.CountDistinctCompressionIT
Tests run: 2, Failures: 0, Errors: 0, Skipped: 0, Time elapsed: 16.139 sec - in org.apache.phoenix.end2end.SaltedViewIT
Tests run: 1, Failures: 0, Errors: 0, Skipped: 0, Time elapsed: 7.837 sec - in org.apache.phoenix.end2end.CountDistinctCompressionIT
Running org.apache.phoenix.end2end.SpillableGroupByIT
Running org.apache.phoenix.end2end.StatsCollectorWithSplitsAndMultiCFIT
Tests run: 1, Failures: 0, Errors: 0, Skipped: 0, Time elapsed: 11.836 sec - in org.apache.phoenix.end2end.SpillableGroupByIT
Tests run: 17, Failures: 0, Errors: 0, Skipped: 0, Time elapsed: 40.105 sec - in org.apache.phoenix.end2end.TenantSpecificTablesDDLIT
Running org.apache.phoenix.end2end.ParallelIteratorsIT
Tests run: 2, Failures: 0, Errors: 0, Skipped: 0, Time elapsed: 28.643 sec - in org.apache.phoenix.end2end.StatsCollectorWithSplitsAndMultiCFIT
Running org.apache.phoenix.mapreduce.IndexToolIT
Tests run: 3, Failures: 0, Errors: 0, Skipped: 0, Time elapsed: 17.509 sec - in org.apache.phoenix.end2end.ParallelIteratorsIT
Running org.apache.phoenix.monitoring.PhoenixMetricsIT
Running org.apache.phoenix.mapreduce.CsvBulkLoadToolIT
Tests run: 17, Failures: 2, Errors: 0, Skipped: 0, Time elapsed: 45.227 sec <<< FAILURE! - in org.apache.phoenix.monitoring.PhoenixMetricsIT
testMetricsForUpsertSelectWithAutoCommit(org.apache.phoenix.monitoring.PhoenixMetricsIT)  Time elapsed: 4.387 sec  <<< FAILURE!
java.lang.AssertionError: Unequal values for metric MUTATION_BYTES expected:<5600> but was:<16240>
	at org.apache.phoenix.monitoring.PhoenixMetricsIT.assertMetricsHaveSameValues(PhoenixMetricsIT.java:654)
	at org.apache.phoenix.monitoring.PhoenixMetricsIT.assertMetricsAreSame(PhoenixMetricsIT.java:643)
	at org.apache.phoenix.monitoring.PhoenixMetricsIT.testMetricsForUpsertSelectWithAutoCommit(PhoenixMetricsIT.java:462)

testMetricsForUpsertSelectSameTable(org.apache.phoenix.monitoring.PhoenixMetricsIT)  Time elapsed: 1.779 sec  <<< FAILURE!
java.lang.AssertionError: Unequal values for metric MUTATION_BYTES expected:<5600> but was:<16240>
	at org.apache.phoenix.monitoring.PhoenixMetricsIT.assertMetricsHaveSameValues(PhoenixMetricsIT.java:654)
	at org.apache.phoenix.monitoring.PhoenixMetricsIT.assertMetricsAreSame(PhoenixMetricsIT.java:643)
	at org.apache.phoenix.monitoring.PhoenixMetricsIT.testMetricsForUpsertSelectSameTable(PhoenixMetricsIT.java:615)

Running org.apache.phoenix.hbase.index.FailForUnsupportedHBaseVersionsIT
Tests run: 2, Failures: 0, Errors: 0, Skipped: 0, Time elapsed: 18.034 sec - in org.apache.phoenix.hbase.index.FailForUnsupportedHBaseVersionsIT
Running org.apache.phoenix.hbase.index.covered.example.EndToEndCoveredIndexingIT
Tests run: 11, Failures: 0, Errors: 0, Skipped: 0, Time elapsed: 50.629 sec - in org.apache.phoenix.hbase.index.covered.example.EndToEndCoveredIndexingIT
Tests run: 5, Failures: 0, Errors: 0, Skipped: 0, Time elapsed: 155.717 sec - in org.apache.phoenix.mapreduce.CsvBulkLoadToolIT
Running org.apache.phoenix.hbase.index.covered.example.FailWithoutRetriesIT
Tests run: 1, Failures: 0, Errors: 0, Skipped: 0, Time elapsed: 9.089 sec - in org.apache.phoenix.hbase.index.covered.example.FailWithoutRetriesIT
Running org.apache.phoenix.hbase.index.covered.EndToEndCoveredColumnsIndexBuilderIT
Tests run: 2, Failures: 0, Errors: 0, Skipped: 0, Time elapsed: 9.007 sec - in org.apache.phoenix.hbase.index.covered.EndToEndCoveredColumnsIndexBuilderIT
Running org.apache.phoenix.hbase.index.balancer.IndexLoadBalancerIT
Tests run: 55, Failures: 0, Errors: 0, Skipped: 0, Time elapsed: 340.608 sec - in org.apache.phoenix.end2end.AlterTableIT
Running org.apache.phoenix.rpc.PhoenixClientRpcIT
Tests run: 2, Failures: 0, Errors: 0, Skipped: 0, Time elapsed: 11.514 sec - in org.apache.phoenix.rpc.PhoenixClientRpcIT
Running org.apache.phoenix.rpc.PhoenixServerRpcIT
Tests run: 2, Failures: 0, Errors: 0, Skipped: 0, Time elapsed: 18.214 sec - in org.apache.phoenix.rpc.PhoenixServerRpcIT
Running org.apache.hadoop.hbase.regionserver.wal.WALReplayWithIndexWritesAndCompressedWALIT
Tests run: 9, Failures: 0, Errors: 0, Skipped: 0, Time elapsed: 343.169 sec - in org.apache.phoenix.mapreduce.IndexToolIT
Running org.apache.hadoop.hbase.regionserver.wal.WALReplayWithIndexWritesAndUncompressedWALInHBase_094_9_IT
Tests run: 9, Failures: 0, Errors: 0, Skipped: 0, Time elapsed: 103.193 sec - in org.apache.phoenix.hbase.index.balancer.IndexLoadBalancerIT
Tests run: 1, Failures: 0, Errors: 0, Skipped: 0, Time elapsed: 16.931 sec - in org.apache.hadoop.hbase.regionserver.wal.WALReplayWithIndexWritesAndCompressedWALIT
Tests run: 1, Failures: 0, Errors: 0, Skipped: 0, Time elapsed: 17.109 sec - in org.apache.hadoop.hbase.regionserver.wal.WALReplayWithIndexWritesAndUncompressedWALInHBase_094_9_IT
Tests run: 3, Failures: 0, Errors: 0, Skipped: 2, Time elapsed: 1,225.195 sec - in org.apache.phoenix.end2end.index.MutableIndexFailureIT
Running org.apache.phoenix.hbase.index.covered.example.EndtoEndIndexingWithCompressionIT
Tests run: 11, Failures: 0, Errors: 0, Skipped: 0, Time elapsed: 52.438 sec - in org.apache.phoenix.hbase.index.covered.example.EndtoEndIndexingWithCompressionIT

Results :

Failed tests: 
  PhoenixMetricsIT.testMetricsForUpsertSelectSameTable:615->assertMetricsAreSame:643->assertMetricsHaveSameValues:654 Unequal values for metric MUTATION_BYTES expected:<5600> but was:<16240>
  PhoenixMetricsIT.testMetricsForUpsertSelectWithAutoCommit:462->assertMetricsAreSame:643->assertMetricsHaveSameValues:654 Unequal values for metric MUTATION_BYTES expected:<5600> but was:<16240>

Tests run: 250, Failures: 2, Errors: 0, Skipped: 2

[INFO] 
[INFO] --- maven-failsafe-plugin:2.19:verify (ClientManagedTimeTests) @ phoenix-core ---
[INFO] ------------------------------------------------------------------------
[INFO] Reactor Summary:
[INFO] 
[INFO] Apache Phoenix .................................... SUCCESS [3.667s]
[INFO] Phoenix Core ...................................... FAILURE [46:33.733s]
[INFO] Phoenix - Flume ................................... SKIPPED
[INFO] Phoenix - Pig ..................................... SKIPPED
[INFO] Phoenix Query Server Client ....................... SKIPPED
[INFO] Phoenix Query Server .............................. SKIPPED
[INFO] Phoenix - Pherf ................................... SKIPPED
[INFO] Phoenix - Spark ................................... SKIPPED
[INFO] Phoenix Assembly .................................. SKIPPED
[INFO] Phoenix - Tracing Web Application ................. SKIPPED
[INFO] ------------------------------------------------------------------------
[INFO] BUILD FAILURE
[INFO] ------------------------------------------------------------------------
[INFO] Total time: 46:38.032s
[INFO] Finished at: Fri Nov 13 01:42:14 UTC 2015
[INFO] Final Memory: 63M/999M
[INFO] ------------------------------------------------------------------------
[ERROR] Failed to execute goal org.apache.maven.plugins:maven-failsafe-plugin:2.19:verify (ClientManagedTimeTests) on project phoenix-core: There are test failures.
[ERROR] 
[ERROR] Please refer to <https://builds.apache.org/job/Phoenix-4.x-HBase-1.0/ws/phoenix-core/target/failsafe-reports> for the individual test results.
[ERROR] -> [Help 1]
[ERROR] 
[ERROR] To see the full stack trace of the errors, re-run Maven with the -e switch.
[ERROR] Re-run Maven using the -X switch to enable full debug logging.
[ERROR] 
[ERROR] For more information about the errors and possible solutions, please read the following articles:
[ERROR] [Help 1] http://cwiki.apache.org/confluence/display/MAVEN/MojoFailureException
[ERROR] 
[ERROR] After correcting the problems, you can resume the build with the command
[ERROR]   mvn <goals> -rf :phoenix-core
Build step 'Invoke top-level Maven targets' marked build as failure
Archiving artifacts
Compressed 1.01 GB of artifacts by 45.3% relative to #214
Recording test results