You are viewing a plain text version of this content. The canonical link for it is here.
Posted to issues@trafficserver.apache.org by je...@ci.trafficserver.apache.org on 2015/08/26 21:41:18 UTC

Build failed in Jenkins: tsqa-master #809

See <https://ci.trafficserver.apache.org/job/tsqa-master/809/changes>

Changes:

[Leif Hedstrom] TS-3860 Avoid buffer overflow in debug builds

------------------------------------------
Started by upstream project "out_of_tree-master" build number 1112
originally caused by:
 Started by an SCM change
Started by upstream project "in_tree-master" build number 1331
originally caused by:
 Started by an SCM change
Building remotely on QA3 (qa) in workspace <https://ci.trafficserver.apache.org/job/tsqa-master/ws/>
 > /usr/bin/git rev-parse --is-inside-work-tree # timeout=10
Fetching changes from the remote Git repository
 > /usr/bin/git config remote.origin.url https://git-wip-us.apache.org/repos/asf/trafficserver.git # timeout=10
Cleaning workspace
 > /usr/bin/git rev-parse --verify HEAD # timeout=10
Resetting working tree
 > /usr/bin/git reset --hard # timeout=10
 > /usr/bin/git clean -fdx # timeout=10
Fetching upstream changes from https://git-wip-us.apache.org/repos/asf/trafficserver.git
 > /usr/bin/git --version # timeout=10
 > /usr/bin/git -c core.askpass=true fetch --tags --progress https://git-wip-us.apache.org/repos/asf/trafficserver.git +refs/heads/*:refs/remotes/origin/*
 > /usr/bin/git rev-parse refs/remotes/origin/master^{commit} # timeout=10
 > /usr/bin/git rev-parse refs/remotes/origin/origin/master^{commit} # timeout=10
Checking out Revision b081f52e347e5363e512067313a51837713e5741 (refs/remotes/origin/master)
 > /usr/bin/git config core.sparsecheckout # timeout=10
 > /usr/bin/git checkout -f b081f52e347e5363e512067313a51837713e5741
 > /usr/bin/git rev-list 73dca11323f7286e394bbcb23abc7013e0fa0e41 # timeout=10
[tsqa-master] $ /bin/bash -xe /tmp/hudson8023105641468582891.sh
+ source /home/jenkins/bin/environment.sh
++ export ATS_SRC_HOME=/home/jenkins/src
++ ATS_SRC_HOME=/home/jenkins/src
++ test tsqa-master '!=' tsqa-master
++ ATS_MAKE=make
++ test tsqa-master '!=' tsqa-master
++ export ATS_MAKE
+++ /bin/date +%m%d%Y
++ export TODAY=08262015
++ TODAY=08262015
++ ATS_BRANCH=master
++ test tsqa-master '!=' tsqa-master
++ test tsqa-master '!=' tsqa-master
++ test tsqa-master '!=' tsqa-master
++ test tsqa-master '!=' tsqa-master
++ test tsqa-master '!=' tsqa-master
++ test tsqa-master '!=' tsqa-master
++ test tsqa-master '!=' tsqa-master
++ test tsqa-master '!=' tsqa-master
++ test tsqa-master '!=' tsqa-master
++ test tsqa-master '!=' tsqa-master
++ test tsqa-master '!=' tsqa-master
++ test tsqa-master '!=' tsqa-master
++ test tsqa-master '!=' tsqa-master
++ export ATS_BRANCH
++ test tsqa-master '!=' tsqa-master
+ source /home/jenkins/bin/tsqa.sh
++ TSQA_LAYOUT_DIR=<https://ci.trafficserver.apache.org/job/tsqa-master/ws/809>
++ cd <https://ci.trafficserver.apache.org/job/tsqa-master/ws/src/ci/tsqa>
++ make test
New python executable in virtualenv/bin/python
Installing Setuptools..............................................................................................................................................................................................................................done.
Installing Pip.....................................................................................................................................................................................................................................................................................................................................done.
make update
make[1]: Entering directory `<https://ci.trafficserver.apache.org/job/tsqa-master/ws/src/ci/tsqa'>
Exception:
Traceback (most recent call last):
  File "<https://ci.trafficserver.apache.org/job/tsqa-master/ws/src/ci/tsqa/virtualenv/lib/python2.7/site-packages/pip/basecommand.py",> line 134, in main
    status = self.run(options, args)
  File "<https://ci.trafficserver.apache.org/job/tsqa-master/ws/src/ci/tsqa/virtualenv/lib/python2.7/site-packages/pip/commands/install.py",> line 220, in run
    for req in parse_requirements(filename, finder=finder, options=options):
  File "<https://ci.trafficserver.apache.org/job/tsqa-master/ws/src/ci/tsqa/virtualenv/lib/python2.7/site-packages/pip/req.py",> line 1477, in parse_requirements
    req = InstallRequirement.from_line(line, comes_from, prereleases=getattr(options, "pre", None))
  File "<https://ci.trafficserver.apache.org/job/tsqa-master/ws/src/ci/tsqa/virtualenv/lib/python2.7/site-packages/pip/req.py",> line 129, in from_line
    return cls(req, comes_from, url=url, prereleases=prereleases)
  File "<https://ci.trafficserver.apache.org/job/tsqa-master/ws/src/ci/tsqa/virtualenv/lib/python2.7/site-packages/pip/req.py",> line 44, in __init__
    req = pkg_resources.Requirement.parse(req)
  File "<https://ci.trafficserver.apache.org/job/tsqa-master/ws/src/ci/tsqa/virtualenv/lib/python2.7/site-packages/pkg_resources.py",> line 2914, in parse
    reqs = list(parse_requirements(s))
  File "<https://ci.trafficserver.apache.org/job/tsqa-master/ws/src/ci/tsqa/virtualenv/lib/python2.7/site-packages/pkg_resources.py",> line 2839, in parse_requirements
    line, p, specs = scan_list(VERSION,LINE_END,line,p,(1,2),"version spec")
  File "<https://ci.trafficserver.apache.org/job/tsqa-master/ws/src/ci/tsqa/virtualenv/lib/python2.7/site-packages/pkg_resources.py",> line 2807, in scan_list
    raise ValueError("Expected "+item_name+" in",line,"at",line[p:])
ValueError: ('Expected version spec in', "hyper; python_version >= '2.7'", 'at', "; python_version >= '2.7'")

Storing complete log in /home/jenkins/.pip/pip.log
make[1]: *** [update] Error 2
make[1]: Leaving directory `<https://ci.trafficserver.apache.org/job/tsqa-master/ws/src/ci/tsqa'>
make: *** [virtualenv/.done] Error 2
Build step 'Execute shell' marked build as failure
Recording test results
ERROR: Publisher hudson.tasks.junit.JUnitResultArchiver aborted due to exception
hudson.AbortException: No test report files were found. Configuration error?
	at hudson.tasks.junit.JUnitParser$ParseResultCallable.invoke(JUnitParser.java:116)
	at hudson.tasks.junit.JUnitParser$ParseResultCallable.invoke(JUnitParser.java:93)
	at hudson.FilePath$FileCallableWrapper.call(FilePath.java:2688)
	at hudson.remoting.UserRequest.perform(UserRequest.java:121)
	at hudson.remoting.UserRequest.perform(UserRequest.java:49)
	at hudson.remoting.Request$2.run(Request.java:324)
	at hudson.remoting.InterceptingExecutorService$1.call(InterceptingExecutorService.java:68)
	at java.util.concurrent.FutureTask.run(FutureTask.java:262)
	at java.util.concurrent.ThreadPoolExecutor.runWorker(ThreadPoolExecutor.java:1145)
	at java.util.concurrent.ThreadPoolExecutor$Worker.run(ThreadPoolExecutor.java:615)
	at java.lang.Thread.run(Thread.java:745)
	at ......remote call to QA3(Native Method)
	at hudson.remoting.Channel.attachCallSiteStackTrace(Channel.java:1356)
	at hudson.remoting.UserResponse.retrieve(UserRequest.java:221)
	at hudson.remoting.Channel.call(Channel.java:752)
	at hudson.FilePath.act(FilePath.java:978)
	at hudson.FilePath.act(FilePath.java:967)
	at hudson.tasks.junit.JUnitParser.parseResult(JUnitParser.java:90)
	at hudson.tasks.junit.JUnitResultArchiver.parse(JUnitResultArchiver.java:120)
	at hudson.tasks.junit.JUnitResultArchiver.perform(JUnitResultArchiver.java:137)
	at hudson.tasks.BuildStepCompatibilityLayer.perform(BuildStepCompatibilityLayer.java:74)
	at hudson.tasks.BuildStepMonitor$1.perform(BuildStepMonitor.java:20)
	at hudson.model.AbstractBuild$AbstractBuildExecution.perform(AbstractBuild.java:761)
	at hudson.model.AbstractBuild$AbstractBuildExecution.performAllBuildSteps(AbstractBuild.java:721)
	at hudson.model.Build$BuildExecution.post2(Build.java:183)
	at hudson.model.AbstractBuild$AbstractBuildExecution.post(AbstractBuild.java:670)
	at hudson.model.Run.execute(Run.java:1775)
	at hudson.model.FreeStyleBuild.run(FreeStyleBuild.java:43)
	at hudson.model.ResourceController.execute(ResourceController.java:89)
	at hudson.model.Executor.run(Executor.java:240)

Build failed in Jenkins: tsqa-master #823

Posted by je...@ci.trafficserver.apache.org.
See <https://ci.trafficserver.apache.org/job/tsqa-master/823/changes>

Changes:

[Thomas Jackson] Fix typo

------------------------------------------
[...truncated 531 lines...]
127.0.0.1 - - [29/Aug/2015 00:35:40] "GET / HTTP/1.1" 200 5
127.0.0.1 - - [29/Aug/2015 00:35:40] "GET / HTTP/1.1" 200 5
127.0.0.1 - - [29/Aug/2015 00:35:40] "GET / HTTP/1.1" 200 5
127.0.0.1 - - [29/Aug/2015 00:35:40] "GET / HTTP/1.1" 200 5
127.0.0.1 - - [29/Aug/2015 00:35:40] "GET / HTTP/1.1" 200 5
127.0.0.1 - - [29/Aug/2015 00:35:40] "GET / HTTP/1.1" 200 5
127.0.0.1 - - [29/Aug/2015 00:35:40] "GET / HTTP/1.1" 200 5
127.0.0.1 - - [29/Aug/2015 00:35:40] "GET / HTTP/1.1" 200 5
ok
INFO 2015-08-29 00:35:40,293 - Environment prefix is /tmp/tsqa.env.U_UJpX
INFO 2015-08-29 00:35:40,296 - map / http://127.0.0.1:43164/
test_head_request_without_timout (test_headrequest.TestHeadRequestWithoutTimeout) ... INFO 2015-08-29 00:35:43,537 - HTTP/1.1 200 OK
Server: ATS/6.1.0
Vary: Accept-Encoding
Date: Sat, 29 Aug 2015 00:35:43 GMT
Age: 0
Connection: close


INFO 2015-08-29 00:35:43,538 - head request with case(TE) costs 0.015646 seconds while the timout is 5.000000 seconds.
INFO 2015-08-29 00:35:43,550 - HTTP/1.1 200 OK
Server: ATS/6.1.0
Content-Length: 123
Vary: Accept-Encoding
Date: Sat, 29 Aug 2015 00:35:43 GMT
Age: 0
Connection: close


INFO 2015-08-29 00:35:43,550 - head request with case(CL) costs 0.012421 seconds while the timout is 5.000000 seconds.
INFO 2015-08-29 00:35:43,567 - HTTP/1.1 200 OK
Server: ATS/6.1.0
Vary: Accept-Encoding
Date: Sat, 29 Aug 2015 00:35:43 GMT
Age: 0
Connection: close


INFO 2015-08-29 00:35:43,568 - head request with case() costs 0.017513 seconds while the timout is 5.000000 seconds.
ok
INFO 2015-08-29 00:35:43,748 - Environment prefix is /tmp/tsqa.env.ZojVcl
test_working (test_hostdb.TestHostDBBadResolvConf) ... ok
INFO 2015-08-29 00:35:47,266 - Environment prefix is /tmp/tsqa.env.LeaXI6
test_lookup_timeout (test_hostdb.TestHostDBFailedDNS) ... ok
INFO 2015-08-29 00:35:52,717 - Environment prefix is /tmp/tsqa.env.Y0CwEp
Test basic fnctionality of hosts files ... ok
Test that changes to hosts file get loaded within host_file.interval ... ok
INFO 2015-08-29 00:36:02,232 - Environment prefix is /tmp/tsqa.env.qds_ze
SKIP: 
-------------------- >> begin captured logging << --------------------
root: INFO: Environment prefix is /tmp/tsqa.env.qds_ze
--------------------- >> end captured logging << ---------------------
INFO 2015-08-29 00:36:02,318 - Environment prefix is /tmp/tsqa.env.xTwaFV
ERROR
INFO 2015-08-29 00:36:02,428 - Environment prefix is /tmp/tsqa.env.ZdfSty
test_ecdsa (test_https.TestECDSA) ... ok
test_intermediate_ca_ecdsa (test_https.TestECDSA) ... ok
test_intermediate_ca_rsa (test_https.TestECDSA) ... ok
We should be served the first match, since we aren't sending SNI headers ... ok
Make sure we get the certificate we asked for if we pass in SNI headers ... ok
test_rsa (test_https.TestECDSA) ... ok
We should be served the first match, since we aren't sending SNI headers ... ok
Make sure we get the certificate we asked for if we pass in SNI headers ... ok
INFO 2015-08-29 00:36:06,085 - Environment prefix is /tmp/tsqa.env.o4dut2
test_ecdsa (test_https.TestMix) ... ok
test_intermediate_ca_ecdsa (test_https.TestMix) ... ok
test_intermediate_ca_rsa (test_https.TestMix) ... ok
We should be served the first match, since we aren't sending SNI headers ... ok
Make sure we get the certificate we asked for if we pass in SNI headers ... ok
test_rsa (test_https.TestMix) ... ok
We should be served the first match, since we aren't sending SNI headers ... ok
Make sure we get the certificate we asked for if we pass in SNI headers ... ok
INFO 2015-08-29 00:36:09,747 - Environment prefix is /tmp/tsqa.env.15o4qT
test_ecdsa (test_https.TestRSA) ... ok
test_intermediate_ca_ecdsa (test_https.TestRSA) ... ok
test_intermediate_ca_rsa (test_https.TestRSA) ... ok
We should be served the first match, since we aren't sending SNI headers ... ok
Make sure we get the certificate we asked for if we pass in SNI headers ... ok
test_rsa (test_https.TestRSA) ... ok
We should be served the first match, since we aren't sending SNI headers ... ok
Make sure we get the certificate we asked for if we pass in SNI headers ... ok
INFO 2015-08-29 00:36:13,419 - Environment prefix is /tmp/tsqa.env.cx4tF3
test_error_path (test_keepalive.TestKeepAliveInHTTP) ... ok
Ensure that sending a request with a body doesn't break the keepalive session ... ok
test_working_path (test_keepalive.TestKeepAliveInHTTP) ... 127.0.0.1 - - [29/Aug/2015 00:36:16] "GET /exists/ HTTP/1.1" 200 5
127.0.0.1 - - [29/Aug/2015 00:36:16] "GET /exists/ HTTP/1.1" 200 5
127.0.0.1 - - [29/Aug/2015 00:36:16] "GET /exists/ HTTP/1.1" 200 5
127.0.0.1 - - [29/Aug/2015 00:36:16] "GET /exists/ HTTP/1.1" 200 5
127.0.0.1 - - [29/Aug/2015 00:36:16] "GET /exists/ HTTP/1.1" 200 5
127.0.0.1 - - [29/Aug/2015 00:36:16] "GET /exists/ HTTP/1.1" 200 5
127.0.0.1 - - [29/Aug/2015 00:36:16] "GET /exists/ HTTP/1.1" 200 5
127.0.0.1 - - [29/Aug/2015 00:36:16] "GET /exists/ HTTP/1.1" 200 5
127.0.0.1 - - [29/Aug/2015 00:36:16] "GET /exists/ HTTP/1.1" 200 5
ok
INFO 2015-08-29 00:36:16,897 - Environment prefix is /tmp/tsqa.env._ii4is
Tests that origin_min_keep_alive_connections is honored via http. ... ok
INFO 2015-08-29 00:36:23,387 - Environment prefix is /tmp/tsqa.env.r6NmP2
Tests that origin_min_keep_alive_connections is honored via https. ... ok
INFO 2015-08-29 00:36:29,886 - Environment prefix is /tmp/tsqa.env.5_dRlz
Test that the origin does in fact support keepalive via http. ... ok
Tests that keepalive works through ATS to origin via http. ... ok
Tests that origin does not timeout using keepalive via http. ... ok
Tests that keepalive timeout is honored through ATS to origin via http. ... ok
INFO 2015-08-29 00:36:51,417 - Environment prefix is /tmp/tsqa.env.dkDwRE
Test that the origin does in fact support keepalive via https. ... ok
Tests that keepalive works through ATS to origin via https. ... ok
Tests that origin does not timeout using keepalive via https. ... ok
Tests that keepalive timeout is honored through ATS to origin via https. ... ok
INFO 2015-08-29 00:37:12,965 - Environment prefix is /tmp/tsqa.env.sMlIYv
Tests that keepalive works through ATS to origin via https. ... ok
Tests that keepalive works through ATS to origin via https. ... ok
INFO 2015-08-29 00:37:16,549 - Environment prefix is /tmp/tsqa.env.boSLOu
Tests that keepalive works through ATS to origin via https. ... ok
Tests that keepalive works through ATS to origin via https. ... ok
INFO 2015-08-29 00:37:20,011 - Environment prefix is /tmp/tsqa.env.GoHrKK
INFO 2015-08-29 00:37:20,013 - socket_server_port = 49169
INFO 2015-08-29 00:37:20,013 - starting the socket server
test_origin_min_connection (test_origin_min_keep_alive_connection.TestKeepAlive_Origin_Min_connections) ... INFO 2015-08-29 00:37:23,245 - Sending data back to the client: ffce51d29f0149d5a3179f725fbc7e59
INFO 2015-08-29 00:37:23,249 - ffce51d29f0149d5a3179f725fbc7e59
INFO 2015-08-29 00:37:28,255 - Sending data back to the client: ffce51d29f0149d5a3179f725fbc7e59
INFO 2015-08-29 00:37:28,256 - ffce51d29f0149d5a3179f725fbc7e59
ok
INFO 2015-08-29 00:37:28,439 - Environment prefix is /tmp/tsqa.env.IE4YPE
test_redirection (test_redirection.TestRedirection) ... 127.0.0.1 - - [29/Aug/2015 00:37:31] "GET /redirect/9 HTTP/1.1" 302 229
127.0.0.1 - - [29/Aug/2015 00:37:31] "GET /redirect/8 HTTP/1.1" 302 229
127.0.0.1 - - [29/Aug/2015 00:37:31] "GET /redirect/7 HTTP/1.1" 302 229
127.0.0.1 - - [29/Aug/2015 00:37:31] "GET /redirect/6 HTTP/1.1" 302 229
127.0.0.1 - - [29/Aug/2015 00:37:31] "GET /redirect/5 HTTP/1.1" 302 229
127.0.0.1 - - [29/Aug/2015 00:37:31] "GET /redirect/4 HTTP/1.1" 302 229
127.0.0.1 - - [29/Aug/2015 00:37:31] "GET /redirect/3 HTTP/1.1" 302 229
127.0.0.1 - - [29/Aug/2015 00:37:31] "GET /redirect/2 HTTP/1.1" 302 229
127.0.0.1 - - [29/Aug/2015 00:37:31] "GET /redirect/1 HTTP/1.1" 302 215
127.0.0.1 - - [29/Aug/2015 00:37:31] "GET /get HTTP/1.1" 200 437
127.0.0.1 - - [29/Aug/2015 00:37:31] "GET /redirect/10 HTTP/1.1" 302 229
127.0.0.1 - - [29/Aug/2015 00:37:31] "GET /redirect/9 HTTP/1.1" 302 229
127.0.0.1 - - [29/Aug/2015 00:37:31] "GET /redirect/8 HTTP/1.1" 302 229
127.0.0.1 - - [29/Aug/2015 00:37:31] "GET /redirect/7 HTTP/1.1" 302 229
127.0.0.1 - - [29/Aug/2015 00:37:31] "GET /redirect/6 HTTP/1.1" 302 229
127.0.0.1 - - [29/Aug/2015 00:37:31] "GET /redirect/5 HTTP/1.1" 302 229
127.0.0.1 - - [29/Aug/2015 00:37:31] "GET /redirect/4 HTTP/1.1" 302 229
127.0.0.1 - - [29/Aug/2015 00:37:31] "GET /redirect/3 HTTP/1.1" 302 229
127.0.0.1 - - [29/Aug/2015 00:37:31] "GET /redirect/2 HTTP/1.1" 302 229
127.0.0.1 - - [29/Aug/2015 00:37:31] "GET /redirect/1 HTTP/1.1" 302 215
ok
INFO 2015-08-29 00:37:32,063 - Environment prefix is /tmp/tsqa.env.D8IETs
test_regressions (test_regressions.TestRegressions) ... ok
INFO 2015-08-29 00:40:09,766 - Starting build (d133993325226bee52737bbab4e1cbc1): configure {'enable-ccache': None, 'enable-experimental-plugins': None, 'enable-example-plugins': None, 'enable-test-tools': None, 'enable-linux-native-aio': None, 'disable-dependency-tracking': None}
SKIP: Error 1 running: ['<https://ci.trafficserver.apache.org/job/tsqa-master/ws/src/configure',> '--prefix=/', '--enable-ccache', '--enable-experimental-plugins', '--enable-example-plugins', '--enable-test-tools', '--enable-linux-native-aio', '--disable-dependency-tracking']
configure: error: Linux native AIO requires libaio.h

-------------------- >> begin captured logging << --------------------
tsqa.environment: INFO: Starting build (d133993325226bee52737bbab4e1cbc1): configure {'enable-ccache': None, 'enable-experimental-plugins': None, 'enable-example-plugins': None, 'enable-test-tools': None, 'enable-linux-native-aio': None, 'disable-dependency-tracking': None}
--------------------- >> end captured logging << ---------------------
INFO 2015-08-29 00:40:20,652 - Environment prefix is /tmp/tsqa.env.HxjHKn
test_remap_http (test_remap.TestRemapHTTP) ... 127.0.0.1 - - [29/Aug/2015 00:40:24] "GET / HTTP/1.1" 200 5
127.0.0.1 - - [29/Aug/2015 00:40:24] "GET / HTTP/1.1" 200 5
127.0.0.1 - - [29/Aug/2015 00:40:24] "GET / HTTP/1.1" 200 5
ok
INFO 2015-08-29 00:40:24,197 - Environment prefix is /tmp/tsqa.env.cE6mMK
test_remap_https (test_remap.TestRemapHTTPS) ... 127.0.0.1 - - [29/Aug/2015 00:40:27] "GET / HTTP/1.1" 200 5
127.0.0.1 - - [29/Aug/2015 00:40:27] "GET / HTTP/1.1" 200 5
127.0.0.1 - - [29/Aug/2015 00:40:27] "GET / HTTP/1.1" 200 5
ok
SKIP: Skipping spdy/2 tests
INFO 2015-08-29 00:40:27,647 - Environment prefix is /tmp/tsqa.env.1xb3Bk
INFO 2015-08-29 00:40:27,649 - spdycat path = /usr/local/bin/spdycat
INFO 2015-08-29 00:40:27,649 - spdy server port = 44588
INFO 2015-08-29 00:40:27,649 - http server port = 57228
Test that the origin does in fact support spdy 3 ... INFO 2015-08-29 00:40:30,884 - full args = ['/usr/local/bin/spdycat', 'https://localhost:44588/', '-nv', '--spdy3']
ok
Test that non spdy port won't advertise spdy ... INFO 2015-08-29 00:40:31,386 - full args = ['/usr/local/bin/spdycat', 'https://localhost:57228/', '-nv', '--spdy3']
Fatal: EOF
reqnum=1, completed=0
Some requests were not processed. total=1, processed=0
ok
INFO 2015-08-29 00:40:31,584 - Environment prefix is /tmp/tsqa.env.KfZZaM
INFO 2015-08-29 00:40:31,586 - spdycat path = /usr/local/bin/spdycat
INFO 2015-08-29 00:40:31,586 - spdy server port = 34534
INFO 2015-08-29 00:40:31,586 - http server port = 34578
Test that the origin does in fact support spdy 3.1 ... INFO 2015-08-29 00:40:34,817 - full args = ['/usr/local/bin/spdycat', 'https://localhost:34534/', '-nv', '--spdy3-1']
ok
Test that non spdy port won't advertise spdy ... INFO 2015-08-29 00:40:35,293 - full args = ['/usr/local/bin/spdycat', 'https://localhost:34578/', '-nv', '--spdy3-1']
Fatal: EOF
reqnum=1, completed=0
Some requests were not processed. total=1, processed=0
ok
INFO 2015-08-29 00:40:35,502 - Environment prefix is /tmp/tsqa.env.ciAiTg
Make sure the new ticket key is loaded ... ok
Make sure the new ticket key is loaded ... ok

======================================================================
ERROR: test suite for <class 'test_http2.TestHTTP2'>
----------------------------------------------------------------------
Traceback (most recent call last):
  File "<https://ci.trafficserver.apache.org/job/tsqa-master/ws/src/ci/tsqa/virtualenv/lib/python2.7/site-packages/nose/suite.py",> line 209, in run
    self.setUp()
  File "<https://ci.trafficserver.apache.org/job/tsqa-master/ws/src/ci/tsqa/virtualenv/lib/python2.7/site-packages/nose/suite.py",> line 292, in setUp
    self.setupContext(ancestor)
  File "<https://ci.trafficserver.apache.org/job/tsqa-master/ws/src/ci/tsqa/virtualenv/lib/python2.7/site-packages/nose/suite.py",> line 315, in setupContext
    try_run(context, names)
  File "<https://ci.trafficserver.apache.org/job/tsqa-master/ws/src/ci/tsqa/virtualenv/lib/python2.7/site-packages/nose/util.py",> line 471, in try_run
    return func()
  File "<https://ci.trafficserver.apache.org/job/tsqa-master/ws/src/ci/tsqa/virtualenv/lib/python2.7/site-packages/tsqa/test_cases.py",> line 80, in setUpClass
    cls.setUpEnv(cls.environment)
  File "<https://ci.trafficserver.apache.org/job/tsqa-master/ws/src/ci/tsqa/tests/test_http2.py",> line 61, in setUpEnv
    hyper.tls._context = hyper.tls.init_context()
NameError: global name 'hyper' is not defined
-------------------- >> begin captured logging << --------------------
root: INFO: Environment prefix is /tmp/tsqa.env.qds_ze
root: INFO: Environment prefix is /tmp/tsqa.env.xTwaFV
--------------------- >> end captured logging << ---------------------

======================================================================
FAIL: Verify that we get 504s from origins that return a partial_response
----------------------------------------------------------------------
Traceback (most recent call last):
  File "<https://ci.trafficserver.apache.org/job/tsqa-master/ws/src/ci/tsqa/tests/test_connect_attempts.py",> line 195, in test_partial_response_origin
    self.assertEqual(ret.status_code, 502)
AssertionError: 200 != 502

======================================================================
FAIL: Verify that we get 200s from origins that reset_after_accept
----------------------------------------------------------------------
Traceback (most recent call last):
  File "<https://ci.trafficserver.apache.org/job/tsqa-master/ws/src/ci/tsqa/tests/test_connect_attempts.py",> line 201, in test_reset_after_accept_origin
    self.assertEqual(ret.status_code, 200)
AssertionError: 502 != 200

======================================================================
FAIL: test_logs_exist (test_example.TestLogRefCounting)
----------------------------------------------------------------------
Traceback (most recent call last):
  File "<https://ci.trafficserver.apache.org/job/tsqa-master/ws/src/ci/tsqa/tests/test_example.py",> line 215, in test_logs_exist
    self.assertTrue(os.path.isfile(logfile_path), logfile_path)
AssertionError: /tmp/tsqa.env.9r6DCL/var/log/squid.log
-------------------- >> begin captured logging << --------------------
root: INFO: Environment prefix is /tmp/tsqa.env.9r6DCL
--------------------- >> end captured logging << ---------------------

----------------------------------------------------------------------
XML: <https://ci.trafficserver.apache.org/job/tsqa-master/ws/src/ci/tsqa/nosetests.xml>
----------------------------------------------------------------------
Ran 83 tests in 1624.578s

FAILED (SKIP=6, errors=1, failures=3)
2
make: *** [test] Error 1
Build step 'Execute shell' marked build as failure
Recording test results

Build failed in Jenkins: tsqa-master #822

Posted by je...@ci.trafficserver.apache.org.
See <https://ci.trafficserver.apache.org/job/tsqa-master/822/changes>

Changes:

[Thomas Jackson] TS-3874: Header-rewrite: support multiple header values in conditionals

[Thomas Jackson] TS-3874 Add documentation for header conditionals in header-rewrite

------------------------------------------
[...truncated 530 lines...]
127.0.0.1 - - [29/Aug/2015 00:16:29] "GET / HTTP/1.1" 200 5
127.0.0.1 - - [29/Aug/2015 00:16:29] "GET / HTTP/1.1" 200 5
127.0.0.1 - - [29/Aug/2015 00:16:29] "GET / HTTP/1.1" 200 5
127.0.0.1 - - [29/Aug/2015 00:16:29] "GET / HTTP/1.1" 200 5
127.0.0.1 - - [29/Aug/2015 00:16:29] "GET / HTTP/1.1" 200 5
127.0.0.1 - - [29/Aug/2015 00:16:30] "GET / HTTP/1.1" 200 5
127.0.0.1 - - [29/Aug/2015 00:16:30] "GET / HTTP/1.1" 200 5
127.0.0.1 - - [29/Aug/2015 00:16:30] "GET / HTTP/1.1" 200 5
ok
INFO 2015-08-29 00:16:30,193 - Environment prefix is /tmp/tsqa.env.n4rSmK
INFO 2015-08-29 00:16:30,195 - map / http://127.0.0.1:58411/
test_head_request_without_timout (test_headrequest.TestHeadRequestWithoutTimeout) ... INFO 2015-08-29 00:16:33,554 - HTTP/1.1 200 OK
Server: ATS/6.1.0
Vary: Accept-Encoding
Date: Sat, 29 Aug 2015 00:16:33 GMT
Age: 0
Connection: close


INFO 2015-08-29 00:16:33,554 - head request with case(TE) costs 0.012324 seconds while the timout is 5.000000 seconds.
INFO 2015-08-29 00:16:33,568 - HTTP/1.1 200 OK
Server: ATS/6.1.0
Content-Length: 123
Vary: Accept-Encoding
Date: Sat, 29 Aug 2015 00:16:33 GMT
Age: 0
Connection: close


INFO 2015-08-29 00:16:33,568 - head request with case(CL) costs 0.013927 seconds while the timout is 5.000000 seconds.
INFO 2015-08-29 00:16:33,569 - HTTP/1.1 200 OK
Server: ATS/6.1.0
Vary: Accept-Encoding
Date: Sat, 29 Aug 2015 00:16:33 GMT
Age: 0
Connection: close


INFO 2015-08-29 00:16:33,570 - head request with case() costs 0.000997 seconds while the timout is 5.000000 seconds.
ok
INFO 2015-08-29 00:16:33,752 - Environment prefix is /tmp/tsqa.env.Vy5jpI
test_working (test_hostdb.TestHostDBBadResolvConf) ... ok
INFO 2015-08-29 00:16:37,346 - Environment prefix is /tmp/tsqa.env.Sr9Rb9
test_lookup_timeout (test_hostdb.TestHostDBFailedDNS) ... ok
INFO 2015-08-29 00:16:42,891 - Environment prefix is /tmp/tsqa.env.giZ48w
Test basic fnctionality of hosts files ... ok
Test that changes to hosts file get loaded within host_file.interval ... ok
INFO 2015-08-29 00:16:52,501 - Environment prefix is /tmp/tsqa.env.xijjOg
SKIP: 
-------------------- >> begin captured logging << --------------------
root: INFO: Environment prefix is /tmp/tsqa.env.xijjOg
--------------------- >> end captured logging << ---------------------
INFO 2015-08-29 00:16:52,585 - Environment prefix is /tmp/tsqa.env.KJQc48
ERROR
INFO 2015-08-29 00:16:52,684 - Environment prefix is /tmp/tsqa.env.kVhHk7
test_ecdsa (test_https.TestECDSA) ... ok
test_intermediate_ca_ecdsa (test_https.TestECDSA) ... ok
test_intermediate_ca_rsa (test_https.TestECDSA) ... ok
We should be served the first match, since we aren't sending SNI headers ... ok
Make sure we get the certificate we asked for if we pass in SNI headers ... ok
test_rsa (test_https.TestECDSA) ... ok
We should be served the first match, since we aren't sending SNI headers ... ok
Make sure we get the certificate we asked for if we pass in SNI headers ... ok
INFO 2015-08-29 00:16:56,289 - Environment prefix is /tmp/tsqa.env.BMWHhV
test_ecdsa (test_https.TestMix) ... ok
test_intermediate_ca_ecdsa (test_https.TestMix) ... ok
test_intermediate_ca_rsa (test_https.TestMix) ... ok
We should be served the first match, since we aren't sending SNI headers ... ok
Make sure we get the certificate we asked for if we pass in SNI headers ... ok
test_rsa (test_https.TestMix) ... ok
We should be served the first match, since we aren't sending SNI headers ... ok
Make sure we get the certificate we asked for if we pass in SNI headers ... ok
INFO 2015-08-29 00:16:59,988 - Environment prefix is /tmp/tsqa.env.w9AlRt
test_ecdsa (test_https.TestRSA) ... ok
test_intermediate_ca_ecdsa (test_https.TestRSA) ... ok
test_intermediate_ca_rsa (test_https.TestRSA) ... ok
We should be served the first match, since we aren't sending SNI headers ... ok
Make sure we get the certificate we asked for if we pass in SNI headers ... ok
test_rsa (test_https.TestRSA) ... ok
We should be served the first match, since we aren't sending SNI headers ... ok
Make sure we get the certificate we asked for if we pass in SNI headers ... ok
INFO 2015-08-29 00:17:03,721 - Environment prefix is /tmp/tsqa.env.Eqbckn
test_error_path (test_keepalive.TestKeepAliveInHTTP) ... ok
Ensure that sending a request with a body doesn't break the keepalive session ... ok
test_working_path (test_keepalive.TestKeepAliveInHTTP) ... 127.0.0.1 - - [29/Aug/2015 00:17:07] "GET /exists/ HTTP/1.1" 200 5
127.0.0.1 - - [29/Aug/2015 00:17:07] "GET /exists/ HTTP/1.1" 200 5
127.0.0.1 - - [29/Aug/2015 00:17:07] "GET /exists/ HTTP/1.1" 200 5
127.0.0.1 - - [29/Aug/2015 00:17:07] "GET /exists/ HTTP/1.1" 200 5
127.0.0.1 - - [29/Aug/2015 00:17:07] "GET /exists/ HTTP/1.1" 200 5
127.0.0.1 - - [29/Aug/2015 00:17:07] "GET /exists/ HTTP/1.1" 200 5
127.0.0.1 - - [29/Aug/2015 00:17:07] "GET /exists/ HTTP/1.1" 200 5
127.0.0.1 - - [29/Aug/2015 00:17:07] "GET /exists/ HTTP/1.1" 200 5
127.0.0.1 - - [29/Aug/2015 00:17:07] "GET /exists/ HTTP/1.1" 200 5
ok
INFO 2015-08-29 00:17:07,297 - Environment prefix is /tmp/tsqa.env.tCE4aA
Tests that origin_min_keep_alive_connections is honored via http. ... ok
INFO 2015-08-29 00:17:13,776 - Environment prefix is /tmp/tsqa.env.k7jK4I
Tests that origin_min_keep_alive_connections is honored via https. ... ok
INFO 2015-08-29 00:17:20,316 - Environment prefix is /tmp/tsqa.env.ABSDhJ
Test that the origin does in fact support keepalive via http. ... ok
Tests that keepalive works through ATS to origin via http. ... ok
Tests that origin does not timeout using keepalive via http. ... ok
Tests that keepalive timeout is honored through ATS to origin via http. ... ok
INFO 2015-08-29 00:17:41,885 - Environment prefix is /tmp/tsqa.env.NYiNkI
Test that the origin does in fact support keepalive via https. ... ok
Tests that keepalive works through ATS to origin via https. ... ok
Tests that origin does not timeout using keepalive via https. ... ok
Tests that keepalive timeout is honored through ATS to origin via https. ... ok
INFO 2015-08-29 00:18:03,466 - Environment prefix is /tmp/tsqa.env.ykPEBV
Tests that keepalive works through ATS to origin via https. ... ok
Tests that keepalive works through ATS to origin via https. ... ok
INFO 2015-08-29 00:18:06,936 - Environment prefix is /tmp/tsqa.env.MzhHSK
Tests that keepalive works through ATS to origin via https. ... ok
Tests that keepalive works through ATS to origin via https. ... ok
INFO 2015-08-29 00:18:10,469 - Environment prefix is /tmp/tsqa.env.mnabpQ
INFO 2015-08-29 00:18:10,470 - socket_server_port = 37952
INFO 2015-08-29 00:18:10,470 - starting the socket server
test_origin_min_connection (test_origin_min_keep_alive_connection.TestKeepAlive_Origin_Min_connections) ... INFO 2015-08-29 00:18:13,882 - Sending data back to the client: 97f16a71c6e74ac8aeb571fcf6e8dbb4
INFO 2015-08-29 00:18:13,886 - 97f16a71c6e74ac8aeb571fcf6e8dbb4
INFO 2015-08-29 00:18:18,904 - Sending data back to the client: 97f16a71c6e74ac8aeb571fcf6e8dbb4
INFO 2015-08-29 00:18:18,913 - 97f16a71c6e74ac8aeb571fcf6e8dbb4
ok
INFO 2015-08-29 00:18:19,099 - Environment prefix is /tmp/tsqa.env.YX2UnB
test_redirection (test_redirection.TestRedirection) ... 127.0.0.1 - - [29/Aug/2015 00:18:22] "GET /redirect/9 HTTP/1.1" 302 229
127.0.0.1 - - [29/Aug/2015 00:18:22] "GET /redirect/8 HTTP/1.1" 302 229
127.0.0.1 - - [29/Aug/2015 00:18:22] "GET /redirect/7 HTTP/1.1" 302 229
127.0.0.1 - - [29/Aug/2015 00:18:22] "GET /redirect/6 HTTP/1.1" 302 229
127.0.0.1 - - [29/Aug/2015 00:18:22] "GET /redirect/5 HTTP/1.1" 302 229
127.0.0.1 - - [29/Aug/2015 00:18:22] "GET /redirect/4 HTTP/1.1" 302 229
127.0.0.1 - - [29/Aug/2015 00:18:22] "GET /redirect/3 HTTP/1.1" 302 229
127.0.0.1 - - [29/Aug/2015 00:18:22] "GET /redirect/2 HTTP/1.1" 302 229
127.0.0.1 - - [29/Aug/2015 00:18:22] "GET /redirect/1 HTTP/1.1" 302 215
127.0.0.1 - - [29/Aug/2015 00:18:22] "GET /get HTTP/1.1" 200 437
127.0.0.1 - - [29/Aug/2015 00:18:22] "GET /redirect/10 HTTP/1.1" 302 229
127.0.0.1 - - [29/Aug/2015 00:18:22] "GET /redirect/9 HTTP/1.1" 302 229
127.0.0.1 - - [29/Aug/2015 00:18:22] "GET /redirect/8 HTTP/1.1" 302 229
127.0.0.1 - - [29/Aug/2015 00:18:22] "GET /redirect/7 HTTP/1.1" 302 229
127.0.0.1 - - [29/Aug/2015 00:18:22] "GET /redirect/6 HTTP/1.1" 302 229
127.0.0.1 - - [29/Aug/2015 00:18:22] "GET /redirect/5 HTTP/1.1" 302 229
127.0.0.1 - - [29/Aug/2015 00:18:22] "GET /redirect/4 HTTP/1.1" 302 229
127.0.0.1 - - [29/Aug/2015 00:18:22] "GET /redirect/3 HTTP/1.1" 302 229
127.0.0.1 - - [29/Aug/2015 00:18:22] "GET /redirect/2 HTTP/1.1" 302 229
127.0.0.1 - - [29/Aug/2015 00:18:22] "GET /redirect/1 HTTP/1.1" 302 215
ok
INFO 2015-08-29 00:18:22,664 - Environment prefix is /tmp/tsqa.env.sEDlmW
test_regressions (test_regressions.TestRegressions) ... ok
INFO 2015-08-29 00:20:54,978 - Starting build (d133993325226bee52737bbab4e1cbc1): configure {'enable-ccache': None, 'enable-experimental-plugins': None, 'enable-example-plugins': None, 'enable-test-tools': None, 'enable-linux-native-aio': None, 'disable-dependency-tracking': None}
SKIP: Error 1 running: ['<https://ci.trafficserver.apache.org/job/tsqa-master/ws/src/configure',> '--prefix=/', '--enable-ccache', '--enable-experimental-plugins', '--enable-example-plugins', '--enable-test-tools', '--enable-linux-native-aio', '--disable-dependency-tracking']
configure: error: Linux native AIO requires libaio.h

-------------------- >> begin captured logging << --------------------
tsqa.environment: INFO: Starting build (d133993325226bee52737bbab4e1cbc1): configure {'enable-ccache': None, 'enable-experimental-plugins': None, 'enable-example-plugins': None, 'enable-test-tools': None, 'enable-linux-native-aio': None, 'disable-dependency-tracking': None}
--------------------- >> end captured logging << ---------------------
INFO 2015-08-29 00:21:04,151 - Environment prefix is /tmp/tsqa.env.v8oCF8
test_remap_http (test_remap.TestRemapHTTP) ... 127.0.0.1 - - [29/Aug/2015 00:21:07] "GET / HTTP/1.1" 200 5
127.0.0.1 - - [29/Aug/2015 00:21:07] "GET / HTTP/1.1" 200 5
127.0.0.1 - - [29/Aug/2015 00:21:07] "GET / HTTP/1.1" 200 5
ok
INFO 2015-08-29 00:21:07,693 - Environment prefix is /tmp/tsqa.env.mu5jn6
test_remap_https (test_remap.TestRemapHTTPS) ... 127.0.0.1 - - [29/Aug/2015 00:21:11] "GET / HTTP/1.1" 200 5
127.0.0.1 - - [29/Aug/2015 00:21:11] "GET / HTTP/1.1" 200 5
127.0.0.1 - - [29/Aug/2015 00:21:11] "GET / HTTP/1.1" 200 5
ok
SKIP: Skipping spdy/2 tests
INFO 2015-08-29 00:21:11,251 - Environment prefix is /tmp/tsqa.env.rqGyBd
INFO 2015-08-29 00:21:11,253 - spdycat path = /usr/local/bin/spdycat
INFO 2015-08-29 00:21:11,253 - spdy server port = 49531
INFO 2015-08-29 00:21:11,254 - http server port = 41390
Test that the origin does in fact support spdy 3 ... INFO 2015-08-29 00:21:14,485 - full args = ['/usr/local/bin/spdycat', 'https://localhost:49531/', '-nv', '--spdy3']
ok
Test that non spdy port won't advertise spdy ... INFO 2015-08-29 00:21:15,709 - full args = ['/usr/local/bin/spdycat', 'https://localhost:41390/', '-nv', '--spdy3']
Fatal: EOF
reqnum=1, completed=0
Some requests were not processed. total=1, processed=0
ok
INFO 2015-08-29 00:21:15,910 - Environment prefix is /tmp/tsqa.env.rBzDlD
INFO 2015-08-29 00:21:15,912 - spdycat path = /usr/local/bin/spdycat
INFO 2015-08-29 00:21:15,912 - spdy server port = 33129
INFO 2015-08-29 00:21:15,912 - http server port = 42860
Test that the origin does in fact support spdy 3.1 ... INFO 2015-08-29 00:21:19,176 - full args = ['/usr/local/bin/spdycat', 'https://localhost:33129/', '-nv', '--spdy3-1']
ok
Test that non spdy port won't advertise spdy ... INFO 2015-08-29 00:21:20,239 - full args = ['/usr/local/bin/spdycat', 'https://localhost:42860/', '-nv', '--spdy3-1']
Fatal: EOF
reqnum=1, completed=0
Some requests were not processed. total=1, processed=0
ok
INFO 2015-08-29 00:21:20,477 - Environment prefix is /tmp/tsqa.env.SFAKd1
Make sure the new ticket key is loaded ... ok
Make sure the new ticket key is loaded ... ok

======================================================================
ERROR: test suite for <class 'test_http2.TestHTTP2'>
----------------------------------------------------------------------
Traceback (most recent call last):
  File "<https://ci.trafficserver.apache.org/job/tsqa-master/ws/src/ci/tsqa/virtualenv/lib/python2.7/site-packages/nose/suite.py",> line 209, in run
    self.setUp()
  File "<https://ci.trafficserver.apache.org/job/tsqa-master/ws/src/ci/tsqa/virtualenv/lib/python2.7/site-packages/nose/suite.py",> line 292, in setUp
    self.setupContext(ancestor)
  File "<https://ci.trafficserver.apache.org/job/tsqa-master/ws/src/ci/tsqa/virtualenv/lib/python2.7/site-packages/nose/suite.py",> line 315, in setupContext
    try_run(context, names)
  File "<https://ci.trafficserver.apache.org/job/tsqa-master/ws/src/ci/tsqa/virtualenv/lib/python2.7/site-packages/nose/util.py",> line 471, in try_run
    return func()
  File "<https://ci.trafficserver.apache.org/job/tsqa-master/ws/src/ci/tsqa/virtualenv/lib/python2.7/site-packages/tsqa/test_cases.py",> line 80, in setUpClass
    cls.setUpEnv(cls.environment)
  File "<https://ci.trafficserver.apache.org/job/tsqa-master/ws/src/ci/tsqa/tests/test_http2.py",> line 61, in setUpEnv
    hyper.tls._context = hyper.tls.init_context()
NameError: global name 'hyper' is not defined
-------------------- >> begin captured logging << --------------------
root: INFO: Environment prefix is /tmp/tsqa.env.xijjOg
root: INFO: Environment prefix is /tmp/tsqa.env.KJQc48
--------------------- >> end captured logging << ---------------------

======================================================================
FAIL: Verify that we get 504s from origins that return a partial_response
----------------------------------------------------------------------
Traceback (most recent call last):
  File "<https://ci.trafficserver.apache.org/job/tsqa-master/ws/src/ci/tsqa/tests/test_connect_attempts.py",> line 195, in test_partial_response_origin
    self.assertEqual(ret.status_code, 502)
AssertionError: 200 != 502

======================================================================
FAIL: Verify that we get 200s from origins that reset_after_accept
----------------------------------------------------------------------
Traceback (most recent call last):
  File "<https://ci.trafficserver.apache.org/job/tsqa-master/ws/src/ci/tsqa/tests/test_connect_attempts.py",> line 201, in test_reset_after_accept_origin
    self.assertEqual(ret.status_code, 200)
AssertionError: 502 != 200

======================================================================
FAIL: test_logs_exist (test_example.TestLogRefCounting)
----------------------------------------------------------------------
Traceback (most recent call last):
  File "<https://ci.trafficserver.apache.org/job/tsqa-master/ws/src/ci/tsqa/tests/test_example.py",> line 215, in test_logs_exist
    self.assertTrue(os.path.isfile(logfile_path), logfile_path)
AssertionError: /tmp/tsqa.env.bit7WA/var/log/squid.log
-------------------- >> begin captured logging << --------------------
root: INFO: Environment prefix is /tmp/tsqa.env.bit7WA
--------------------- >> end captured logging << ---------------------

----------------------------------------------------------------------
XML: <https://ci.trafficserver.apache.org/job/tsqa-master/ws/src/ci/tsqa/nosetests.xml>
----------------------------------------------------------------------
Ran 83 tests in 949.305s

FAILED (SKIP=6, errors=1, failures=3)
1
make: *** [test] Error 1
Build step 'Execute shell' marked build as failure
Recording test results

Build failed in Jenkins: tsqa-master #821

Posted by je...@ci.trafficserver.apache.org.
See <https://ci.trafficserver.apache.org/job/tsqa-master/821/changes>

Changes:

[Sudheer Vinukonda] TS-3740: header_rewrite set-redirect enhancement.

------------------------------------------
[...truncated 530 lines...]
127.0.0.1 - - [28/Aug/2015 23:20:20] "GET / HTTP/1.1" 200 5
127.0.0.1 - - [28/Aug/2015 23:20:20] "GET / HTTP/1.1" 200 5
127.0.0.1 - - [28/Aug/2015 23:20:20] "GET / HTTP/1.1" 200 5
127.0.0.1 - - [28/Aug/2015 23:20:20] "GET / HTTP/1.1" 200 5
127.0.0.1 - - [28/Aug/2015 23:20:20] "GET / HTTP/1.1" 200 5
127.0.0.1 - - [28/Aug/2015 23:20:20] "GET / HTTP/1.1" 200 5
127.0.0.1 - - [28/Aug/2015 23:20:20] "GET / HTTP/1.1" 200 5
127.0.0.1 - - [28/Aug/2015 23:20:20] "GET / HTTP/1.1" 200 5
ok
INFO 2015-08-28 23:20:20,787 - Environment prefix is /tmp/tsqa.env.IMPAxP
INFO 2015-08-28 23:20:20,790 - map / http://127.0.0.1:53012/
test_head_request_without_timout (test_headrequest.TestHeadRequestWithoutTimeout) ... INFO 2015-08-28 23:20:24,029 - HTTP/1.1 200 OK
Server: ATS/6.1.0
Vary: Accept-Encoding
Date: Fri, 28 Aug 2015 23:20:24 GMT
Age: 0
Connection: close


INFO 2015-08-28 23:20:24,030 - head request with case(TE) costs 0.006190 seconds while the timout is 5.000000 seconds.
INFO 2015-08-28 23:20:24,031 - HTTP/1.1 200 OK
Server: ATS/6.1.0
Content-Length: 123
Vary: Accept-Encoding
Date: Fri, 28 Aug 2015 23:20:24 GMT
Age: 0
Connection: close


INFO 2015-08-28 23:20:24,031 - head request with case(CL) costs 0.001178 seconds while the timout is 5.000000 seconds.
INFO 2015-08-28 23:20:24,048 - HTTP/1.1 200 OK
Server: ATS/6.1.0
Vary: Accept-Encoding
Date: Fri, 28 Aug 2015 23:20:24 GMT
Age: 0
Connection: close


INFO 2015-08-28 23:20:24,048 - head request with case() costs 0.017252 seconds while the timout is 5.000000 seconds.
ok
INFO 2015-08-28 23:20:24,230 - Environment prefix is /tmp/tsqa.env.Lplow8
test_working (test_hostdb.TestHostDBBadResolvConf) ... ok
INFO 2015-08-28 23:20:27,777 - Environment prefix is /tmp/tsqa.env.GnZoqq
test_lookup_timeout (test_hostdb.TestHostDBFailedDNS) ... ok
INFO 2015-08-28 23:20:33,209 - Environment prefix is /tmp/tsqa.env.sJVVCU
Test basic fnctionality of hosts files ... ok
Test that changes to hosts file get loaded within host_file.interval ... ok
INFO 2015-08-28 23:20:42,778 - Environment prefix is /tmp/tsqa.env.oheY__
SKIP: 
-------------------- >> begin captured logging << --------------------
root: INFO: Environment prefix is /tmp/tsqa.env.oheY__
--------------------- >> end captured logging << ---------------------
INFO 2015-08-28 23:20:42,858 - Environment prefix is /tmp/tsqa.env.TqMxch
ERROR
INFO 2015-08-28 23:20:42,954 - Environment prefix is /tmp/tsqa.env.zz0q5y
test_ecdsa (test_https.TestECDSA) ... ok
test_intermediate_ca_ecdsa (test_https.TestECDSA) ... ok
test_intermediate_ca_rsa (test_https.TestECDSA) ... ok
We should be served the first match, since we aren't sending SNI headers ... ok
Make sure we get the certificate we asked for if we pass in SNI headers ... ok
test_rsa (test_https.TestECDSA) ... ok
We should be served the first match, since we aren't sending SNI headers ... ok
Make sure we get the certificate we asked for if we pass in SNI headers ... ok
INFO 2015-08-28 23:20:46,458 - Environment prefix is /tmp/tsqa.env.8zc1Qs
test_ecdsa (test_https.TestMix) ... ok
test_intermediate_ca_ecdsa (test_https.TestMix) ... ok
test_intermediate_ca_rsa (test_https.TestMix) ... ok
We should be served the first match, since we aren't sending SNI headers ... ok
Make sure we get the certificate we asked for if we pass in SNI headers ... ok
test_rsa (test_https.TestMix) ... ok
We should be served the first match, since we aren't sending SNI headers ... ok
Make sure we get the certificate we asked for if we pass in SNI headers ... ok
INFO 2015-08-28 23:20:50,000 - Environment prefix is /tmp/tsqa.env.jLo_m7
test_ecdsa (test_https.TestRSA) ... ok
test_intermediate_ca_ecdsa (test_https.TestRSA) ... ok
test_intermediate_ca_rsa (test_https.TestRSA) ... ok
We should be served the first match, since we aren't sending SNI headers ... ok
Make sure we get the certificate we asked for if we pass in SNI headers ... ok
test_rsa (test_https.TestRSA) ... ok
We should be served the first match, since we aren't sending SNI headers ... ok
Make sure we get the certificate we asked for if we pass in SNI headers ... ok
INFO 2015-08-28 23:20:53,595 - Environment prefix is /tmp/tsqa.env.1TOUE5
test_error_path (test_keepalive.TestKeepAliveInHTTP) ... ok
Ensure that sending a request with a body doesn't break the keepalive session ... ok
test_working_path (test_keepalive.TestKeepAliveInHTTP) ... 127.0.0.1 - - [28/Aug/2015 23:20:56] "GET /exists/ HTTP/1.1" 200 5
127.0.0.1 - - [28/Aug/2015 23:20:56] "GET /exists/ HTTP/1.1" 200 5
127.0.0.1 - - [28/Aug/2015 23:20:56] "GET /exists/ HTTP/1.1" 200 5
127.0.0.1 - - [28/Aug/2015 23:20:56] "GET /exists/ HTTP/1.1" 200 5
127.0.0.1 - - [28/Aug/2015 23:20:56] "GET /exists/ HTTP/1.1" 200 5
127.0.0.1 - - [28/Aug/2015 23:20:56] "GET /exists/ HTTP/1.1" 200 5
127.0.0.1 - - [28/Aug/2015 23:20:56] "GET /exists/ HTTP/1.1" 200 5
127.0.0.1 - - [28/Aug/2015 23:20:56] "GET /exists/ HTTP/1.1" 200 5
127.0.0.1 - - [28/Aug/2015 23:20:56] "GET /exists/ HTTP/1.1" 200 5
ok
INFO 2015-08-28 23:20:57,050 - Environment prefix is /tmp/tsqa.env.6331B7
Tests that origin_min_keep_alive_connections is honored via http. ... ok
INFO 2015-08-28 23:21:03,464 - Environment prefix is /tmp/tsqa.env.R990qd
Tests that origin_min_keep_alive_connections is honored via https. ... ok
INFO 2015-08-28 23:21:09,907 - Environment prefix is /tmp/tsqa.env.l_bNfQ
Test that the origin does in fact support keepalive via http. ... ok
Tests that keepalive works through ATS to origin via http. ... ok
Tests that origin does not timeout using keepalive via http. ... ok
Tests that keepalive timeout is honored through ATS to origin via http. ... ok
INFO 2015-08-28 23:21:31,394 - Environment prefix is /tmp/tsqa.env.688_GQ
Test that the origin does in fact support keepalive via https. ... ok
Tests that keepalive works through ATS to origin via https. ... ok
Tests that origin does not timeout using keepalive via https. ... ok
Tests that keepalive timeout is honored through ATS to origin via https. ... ok
INFO 2015-08-28 23:21:52,879 - Environment prefix is /tmp/tsqa.env.Z9omng
Tests that keepalive works through ATS to origin via https. ... ok
Tests that keepalive works through ATS to origin via https. ... ok
INFO 2015-08-28 23:21:56,328 - Environment prefix is /tmp/tsqa.env.yF2urr
Tests that keepalive works through ATS to origin via https. ... ok
Tests that keepalive works through ATS to origin via https. ... ok
INFO 2015-08-28 23:21:59,766 - Environment prefix is /tmp/tsqa.env.qJIVnz
INFO 2015-08-28 23:21:59,768 - socket_server_port = 58089
INFO 2015-08-28 23:21:59,768 - starting the socket server
test_origin_min_connection (test_origin_min_keep_alive_connection.TestKeepAlive_Origin_Min_connections) ... INFO 2015-08-28 23:22:03,009 - Sending data back to the client: 7dcfc513ae9240eba6d6df1af7d3f48f
INFO 2015-08-28 23:22:03,010 - 7dcfc513ae9240eba6d6df1af7d3f48f
INFO 2015-08-28 23:22:08,018 - Sending data back to the client: 7dcfc513ae9240eba6d6df1af7d3f48f
INFO 2015-08-28 23:22:08,027 - 7dcfc513ae9240eba6d6df1af7d3f48f
ok
INFO 2015-08-28 23:22:08,207 - Environment prefix is /tmp/tsqa.env.Osh2es
test_redirection (test_redirection.TestRedirection) ... 127.0.0.1 - - [28/Aug/2015 23:22:11] "GET /redirect/9 HTTP/1.1" 302 229
127.0.0.1 - - [28/Aug/2015 23:22:11] "GET /redirect/8 HTTP/1.1" 302 229
127.0.0.1 - - [28/Aug/2015 23:22:11] "GET /redirect/7 HTTP/1.1" 302 229
127.0.0.1 - - [28/Aug/2015 23:22:11] "GET /redirect/6 HTTP/1.1" 302 229
127.0.0.1 - - [28/Aug/2015 23:22:11] "GET /redirect/5 HTTP/1.1" 302 229
127.0.0.1 - - [28/Aug/2015 23:22:11] "GET /redirect/4 HTTP/1.1" 302 229
127.0.0.1 - - [28/Aug/2015 23:22:11] "GET /redirect/3 HTTP/1.1" 302 229
127.0.0.1 - - [28/Aug/2015 23:22:11] "GET /redirect/2 HTTP/1.1" 302 229
127.0.0.1 - - [28/Aug/2015 23:22:11] "GET /redirect/1 HTTP/1.1" 302 215
127.0.0.1 - - [28/Aug/2015 23:22:11] "GET /get HTTP/1.1" 200 437
127.0.0.1 - - [28/Aug/2015 23:22:11] "GET /redirect/10 HTTP/1.1" 302 229
127.0.0.1 - - [28/Aug/2015 23:22:11] "GET /redirect/9 HTTP/1.1" 302 229
127.0.0.1 - - [28/Aug/2015 23:22:11] "GET /redirect/8 HTTP/1.1" 302 229
127.0.0.1 - - [28/Aug/2015 23:22:11] "GET /redirect/7 HTTP/1.1" 302 229
127.0.0.1 - - [28/Aug/2015 23:22:11] "GET /redirect/6 HTTP/1.1" 302 229
127.0.0.1 - - [28/Aug/2015 23:22:11] "GET /redirect/5 HTTP/1.1" 302 229
127.0.0.1 - - [28/Aug/2015 23:22:11] "GET /redirect/4 HTTP/1.1" 302 229
127.0.0.1 - - [28/Aug/2015 23:22:11] "GET /redirect/3 HTTP/1.1" 302 229
127.0.0.1 - - [28/Aug/2015 23:22:11] "GET /redirect/2 HTTP/1.1" 302 229
127.0.0.1 - - [28/Aug/2015 23:22:11] "GET /redirect/1 HTTP/1.1" 302 215
ok
INFO 2015-08-28 23:22:11,677 - Environment prefix is /tmp/tsqa.env.8yJoD_
test_regressions (test_regressions.TestRegressions) ... ok
INFO 2015-08-28 23:24:45,137 - Starting build (d133993325226bee52737bbab4e1cbc1): configure {'enable-ccache': None, 'enable-experimental-plugins': None, 'enable-example-plugins': None, 'enable-test-tools': None, 'enable-linux-native-aio': None, 'disable-dependency-tracking': None}
SKIP: Error 1 running: ['<https://ci.trafficserver.apache.org/job/tsqa-master/ws/src/configure',> '--prefix=/', '--enable-ccache', '--enable-experimental-plugins', '--enable-example-plugins', '--enable-test-tools', '--enable-linux-native-aio', '--disable-dependency-tracking']
configure: error: Linux native AIO requires libaio.h

-------------------- >> begin captured logging << --------------------
tsqa.environment: INFO: Starting build (d133993325226bee52737bbab4e1cbc1): configure {'enable-ccache': None, 'enable-experimental-plugins': None, 'enable-example-plugins': None, 'enable-test-tools': None, 'enable-linux-native-aio': None, 'disable-dependency-tracking': None}
--------------------- >> end captured logging << ---------------------
INFO 2015-08-28 23:24:54,384 - Environment prefix is /tmp/tsqa.env.iJ0LxX
test_remap_http (test_remap.TestRemapHTTP) ... 127.0.0.1 - - [28/Aug/2015 23:24:57] "GET / HTTP/1.1" 200 5
127.0.0.1 - - [28/Aug/2015 23:24:57] "GET / HTTP/1.1" 200 5
127.0.0.1 - - [28/Aug/2015 23:24:57] "GET / HTTP/1.1" 200 5
ok
INFO 2015-08-28 23:24:57,817 - Environment prefix is /tmp/tsqa.env.UAmU9h
test_remap_https (test_remap.TestRemapHTTPS) ... 127.0.0.1 - - [28/Aug/2015 23:25:01] "GET / HTTP/1.1" 200 5
127.0.0.1 - - [28/Aug/2015 23:25:01] "GET / HTTP/1.1" 200 5
127.0.0.1 - - [28/Aug/2015 23:25:01] "GET / HTTP/1.1" 200 5
ok
SKIP: Skipping spdy/2 tests
INFO 2015-08-28 23:25:01,266 - Environment prefix is /tmp/tsqa.env.LSlSpS
INFO 2015-08-28 23:25:01,268 - spdycat path = /usr/local/bin/spdycat
INFO 2015-08-28 23:25:01,269 - spdy server port = 42780
INFO 2015-08-28 23:25:01,269 - http server port = 60852
Test that the origin does in fact support spdy 3 ... INFO 2015-08-28 23:25:04,498 - full args = ['/usr/local/bin/spdycat', 'https://localhost:42780/', '-nv', '--spdy3']
ok
Test that non spdy port won't advertise spdy ... INFO 2015-08-28 23:25:05,623 - full args = ['/usr/local/bin/spdycat', 'https://localhost:60852/', '-nv', '--spdy3']
Fatal: EOF
reqnum=1, completed=0
Some requests were not processed. total=1, processed=0
ok
INFO 2015-08-28 23:25:05,821 - Environment prefix is /tmp/tsqa.env.QCdmkk
INFO 2015-08-28 23:25:05,823 - spdycat path = /usr/local/bin/spdycat
INFO 2015-08-28 23:25:05,823 - spdy server port = 45298
INFO 2015-08-28 23:25:05,823 - http server port = 43318
Test that the origin does in fact support spdy 3.1 ... INFO 2015-08-28 23:25:08,972 - full args = ['/usr/local/bin/spdycat', 'https://localhost:45298/', '-nv', '--spdy3-1']
ok
Test that non spdy port won't advertise spdy ... INFO 2015-08-28 23:25:10,184 - full args = ['/usr/local/bin/spdycat', 'https://localhost:43318/', '-nv', '--spdy3-1']
Fatal: EOF
reqnum=1, completed=0
Some requests were not processed. total=1, processed=0
ok
INFO 2015-08-28 23:25:10,386 - Environment prefix is /tmp/tsqa.env.gyW13O
Make sure the new ticket key is loaded ... ok
Make sure the new ticket key is loaded ... ok

======================================================================
ERROR: test suite for <class 'test_http2.TestHTTP2'>
----------------------------------------------------------------------
Traceback (most recent call last):
  File "<https://ci.trafficserver.apache.org/job/tsqa-master/ws/src/ci/tsqa/virtualenv/lib/python2.7/site-packages/nose/suite.py",> line 209, in run
    self.setUp()
  File "<https://ci.trafficserver.apache.org/job/tsqa-master/ws/src/ci/tsqa/virtualenv/lib/python2.7/site-packages/nose/suite.py",> line 292, in setUp
    self.setupContext(ancestor)
  File "<https://ci.trafficserver.apache.org/job/tsqa-master/ws/src/ci/tsqa/virtualenv/lib/python2.7/site-packages/nose/suite.py",> line 315, in setupContext
    try_run(context, names)
  File "<https://ci.trafficserver.apache.org/job/tsqa-master/ws/src/ci/tsqa/virtualenv/lib/python2.7/site-packages/nose/util.py",> line 471, in try_run
    return func()
  File "<https://ci.trafficserver.apache.org/job/tsqa-master/ws/src/ci/tsqa/virtualenv/lib/python2.7/site-packages/tsqa/test_cases.py",> line 80, in setUpClass
    cls.setUpEnv(cls.environment)
  File "<https://ci.trafficserver.apache.org/job/tsqa-master/ws/src/ci/tsqa/tests/test_http2.py",> line 61, in setUpEnv
    hyper.tls._context = hyper.tls.init_context()
NameError: global name 'hyper' is not defined
-------------------- >> begin captured logging << --------------------
root: INFO: Environment prefix is /tmp/tsqa.env.oheY__
root: INFO: Environment prefix is /tmp/tsqa.env.TqMxch
--------------------- >> end captured logging << ---------------------

======================================================================
FAIL: Verify that we get 504s from origins that return a partial_response
----------------------------------------------------------------------
Traceback (most recent call last):
  File "<https://ci.trafficserver.apache.org/job/tsqa-master/ws/src/ci/tsqa/tests/test_connect_attempts.py",> line 195, in test_partial_response_origin
    self.assertEqual(ret.status_code, 502)
AssertionError: 200 != 502

======================================================================
FAIL: Verify that we get 200s from origins that reset_after_accept
----------------------------------------------------------------------
Traceback (most recent call last):
  File "<https://ci.trafficserver.apache.org/job/tsqa-master/ws/src/ci/tsqa/tests/test_connect_attempts.py",> line 201, in test_reset_after_accept_origin
    self.assertEqual(ret.status_code, 200)
AssertionError: 502 != 200

======================================================================
FAIL: test_logs_exist (test_example.TestLogRefCounting)
----------------------------------------------------------------------
Traceback (most recent call last):
  File "<https://ci.trafficserver.apache.org/job/tsqa-master/ws/src/ci/tsqa/tests/test_example.py",> line 215, in test_logs_exist
    self.assertTrue(os.path.isfile(logfile_path), logfile_path)
AssertionError: /tmp/tsqa.env.i7hb_o/var/log/squid.log
-------------------- >> begin captured logging << --------------------
root: INFO: Environment prefix is /tmp/tsqa.env.i7hb_o
--------------------- >> end captured logging << ---------------------

----------------------------------------------------------------------
XML: <https://ci.trafficserver.apache.org/job/tsqa-master/ws/src/ci/tsqa/nosetests.xml>
----------------------------------------------------------------------
Ran 83 tests in 941.701s

FAILED (SKIP=6, errors=1, failures=3)
2
make: *** [test] Error 1
Build step 'Execute shell' marked build as failure
Recording test results

Build failed in Jenkins: tsqa-master #820

Posted by je...@ci.trafficserver.apache.org.
See <https://ci.trafficserver.apache.org/job/tsqa-master/820/changes>

Changes:

[Thomas Jackson] Comment out invalid requirements def which is causing tsqa to fail builds

------------------------------------------
[...truncated 544 lines...]
Vary: Accept-Encoding
Date: Fri, 28 Aug 2015 21:34:12 GMT
Age: 0
Connection: close


INFO 2015-08-28 21:34:12,866 - head request with case(TE) costs 0.002430 seconds while the timout is 5.000000 seconds.
INFO 2015-08-28 21:34:12,872 - HTTP/1.1 200 OK
Server: ATS/6.1.0
Content-Length: 123
Vary: Accept-Encoding
Date: Fri, 28 Aug 2015 21:34:12 GMT
Age: 0
Connection: close


INFO 2015-08-28 21:34:12,872 - head request with case(CL) costs 0.005919 seconds while the timout is 5.000000 seconds.
INFO 2015-08-28 21:34:12,891 - HTTP/1.1 200 OK
Server: ATS/6.1.0
Vary: Accept-Encoding
Date: Fri, 28 Aug 2015 21:34:12 GMT
Age: 0
Connection: close


INFO 2015-08-28 21:34:12,891 - head request with case() costs 0.018684 seconds while the timout is 5.000000 seconds.
ok
INFO 2015-08-28 21:34:13,074 - Environment prefix is /tmp/tsqa.env.N2kEFb
test_working (test_hostdb.TestHostDBBadResolvConf) ... ok
INFO 2015-08-28 21:34:16,539 - Environment prefix is /tmp/tsqa.env.XPk9xp
test_lookup_timeout (test_hostdb.TestHostDBFailedDNS) ... ok
INFO 2015-08-28 21:34:21,970 - Environment prefix is /tmp/tsqa.env.PkQ9Yt
Test basic fnctionality of hosts files ... ok
Test that changes to hosts file get loaded within host_file.interval ... ok
INFO 2015-08-28 21:34:31,467 - Environment prefix is /tmp/tsqa.env.IatOxa
SKIP: 
-------------------- >> begin captured logging << --------------------
root: INFO: Environment prefix is /tmp/tsqa.env.IatOxa
--------------------- >> end captured logging << ---------------------
INFO 2015-08-28 21:34:31,552 - Environment prefix is /tmp/tsqa.env.kkw1yR
ERROR
INFO 2015-08-28 21:34:31,662 - Environment prefix is /tmp/tsqa.env.f1geks
test_ecdsa (test_https.TestECDSA) ... ok
test_intermediate_ca_ecdsa (test_https.TestECDSA) ... ok
test_intermediate_ca_rsa (test_https.TestECDSA) ... ok
We should be served the first match, since we aren't sending SNI headers ... ok
Make sure we get the certificate we asked for if we pass in SNI headers ... ok
test_rsa (test_https.TestECDSA) ... ok
We should be served the first match, since we aren't sending SNI headers ... ok
Make sure we get the certificate we asked for if we pass in SNI headers ... ok
INFO 2015-08-28 21:34:35,206 - Environment prefix is /tmp/tsqa.env.2QS51D
test_ecdsa (test_https.TestMix) ... ok
test_intermediate_ca_ecdsa (test_https.TestMix) ... ok
test_intermediate_ca_rsa (test_https.TestMix) ... ok
We should be served the first match, since we aren't sending SNI headers ... ok
Make sure we get the certificate we asked for if we pass in SNI headers ... ok
test_rsa (test_https.TestMix) ... ok
We should be served the first match, since we aren't sending SNI headers ... ok
Make sure we get the certificate we asked for if we pass in SNI headers ... ok
INFO 2015-08-28 21:34:38,847 - Environment prefix is /tmp/tsqa.env.YUNfTJ
test_ecdsa (test_https.TestRSA) ... ok
test_intermediate_ca_ecdsa (test_https.TestRSA) ... ok
test_intermediate_ca_rsa (test_https.TestRSA) ... ok
We should be served the first match, since we aren't sending SNI headers ... ok
Make sure we get the certificate we asked for if we pass in SNI headers ... ok
test_rsa (test_https.TestRSA) ... ok
We should be served the first match, since we aren't sending SNI headers ... ok
Make sure we get the certificate we asked for if we pass in SNI headers ... ok
INFO 2015-08-28 21:34:42,410 - Environment prefix is /tmp/tsqa.env.RWQNbo
test_error_path (test_keepalive.TestKeepAliveInHTTP) ... ok
Ensure that sending a request with a body doesn't break the keepalive session ... ok
test_working_path (test_keepalive.TestKeepAliveInHTTP) ... 127.0.0.1 - - [28/Aug/2015 21:34:45] "GET /exists/ HTTP/1.1" 200 5
127.0.0.1 - - [28/Aug/2015 21:34:45] "GET /exists/ HTTP/1.1" 200 5
127.0.0.1 - - [28/Aug/2015 21:34:45] "GET /exists/ HTTP/1.1" 200 5
127.0.0.1 - - [28/Aug/2015 21:34:45] "GET /exists/ HTTP/1.1" 200 5
127.0.0.1 - - [28/Aug/2015 21:34:45] "GET /exists/ HTTP/1.1" 200 5
127.0.0.1 - - [28/Aug/2015 21:34:45] "GET /exists/ HTTP/1.1" 200 5
127.0.0.1 - - [28/Aug/2015 21:34:45] "GET /exists/ HTTP/1.1" 200 5
127.0.0.1 - - [28/Aug/2015 21:34:45] "GET /exists/ HTTP/1.1" 200 5
127.0.0.1 - - [28/Aug/2015 21:34:45] "GET /exists/ HTTP/1.1" 200 5
ok
INFO 2015-08-28 21:34:45,870 - Environment prefix is /tmp/tsqa.env.QvYG59
Tests that origin_min_keep_alive_connections is honored via http. ... ok
INFO 2015-08-28 21:34:52,287 - Environment prefix is /tmp/tsqa.env.3lXV5C
Tests that origin_min_keep_alive_connections is honored via https. ... ok
INFO 2015-08-28 21:34:58,719 - Environment prefix is /tmp/tsqa.env.Pk9Bu8
Test that the origin does in fact support keepalive via http. ... ok
Tests that keepalive works through ATS to origin via http. ... ok
Tests that origin does not timeout using keepalive via http. ... ok
Tests that keepalive timeout is honored through ATS to origin via http. ... ok
INFO 2015-08-28 21:35:20,235 - Environment prefix is /tmp/tsqa.env.F2NMJr
Test that the origin does in fact support keepalive via https. ... ok
Tests that keepalive works through ATS to origin via https. ... ok
Tests that origin does not timeout using keepalive via https. ... ok
Tests that keepalive timeout is honored through ATS to origin via https. ... ok
INFO 2015-08-28 21:35:41,762 - Environment prefix is /tmp/tsqa.env.wSvV2s
Tests that keepalive works through ATS to origin via https. ... ok
Tests that keepalive works through ATS to origin via https. ... ok
INFO 2015-08-28 21:35:45,234 - Environment prefix is /tmp/tsqa.env.btPb82
Tests that keepalive works through ATS to origin via https. ... ok
Tests that keepalive works through ATS to origin via https. ... ok
INFO 2015-08-28 21:35:48,674 - Environment prefix is /tmp/tsqa.env.MNEy2l
INFO 2015-08-28 21:35:48,676 - socket_server_port = 46528
INFO 2015-08-28 21:35:48,676 - starting the socket server
test_origin_min_connection (test_origin_min_keep_alive_connection.TestKeepAlive_Origin_Min_connections) ... INFO 2015-08-28 21:35:51,905 - Sending data back to the client: 35c0fd9aa32e41c0ac1e6e1dd2b7ee10
INFO 2015-08-28 21:35:51,905 - 35c0fd9aa32e41c0ac1e6e1dd2b7ee10
INFO 2015-08-28 21:35:56,911 - Sending data back to the client: 35c0fd9aa32e41c0ac1e6e1dd2b7ee10
INFO 2015-08-28 21:35:56,911 - 35c0fd9aa32e41c0ac1e6e1dd2b7ee10
ok
INFO 2015-08-28 21:35:57,090 - Environment prefix is /tmp/tsqa.env.QNlhlq
test_redirection (test_redirection.TestRedirection) ... 127.0.0.1 - - [28/Aug/2015 21:36:00] "GET /redirect/9 HTTP/1.1" 302 229
127.0.0.1 - - [28/Aug/2015 21:36:00] "GET /redirect/8 HTTP/1.1" 302 229
127.0.0.1 - - [28/Aug/2015 21:36:00] "GET /redirect/7 HTTP/1.1" 302 229
127.0.0.1 - - [28/Aug/2015 21:36:00] "GET /redirect/6 HTTP/1.1" 302 229
127.0.0.1 - - [28/Aug/2015 21:36:00] "GET /redirect/5 HTTP/1.1" 302 229
127.0.0.1 - - [28/Aug/2015 21:36:00] "GET /redirect/4 HTTP/1.1" 302 229
127.0.0.1 - - [28/Aug/2015 21:36:00] "GET /redirect/3 HTTP/1.1" 302 229
127.0.0.1 - - [28/Aug/2015 21:36:00] "GET /redirect/2 HTTP/1.1" 302 229
127.0.0.1 - - [28/Aug/2015 21:36:00] "GET /redirect/1 HTTP/1.1" 302 215
127.0.0.1 - - [28/Aug/2015 21:36:00] "GET /get HTTP/1.1" 200 437
127.0.0.1 - - [28/Aug/2015 21:36:00] "GET /redirect/10 HTTP/1.1" 302 229
127.0.0.1 - - [28/Aug/2015 21:36:00] "GET /redirect/9 HTTP/1.1" 302 229
127.0.0.1 - - [28/Aug/2015 21:36:00] "GET /redirect/8 HTTP/1.1" 302 229
127.0.0.1 - - [28/Aug/2015 21:36:00] "GET /redirect/7 HTTP/1.1" 302 229
127.0.0.1 - - [28/Aug/2015 21:36:00] "GET /redirect/6 HTTP/1.1" 302 229
127.0.0.1 - - [28/Aug/2015 21:36:00] "GET /redirect/5 HTTP/1.1" 302 229
127.0.0.1 - - [28/Aug/2015 21:36:00] "GET /redirect/4 HTTP/1.1" 302 229
127.0.0.1 - - [28/Aug/2015 21:36:00] "GET /redirect/3 HTTP/1.1" 302 229
127.0.0.1 - - [28/Aug/2015 21:36:00] "GET /redirect/2 HTTP/1.1" 302 229
127.0.0.1 - - [28/Aug/2015 21:36:00] "GET /redirect/1 HTTP/1.1" 302 215
ok
INFO 2015-08-28 21:36:00,612 - Environment prefix is /tmp/tsqa.env.jQXUWr
test_regressions (test_regressions.TestRegressions) ... ERROR
INFO 2015-08-28 21:36:31,213 - Starting build (d133993325226bee52737bbab4e1cbc1): configure {'enable-ccache': None, 'enable-experimental-plugins': None, 'enable-example-plugins': None, 'enable-test-tools': None, 'enable-linux-native-aio': None, 'disable-dependency-tracking': None}
SKIP: Error 1 running: ['<https://ci.trafficserver.apache.org/job/tsqa-master/ws/src/configure',> '--prefix=/', '--enable-ccache', '--enable-experimental-plugins', '--enable-example-plugins', '--enable-test-tools', '--enable-linux-native-aio', '--disable-dependency-tracking']
configure: error: Linux native AIO requires libaio.h

-------------------- >> begin captured logging << --------------------
tsqa.environment: INFO: Starting build (d133993325226bee52737bbab4e1cbc1): configure {'enable-ccache': None, 'enable-experimental-plugins': None, 'enable-example-plugins': None, 'enable-test-tools': None, 'enable-linux-native-aio': None, 'disable-dependency-tracking': None}
--------------------- >> end captured logging << ---------------------
INFO 2015-08-28 21:36:40,457 - Environment prefix is /tmp/tsqa.env.JMyasc
test_remap_http (test_remap.TestRemapHTTP) ... 127.0.0.1 - - [28/Aug/2015 21:36:43] "GET / HTTP/1.1" 200 5
127.0.0.1 - - [28/Aug/2015 21:36:43] "GET / HTTP/1.1" 200 5
127.0.0.1 - - [28/Aug/2015 21:36:43] "GET / HTTP/1.1" 200 5
ok
INFO 2015-08-28 21:36:44,077 - Environment prefix is /tmp/tsqa.env.0F1Ygo
test_remap_https (test_remap.TestRemapHTTPS) ... 127.0.0.1 - - [28/Aug/2015 21:36:47] "GET / HTTP/1.1" 200 5
127.0.0.1 - - [28/Aug/2015 21:36:47] "GET / HTTP/1.1" 200 5
127.0.0.1 - - [28/Aug/2015 21:36:47] "GET / HTTP/1.1" 200 5
ok
SKIP: Skipping spdy/2 tests
INFO 2015-08-28 21:36:47,692 - Environment prefix is /tmp/tsqa.env.U1p3q2
INFO 2015-08-28 21:36:47,694 - spdycat path = /usr/local/bin/spdycat
INFO 2015-08-28 21:36:47,694 - spdy server port = 55678
INFO 2015-08-28 21:36:47,694 - http server port = 55428
Test that the origin does in fact support spdy 3 ... INFO 2015-08-28 21:36:51,004 - full args = ['/usr/local/bin/spdycat', 'https://localhost:55678/', '-nv', '--spdy3']
ok
Test that non spdy port won't advertise spdy ... INFO 2015-08-28 21:36:52,330 - full args = ['/usr/local/bin/spdycat', 'https://localhost:55428/', '-nv', '--spdy3']
Fatal: EOF
reqnum=1, completed=0
Some requests were not processed. total=1, processed=0
ok
INFO 2015-08-28 21:36:52,611 - Environment prefix is /tmp/tsqa.env.9Yy4Cl
INFO 2015-08-28 21:36:52,612 - spdycat path = /usr/local/bin/spdycat
INFO 2015-08-28 21:36:52,613 - spdy server port = 34366
INFO 2015-08-28 21:36:52,613 - http server port = 55609
Test that the origin does in fact support spdy 3.1 ... INFO 2015-08-28 21:36:55,874 - full args = ['/usr/local/bin/spdycat', 'https://localhost:34366/', '-nv', '--spdy3-1']
ok
Test that non spdy port won't advertise spdy ... INFO 2015-08-28 21:36:57,706 - full args = ['/usr/local/bin/spdycat', 'https://localhost:55609/', '-nv', '--spdy3-1']
Fatal: EOF
reqnum=1, completed=0
Some requests were not processed. total=1, processed=0
ok
INFO 2015-08-28 21:36:57,951 - Environment prefix is /tmp/tsqa.env.sxnhjK
Make sure the new ticket key is loaded ... ok
Make sure the new ticket key is loaded ... ok

======================================================================
ERROR: test suite for <class 'test_http2.TestHTTP2'>
----------------------------------------------------------------------
Traceback (most recent call last):
  File "<https://ci.trafficserver.apache.org/job/tsqa-master/ws/src/ci/tsqa/virtualenv/lib/python2.7/site-packages/nose/suite.py",> line 209, in run
    self.setUp()
  File "<https://ci.trafficserver.apache.org/job/tsqa-master/ws/src/ci/tsqa/virtualenv/lib/python2.7/site-packages/nose/suite.py",> line 292, in setUp
    self.setupContext(ancestor)
  File "<https://ci.trafficserver.apache.org/job/tsqa-master/ws/src/ci/tsqa/virtualenv/lib/python2.7/site-packages/nose/suite.py",> line 315, in setupContext
    try_run(context, names)
  File "<https://ci.trafficserver.apache.org/job/tsqa-master/ws/src/ci/tsqa/virtualenv/lib/python2.7/site-packages/nose/util.py",> line 471, in try_run
    return func()
  File "<https://ci.trafficserver.apache.org/job/tsqa-master/ws/src/ci/tsqa/virtualenv/lib/python2.7/site-packages/tsqa/test_cases.py",> line 80, in setUpClass
    cls.setUpEnv(cls.environment)
  File "<https://ci.trafficserver.apache.org/job/tsqa-master/ws/src/ci/tsqa/tests/test_http2.py",> line 61, in setUpEnv
    hyper.tls._context = hyper.tls.init_context()
NameError: global name 'hyper' is not defined
-------------------- >> begin captured logging << --------------------
root: INFO: Environment prefix is /tmp/tsqa.env.IatOxa
root: INFO: Environment prefix is /tmp/tsqa.env.kkw1yR
--------------------- >> end captured logging << ---------------------

======================================================================
ERROR: test_regressions (test_regressions.TestRegressions)
----------------------------------------------------------------------
Traceback (most recent call last):
  File "<https://ci.trafficserver.apache.org/job/tsqa-master/ws/src/ci/tsqa/tests/test_regressions.py",> line 53, in test_regressions
    tsqa.utils.run_sync_command(cmd, stdout=subprocess.PIPE, stderr=subprocess.STDOUT)
  File "<https://ci.trafficserver.apache.org/job/tsqa-master/ws/src/ci/tsqa/virtualenv/lib/python2.7/site-packages/tsqa/utils.py",> line 117, in run_sync_command
    raise Exception('Error {0} running: {1}'.format(p.returncode, args[0]))
Exception: Error 1 running: ['/tmp/tsqa.env.jQXUWr/bin/traffic_server', '-R', '1']
-------------------- >> begin captured logging << --------------------
root: INFO: Environment prefix is /tmp/tsqa.env.jQXUWr
--------------------- >> end captured logging << ---------------------

======================================================================
FAIL: Verify that we get 504s from origins that return a partial_response
----------------------------------------------------------------------
Traceback (most recent call last):
  File "<https://ci.trafficserver.apache.org/job/tsqa-master/ws/src/ci/tsqa/tests/test_connect_attempts.py",> line 195, in test_partial_response_origin
    self.assertEqual(ret.status_code, 502)
AssertionError: 200 != 502

======================================================================
FAIL: Verify that we get 200s from origins that reset_after_accept
----------------------------------------------------------------------
Traceback (most recent call last):
  File "<https://ci.trafficserver.apache.org/job/tsqa-master/ws/src/ci/tsqa/tests/test_connect_attempts.py",> line 201, in test_reset_after_accept_origin
    self.assertEqual(ret.status_code, 200)
AssertionError: 502 != 200

======================================================================
FAIL: test_logs_exist (test_example.TestLogRefCounting)
----------------------------------------------------------------------
Traceback (most recent call last):
  File "<https://ci.trafficserver.apache.org/job/tsqa-master/ws/src/ci/tsqa/tests/test_example.py",> line 215, in test_logs_exist
    self.assertTrue(os.path.isfile(logfile_path), logfile_path)
AssertionError: /tmp/tsqa.env.Te82Cz/var/log/squid.log
-------------------- >> begin captured logging << --------------------
root: INFO: Environment prefix is /tmp/tsqa.env.Te82Cz
--------------------- >> end captured logging << ---------------------

----------------------------------------------------------------------
XML: <https://ci.trafficserver.apache.org/job/tsqa-master/ws/src/ci/tsqa/nosetests.xml>
----------------------------------------------------------------------
Ran 83 tests in 1402.640s

FAILED (SKIP=6, errors=2, failures=3)
2
make: *** [test] Error 1
Build step 'Execute shell' marked build as failure
Recording test results

Build failed in Jenkins: tsqa-master #819

Posted by je...@ci.trafficserver.apache.org.
See <https://ci.trafficserver.apache.org/job/tsqa-master/819/changes>

Changes:

[Thomas Jackson] Test for empty resolv_conf

------------------------------------------
Started by upstream project "out_of_tree-master" build number 1121
originally caused by:
 Started by an SCM change
Started by upstream project "in_tree-master" build number 1340
originally caused by:
 Started by an SCM change
Building remotely on QA3 (qa) in workspace <https://ci.trafficserver.apache.org/job/tsqa-master/ws/>
 > /usr/bin/git rev-parse --is-inside-work-tree # timeout=10
Fetching changes from the remote Git repository
 > /usr/bin/git config remote.origin.url https://git-wip-us.apache.org/repos/asf/trafficserver.git # timeout=10
Cleaning workspace
 > /usr/bin/git rev-parse --verify HEAD # timeout=10
Resetting working tree
 > /usr/bin/git reset --hard # timeout=10
 > /usr/bin/git clean -fdx # timeout=10
Fetching upstream changes from https://git-wip-us.apache.org/repos/asf/trafficserver.git
 > /usr/bin/git --version # timeout=10
 > /usr/bin/git -c core.askpass=true fetch --tags --progress https://git-wip-us.apache.org/repos/asf/trafficserver.git +refs/heads/*:refs/remotes/origin/*
 > /usr/bin/git rev-parse refs/remotes/origin/master^{commit} # timeout=10
 > /usr/bin/git rev-parse refs/remotes/origin/origin/master^{commit} # timeout=10
Checking out Revision bbc4188ff21c83f91fb81b62501a5089e4b4f05f (refs/remotes/origin/master)
 > /usr/bin/git config core.sparsecheckout # timeout=10
 > /usr/bin/git checkout -f bbc4188ff21c83f91fb81b62501a5089e4b4f05f
 > /usr/bin/git rev-list 70409d22307a05d59be28be14e821b61361246bb # timeout=10
[tsqa-master] $ /bin/bash -xe /tmp/hudson1758480358656877780.sh
+ source /home/jenkins/bin/environment.sh
++ export ATS_SRC_HOME=/home/jenkins/src
++ ATS_SRC_HOME=/home/jenkins/src
++ test tsqa-master '!=' tsqa-master
++ ATS_MAKE=make
++ test tsqa-master '!=' tsqa-master
++ export ATS_MAKE
+++ /bin/date +%m%d%Y
++ export TODAY=08282015
++ TODAY=08282015
++ ATS_BRANCH=master
++ test tsqa-master '!=' tsqa-master
++ test tsqa-master '!=' tsqa-master
++ test tsqa-master '!=' tsqa-master
++ test tsqa-master '!=' tsqa-master
++ test tsqa-master '!=' tsqa-master
++ test tsqa-master '!=' tsqa-master
++ test tsqa-master '!=' tsqa-master
++ test tsqa-master '!=' tsqa-master
++ test tsqa-master '!=' tsqa-master
++ test tsqa-master '!=' tsqa-master
++ test tsqa-master '!=' tsqa-master
++ test tsqa-master '!=' tsqa-master
++ test tsqa-master '!=' tsqa-master
++ export ATS_BRANCH
++ test tsqa-master '!=' tsqa-master
+ source /home/jenkins/bin/tsqa.sh
++ TSQA_LAYOUT_DIR=<https://ci.trafficserver.apache.org/job/tsqa-master/ws/819>
++ cd <https://ci.trafficserver.apache.org/job/tsqa-master/ws/src/ci/tsqa>
++ make test
New python executable in virtualenv/bin/python
Installing Setuptools..............................................................................................................................................................................................................................done.
Installing Pip.....................................................................................................................................................................................................................................................................................................................................done.
make update
make[1]: Entering directory `<https://ci.trafficserver.apache.org/job/tsqa-master/ws/src/ci/tsqa'>
Exception:
Traceback (most recent call last):
  File "<https://ci.trafficserver.apache.org/job/tsqa-master/ws/src/ci/tsqa/virtualenv/lib/python2.7/site-packages/pip/basecommand.py",> line 134, in main
    status = self.run(options, args)
  File "<https://ci.trafficserver.apache.org/job/tsqa-master/ws/src/ci/tsqa/virtualenv/lib/python2.7/site-packages/pip/commands/install.py",> line 220, in run
    for req in parse_requirements(filename, finder=finder, options=options):
  File "<https://ci.trafficserver.apache.org/job/tsqa-master/ws/src/ci/tsqa/virtualenv/lib/python2.7/site-packages/pip/req.py",> line 1477, in parse_requirements
    req = InstallRequirement.from_line(line, comes_from, prereleases=getattr(options, "pre", None))
  File "<https://ci.trafficserver.apache.org/job/tsqa-master/ws/src/ci/tsqa/virtualenv/lib/python2.7/site-packages/pip/req.py",> line 129, in from_line
    return cls(req, comes_from, url=url, prereleases=prereleases)
  File "<https://ci.trafficserver.apache.org/job/tsqa-master/ws/src/ci/tsqa/virtualenv/lib/python2.7/site-packages/pip/req.py",> line 44, in __init__
    req = pkg_resources.Requirement.parse(req)
  File "<https://ci.trafficserver.apache.org/job/tsqa-master/ws/src/ci/tsqa/virtualenv/lib/python2.7/site-packages/pkg_resources.py",> line 2914, in parse
    reqs = list(parse_requirements(s))
  File "<https://ci.trafficserver.apache.org/job/tsqa-master/ws/src/ci/tsqa/virtualenv/lib/python2.7/site-packages/pkg_resources.py",> line 2839, in parse_requirements
    line, p, specs = scan_list(VERSION,LINE_END,line,p,(1,2),"version spec")
  File "<https://ci.trafficserver.apache.org/job/tsqa-master/ws/src/ci/tsqa/virtualenv/lib/python2.7/site-packages/pkg_resources.py",> line 2807, in scan_list
    raise ValueError("Expected "+item_name+" in",line,"at",line[p:])
ValueError: ('Expected version spec in', "hyper; python_version >= '2.7'", 'at', "; python_version >= '2.7'")

Storing complete log in /home/jenkins/.pip/pip.log
make[1]: *** [update] Error 2
make[1]: Leaving directory `<https://ci.trafficserver.apache.org/job/tsqa-master/ws/src/ci/tsqa'>
make: *** [virtualenv/.done] Error 2
Build step 'Execute shell' marked build as failure
Recording test results
ERROR: Publisher hudson.tasks.junit.JUnitResultArchiver aborted due to exception
hudson.AbortException: No test report files were found. Configuration error?
	at hudson.tasks.junit.JUnitParser$ParseResultCallable.invoke(JUnitParser.java:116)
	at hudson.tasks.junit.JUnitParser$ParseResultCallable.invoke(JUnitParser.java:93)
	at hudson.FilePath$FileCallableWrapper.call(FilePath.java:2688)
	at hudson.remoting.UserRequest.perform(UserRequest.java:121)
	at hudson.remoting.UserRequest.perform(UserRequest.java:49)
	at hudson.remoting.Request$2.run(Request.java:324)
	at hudson.remoting.InterceptingExecutorService$1.call(InterceptingExecutorService.java:68)
	at java.util.concurrent.FutureTask.run(FutureTask.java:262)
	at java.util.concurrent.ThreadPoolExecutor.runWorker(ThreadPoolExecutor.java:1145)
	at java.util.concurrent.ThreadPoolExecutor$Worker.run(ThreadPoolExecutor.java:615)
	at java.lang.Thread.run(Thread.java:745)
	at ......remote call to QA3(Native Method)
	at hudson.remoting.Channel.attachCallSiteStackTrace(Channel.java:1356)
	at hudson.remoting.UserResponse.retrieve(UserRequest.java:221)
	at hudson.remoting.Channel.call(Channel.java:752)
	at hudson.FilePath.act(FilePath.java:978)
	at hudson.FilePath.act(FilePath.java:967)
	at hudson.tasks.junit.JUnitParser.parseResult(JUnitParser.java:90)
	at hudson.tasks.junit.JUnitResultArchiver.parse(JUnitResultArchiver.java:120)
	at hudson.tasks.junit.JUnitResultArchiver.perform(JUnitResultArchiver.java:137)
	at hudson.tasks.BuildStepCompatibilityLayer.perform(BuildStepCompatibilityLayer.java:74)
	at hudson.tasks.BuildStepMonitor$1.perform(BuildStepMonitor.java:20)
	at hudson.model.AbstractBuild$AbstractBuildExecution.perform(AbstractBuild.java:761)
	at hudson.model.AbstractBuild$AbstractBuildExecution.performAllBuildSteps(AbstractBuild.java:721)
	at hudson.model.Build$BuildExecution.post2(Build.java:183)
	at hudson.model.AbstractBuild$AbstractBuildExecution.post(AbstractBuild.java:670)
	at hudson.model.Run.execute(Run.java:1775)
	at hudson.model.FreeStyleBuild.run(FreeStyleBuild.java:43)
	at hudson.model.ResourceController.execute(ResourceController.java:89)
	at hudson.model.Executor.run(Executor.java:240)

Build failed in Jenkins: tsqa-master #818

Posted by je...@ci.trafficserver.apache.org.
See <https://ci.trafficserver.apache.org/job/tsqa-master/818/changes>

Changes:

[James Peach] TS-3873: fix uninitialized return

------------------------------------------
Started by upstream project "out_of_tree-master" build number 1120
originally caused by:
 Started by an SCM change
Started by upstream project "in_tree-master" build number 1339
originally caused by:
 Started by an SCM change
Building remotely on QA3 (qa) in workspace <https://ci.trafficserver.apache.org/job/tsqa-master/ws/>
 > /usr/bin/git rev-parse --is-inside-work-tree # timeout=10
Fetching changes from the remote Git repository
 > /usr/bin/git config remote.origin.url https://git-wip-us.apache.org/repos/asf/trafficserver.git # timeout=10
Cleaning workspace
 > /usr/bin/git rev-parse --verify HEAD # timeout=10
Resetting working tree
 > /usr/bin/git reset --hard # timeout=10
 > /usr/bin/git clean -fdx # timeout=10
Fetching upstream changes from https://git-wip-us.apache.org/repos/asf/trafficserver.git
 > /usr/bin/git --version # timeout=10
 > /usr/bin/git -c core.askpass=true fetch --tags --progress https://git-wip-us.apache.org/repos/asf/trafficserver.git +refs/heads/*:refs/remotes/origin/*
 > /usr/bin/git rev-parse refs/remotes/origin/master^{commit} # timeout=10
 > /usr/bin/git rev-parse refs/remotes/origin/origin/master^{commit} # timeout=10
Checking out Revision 70409d22307a05d59be28be14e821b61361246bb (refs/remotes/origin/master)
 > /usr/bin/git config core.sparsecheckout # timeout=10
 > /usr/bin/git checkout -f 70409d22307a05d59be28be14e821b61361246bb
 > /usr/bin/git rev-list 4f2967e9fef7a44f2db7c9a551a3ce39fc9ae4b6 # timeout=10
[tsqa-master] $ /bin/bash -xe /tmp/hudson736384044720308147.sh
+ source /home/jenkins/bin/environment.sh
++ export ATS_SRC_HOME=/home/jenkins/src
++ ATS_SRC_HOME=/home/jenkins/src
++ test tsqa-master '!=' tsqa-master
++ ATS_MAKE=make
++ test tsqa-master '!=' tsqa-master
++ export ATS_MAKE
+++ /bin/date +%m%d%Y
++ export TODAY=08282015
++ TODAY=08282015
++ ATS_BRANCH=master
++ test tsqa-master '!=' tsqa-master
++ test tsqa-master '!=' tsqa-master
++ test tsqa-master '!=' tsqa-master
++ test tsqa-master '!=' tsqa-master
++ test tsqa-master '!=' tsqa-master
++ test tsqa-master '!=' tsqa-master
++ test tsqa-master '!=' tsqa-master
++ test tsqa-master '!=' tsqa-master
++ test tsqa-master '!=' tsqa-master
++ test tsqa-master '!=' tsqa-master
++ test tsqa-master '!=' tsqa-master
++ test tsqa-master '!=' tsqa-master
++ test tsqa-master '!=' tsqa-master
++ export ATS_BRANCH
++ test tsqa-master '!=' tsqa-master
+ source /home/jenkins/bin/tsqa.sh
++ TSQA_LAYOUT_DIR=<https://ci.trafficserver.apache.org/job/tsqa-master/ws/818>
++ cd <https://ci.trafficserver.apache.org/job/tsqa-master/ws/src/ci/tsqa>
++ make test
New python executable in virtualenv/bin/python
Installing Setuptools..............................................................................................................................................................................................................................done.
Installing Pip.....................................................................................................................................................................................................................................................................................................................................done.
make update
make[1]: Entering directory `<https://ci.trafficserver.apache.org/job/tsqa-master/ws/src/ci/tsqa'>
Exception:
Traceback (most recent call last):
  File "<https://ci.trafficserver.apache.org/job/tsqa-master/ws/src/ci/tsqa/virtualenv/lib/python2.7/site-packages/pip/basecommand.py",> line 134, in main
    status = self.run(options, args)
  File "<https://ci.trafficserver.apache.org/job/tsqa-master/ws/src/ci/tsqa/virtualenv/lib/python2.7/site-packages/pip/commands/install.py",> line 220, in run
    for req in parse_requirements(filename, finder=finder, options=options):
  File "<https://ci.trafficserver.apache.org/job/tsqa-master/ws/src/ci/tsqa/virtualenv/lib/python2.7/site-packages/pip/req.py",> line 1477, in parse_requirements
    req = InstallRequirement.from_line(line, comes_from, prereleases=getattr(options, "pre", None))
  File "<https://ci.trafficserver.apache.org/job/tsqa-master/ws/src/ci/tsqa/virtualenv/lib/python2.7/site-packages/pip/req.py",> line 129, in from_line
    return cls(req, comes_from, url=url, prereleases=prereleases)
  File "<https://ci.trafficserver.apache.org/job/tsqa-master/ws/src/ci/tsqa/virtualenv/lib/python2.7/site-packages/pip/req.py",> line 44, in __init__
    req = pkg_resources.Requirement.parse(req)
  File "<https://ci.trafficserver.apache.org/job/tsqa-master/ws/src/ci/tsqa/virtualenv/lib/python2.7/site-packages/pkg_resources.py",> line 2914, in parse
    reqs = list(parse_requirements(s))
  File "<https://ci.trafficserver.apache.org/job/tsqa-master/ws/src/ci/tsqa/virtualenv/lib/python2.7/site-packages/pkg_resources.py",> line 2839, in parse_requirements
    line, p, specs = scan_list(VERSION,LINE_END,line,p,(1,2),"version spec")
  File "<https://ci.trafficserver.apache.org/job/tsqa-master/ws/src/ci/tsqa/virtualenv/lib/python2.7/site-packages/pkg_resources.py",> line 2807, in scan_list
    raise ValueError("Expected "+item_name+" in",line,"at",line[p:])
ValueError: ('Expected version spec in', "hyper; python_version >= '2.7'", 'at', "; python_version >= '2.7'")

Storing complete log in /home/jenkins/.pip/pip.log
make[1]: *** [update] Error 2
make[1]: Leaving directory `<https://ci.trafficserver.apache.org/job/tsqa-master/ws/src/ci/tsqa'>
make: *** [virtualenv/.done] Error 2
Build step 'Execute shell' marked build as failure
Recording test results
ERROR: Publisher hudson.tasks.junit.JUnitResultArchiver aborted due to exception
hudson.AbortException: No test report files were found. Configuration error?
	at hudson.tasks.junit.JUnitParser$ParseResultCallable.invoke(JUnitParser.java:116)
	at hudson.tasks.junit.JUnitParser$ParseResultCallable.invoke(JUnitParser.java:93)
	at hudson.FilePath$FileCallableWrapper.call(FilePath.java:2688)
	at hudson.remoting.UserRequest.perform(UserRequest.java:121)
	at hudson.remoting.UserRequest.perform(UserRequest.java:49)
	at hudson.remoting.Request$2.run(Request.java:324)
	at hudson.remoting.InterceptingExecutorService$1.call(InterceptingExecutorService.java:68)
	at java.util.concurrent.FutureTask.run(FutureTask.java:262)
	at java.util.concurrent.ThreadPoolExecutor.runWorker(ThreadPoolExecutor.java:1145)
	at java.util.concurrent.ThreadPoolExecutor$Worker.run(ThreadPoolExecutor.java:615)
	at java.lang.Thread.run(Thread.java:745)
	at ......remote call to QA3(Native Method)
	at hudson.remoting.Channel.attachCallSiteStackTrace(Channel.java:1356)
	at hudson.remoting.UserResponse.retrieve(UserRequest.java:221)
	at hudson.remoting.Channel.call(Channel.java:752)
	at hudson.FilePath.act(FilePath.java:978)
	at hudson.FilePath.act(FilePath.java:967)
	at hudson.tasks.junit.JUnitParser.parseResult(JUnitParser.java:90)
	at hudson.tasks.junit.JUnitResultArchiver.parse(JUnitResultArchiver.java:120)
	at hudson.tasks.junit.JUnitResultArchiver.perform(JUnitResultArchiver.java:137)
	at hudson.tasks.BuildStepCompatibilityLayer.perform(BuildStepCompatibilityLayer.java:74)
	at hudson.tasks.BuildStepMonitor$1.perform(BuildStepMonitor.java:20)
	at hudson.model.AbstractBuild$AbstractBuildExecution.perform(AbstractBuild.java:761)
	at hudson.model.AbstractBuild$AbstractBuildExecution.performAllBuildSteps(AbstractBuild.java:721)
	at hudson.model.Build$BuildExecution.post2(Build.java:183)
	at hudson.model.AbstractBuild$AbstractBuildExecution.post(AbstractBuild.java:670)
	at hudson.model.Run.execute(Run.java:1775)
	at hudson.model.FreeStyleBuild.run(FreeStyleBuild.java:43)
	at hudson.model.ResourceController.execute(ResourceController.java:89)
	at hudson.model.Executor.run(Executor.java:240)

Build failed in Jenkins: tsqa-master #817

Posted by je...@ci.trafficserver.apache.org.
See <https://ci.trafficserver.apache.org/job/tsqa-master/817/changes>

Changes:

[James Peach] doc: refer to traffic_ctl instead of traffic_line

[Sudheer Vinukonda] [TS-3872] Minor doc fixup.

------------------------------------------
Started by upstream project "out_of_tree-master" build number 1119
originally caused by:
 Started by an SCM change
Started by upstream project "in_tree-master" build number 1338
originally caused by:
 Started by an SCM change
Building remotely on QA3 (qa) in workspace <https://ci.trafficserver.apache.org/job/tsqa-master/ws/>
 > /usr/bin/git rev-parse --is-inside-work-tree # timeout=10
Fetching changes from the remote Git repository
 > /usr/bin/git config remote.origin.url https://git-wip-us.apache.org/repos/asf/trafficserver.git # timeout=10
Cleaning workspace
 > /usr/bin/git rev-parse --verify HEAD # timeout=10
Resetting working tree
 > /usr/bin/git reset --hard # timeout=10
 > /usr/bin/git clean -fdx # timeout=10
Fetching upstream changes from https://git-wip-us.apache.org/repos/asf/trafficserver.git
 > /usr/bin/git --version # timeout=10
 > /usr/bin/git -c core.askpass=true fetch --tags --progress https://git-wip-us.apache.org/repos/asf/trafficserver.git +refs/heads/*:refs/remotes/origin/*
 > /usr/bin/git rev-parse refs/remotes/origin/master^{commit} # timeout=10
 > /usr/bin/git rev-parse refs/remotes/origin/origin/master^{commit} # timeout=10
Checking out Revision 4f2967e9fef7a44f2db7c9a551a3ce39fc9ae4b6 (refs/remotes/origin/master)
 > /usr/bin/git config core.sparsecheckout # timeout=10
 > /usr/bin/git checkout -f 4f2967e9fef7a44f2db7c9a551a3ce39fc9ae4b6
 > /usr/bin/git rev-list b1f81f8819b0624eff8e96a54ecdccbce9bcf7a9 # timeout=10
[tsqa-master] $ /bin/bash -xe /tmp/hudson4147068648784346045.sh
+ source /home/jenkins/bin/environment.sh
++ export ATS_SRC_HOME=/home/jenkins/src
++ ATS_SRC_HOME=/home/jenkins/src
++ test tsqa-master '!=' tsqa-master
++ ATS_MAKE=make
++ test tsqa-master '!=' tsqa-master
++ export ATS_MAKE
+++ /bin/date +%m%d%Y
++ export TODAY=08282015
++ TODAY=08282015
++ ATS_BRANCH=master
++ test tsqa-master '!=' tsqa-master
++ test tsqa-master '!=' tsqa-master
++ test tsqa-master '!=' tsqa-master
++ test tsqa-master '!=' tsqa-master
++ test tsqa-master '!=' tsqa-master
++ test tsqa-master '!=' tsqa-master
++ test tsqa-master '!=' tsqa-master
++ test tsqa-master '!=' tsqa-master
++ test tsqa-master '!=' tsqa-master
++ test tsqa-master '!=' tsqa-master
++ test tsqa-master '!=' tsqa-master
++ test tsqa-master '!=' tsqa-master
++ test tsqa-master '!=' tsqa-master
++ export ATS_BRANCH
++ test tsqa-master '!=' tsqa-master
+ source /home/jenkins/bin/tsqa.sh
++ TSQA_LAYOUT_DIR=<https://ci.trafficserver.apache.org/job/tsqa-master/ws/817>
++ cd <https://ci.trafficserver.apache.org/job/tsqa-master/ws/src/ci/tsqa>
++ make test
New python executable in virtualenv/bin/python
Installing Setuptools..............................................................................................................................................................................................................................done.
Installing Pip.....................................................................................................................................................................................................................................................................................................................................done.
make update
make[1]: Entering directory `<https://ci.trafficserver.apache.org/job/tsqa-master/ws/src/ci/tsqa'>
Exception:
Traceback (most recent call last):
  File "<https://ci.trafficserver.apache.org/job/tsqa-master/ws/src/ci/tsqa/virtualenv/lib/python2.7/site-packages/pip/basecommand.py",> line 134, in main
    status = self.run(options, args)
  File "<https://ci.trafficserver.apache.org/job/tsqa-master/ws/src/ci/tsqa/virtualenv/lib/python2.7/site-packages/pip/commands/install.py",> line 220, in run
    for req in parse_requirements(filename, finder=finder, options=options):
  File "<https://ci.trafficserver.apache.org/job/tsqa-master/ws/src/ci/tsqa/virtualenv/lib/python2.7/site-packages/pip/req.py",> line 1477, in parse_requirements
    req = InstallRequirement.from_line(line, comes_from, prereleases=getattr(options, "pre", None))
  File "<https://ci.trafficserver.apache.org/job/tsqa-master/ws/src/ci/tsqa/virtualenv/lib/python2.7/site-packages/pip/req.py",> line 129, in from_line
    return cls(req, comes_from, url=url, prereleases=prereleases)
  File "<https://ci.trafficserver.apache.org/job/tsqa-master/ws/src/ci/tsqa/virtualenv/lib/python2.7/site-packages/pip/req.py",> line 44, in __init__
    req = pkg_resources.Requirement.parse(req)
  File "<https://ci.trafficserver.apache.org/job/tsqa-master/ws/src/ci/tsqa/virtualenv/lib/python2.7/site-packages/pkg_resources.py",> line 2914, in parse
    reqs = list(parse_requirements(s))
  File "<https://ci.trafficserver.apache.org/job/tsqa-master/ws/src/ci/tsqa/virtualenv/lib/python2.7/site-packages/pkg_resources.py",> line 2839, in parse_requirements
    line, p, specs = scan_list(VERSION,LINE_END,line,p,(1,2),"version spec")
  File "<https://ci.trafficserver.apache.org/job/tsqa-master/ws/src/ci/tsqa/virtualenv/lib/python2.7/site-packages/pkg_resources.py",> line 2807, in scan_list
    raise ValueError("Expected "+item_name+" in",line,"at",line[p:])
ValueError: ('Expected version spec in', "hyper; python_version >= '2.7'", 'at', "; python_version >= '2.7'")

Storing complete log in /home/jenkins/.pip/pip.log
make[1]: *** [update] Error 2
make[1]: Leaving directory `<https://ci.trafficserver.apache.org/job/tsqa-master/ws/src/ci/tsqa'>
make: *** [virtualenv/.done] Error 2
Build step 'Execute shell' marked build as failure
Recording test results
ERROR: Publisher hudson.tasks.junit.JUnitResultArchiver aborted due to exception
hudson.AbortException: No test report files were found. Configuration error?
	at hudson.tasks.junit.JUnitParser$ParseResultCallable.invoke(JUnitParser.java:116)
	at hudson.tasks.junit.JUnitParser$ParseResultCallable.invoke(JUnitParser.java:93)
	at hudson.FilePath$FileCallableWrapper.call(FilePath.java:2688)
	at hudson.remoting.UserRequest.perform(UserRequest.java:121)
	at hudson.remoting.UserRequest.perform(UserRequest.java:49)
	at hudson.remoting.Request$2.run(Request.java:324)
	at hudson.remoting.InterceptingExecutorService$1.call(InterceptingExecutorService.java:68)
	at java.util.concurrent.FutureTask.run(FutureTask.java:262)
	at java.util.concurrent.ThreadPoolExecutor.runWorker(ThreadPoolExecutor.java:1145)
	at java.util.concurrent.ThreadPoolExecutor$Worker.run(ThreadPoolExecutor.java:615)
	at java.lang.Thread.run(Thread.java:745)
	at ......remote call to QA3(Native Method)
	at hudson.remoting.Channel.attachCallSiteStackTrace(Channel.java:1356)
	at hudson.remoting.UserResponse.retrieve(UserRequest.java:221)
	at hudson.remoting.Channel.call(Channel.java:752)
	at hudson.FilePath.act(FilePath.java:978)
	at hudson.FilePath.act(FilePath.java:967)
	at hudson.tasks.junit.JUnitParser.parseResult(JUnitParser.java:90)
	at hudson.tasks.junit.JUnitResultArchiver.parse(JUnitResultArchiver.java:120)
	at hudson.tasks.junit.JUnitResultArchiver.perform(JUnitResultArchiver.java:137)
	at hudson.tasks.BuildStepCompatibilityLayer.perform(BuildStepCompatibilityLayer.java:74)
	at hudson.tasks.BuildStepMonitor$1.perform(BuildStepMonitor.java:20)
	at hudson.model.AbstractBuild$AbstractBuildExecution.perform(AbstractBuild.java:761)
	at hudson.model.AbstractBuild$AbstractBuildExecution.performAllBuildSteps(AbstractBuild.java:721)
	at hudson.model.Build$BuildExecution.post2(Build.java:183)
	at hudson.model.AbstractBuild$AbstractBuildExecution.post(AbstractBuild.java:670)
	at hudson.model.Run.execute(Run.java:1775)
	at hudson.model.FreeStyleBuild.run(FreeStyleBuild.java:43)
	at hudson.model.ResourceController.execute(ResourceController.java:89)
	at hudson.model.Executor.run(Executor.java:240)

Build failed in Jenkins: tsqa-master #816

Posted by je...@ci.trafficserver.apache.org.
See <https://ci.trafficserver.apache.org/job/tsqa-master/816/changes>

Changes:

[Sudheer Vinukonda] Fix docs

[James Peach] TS-3815: traffic_ctl should separate config and metric records

[James Peach] TS-2861: add traffic_ctl config diff

[James Peach] TS-3818: add traffic_ctl config defaults subcommand

------------------------------------------
Started by upstream project "out_of_tree-master" build number 1118
originally caused by:
 Started by an SCM change
Started by upstream project "in_tree-master" build number 1337
originally caused by:
 Started by an SCM change
Building remotely on QA3 (qa) in workspace <https://ci.trafficserver.apache.org/job/tsqa-master/ws/>
 > /usr/bin/git rev-parse --is-inside-work-tree # timeout=10
Fetching changes from the remote Git repository
 > /usr/bin/git config remote.origin.url https://git-wip-us.apache.org/repos/asf/trafficserver.git # timeout=10
Cleaning workspace
 > /usr/bin/git rev-parse --verify HEAD # timeout=10
Resetting working tree
 > /usr/bin/git reset --hard # timeout=10
 > /usr/bin/git clean -fdx # timeout=10
Fetching upstream changes from https://git-wip-us.apache.org/repos/asf/trafficserver.git
 > /usr/bin/git --version # timeout=10
 > /usr/bin/git -c core.askpass=true fetch --tags --progress https://git-wip-us.apache.org/repos/asf/trafficserver.git +refs/heads/*:refs/remotes/origin/*
 > /usr/bin/git rev-parse refs/remotes/origin/master^{commit} # timeout=10
 > /usr/bin/git rev-parse refs/remotes/origin/origin/master^{commit} # timeout=10
Checking out Revision b1f81f8819b0624eff8e96a54ecdccbce9bcf7a9 (refs/remotes/origin/master)
 > /usr/bin/git config core.sparsecheckout # timeout=10
 > /usr/bin/git checkout -f b1f81f8819b0624eff8e96a54ecdccbce9bcf7a9
 > /usr/bin/git rev-list 5ff70404075283cd8996ea5ae46a3caf3298190d # timeout=10
[tsqa-master] $ /bin/bash -xe /tmp/hudson4823051061155448213.sh
+ source /home/jenkins/bin/environment.sh
++ export ATS_SRC_HOME=/home/jenkins/src
++ ATS_SRC_HOME=/home/jenkins/src
++ test tsqa-master '!=' tsqa-master
++ ATS_MAKE=make
++ test tsqa-master '!=' tsqa-master
++ export ATS_MAKE
+++ /bin/date +%m%d%Y
++ export TODAY=08282015
++ TODAY=08282015
++ ATS_BRANCH=master
++ test tsqa-master '!=' tsqa-master
++ test tsqa-master '!=' tsqa-master
++ test tsqa-master '!=' tsqa-master
++ test tsqa-master '!=' tsqa-master
++ test tsqa-master '!=' tsqa-master
++ test tsqa-master '!=' tsqa-master
++ test tsqa-master '!=' tsqa-master
++ test tsqa-master '!=' tsqa-master
++ test tsqa-master '!=' tsqa-master
++ test tsqa-master '!=' tsqa-master
++ test tsqa-master '!=' tsqa-master
++ test tsqa-master '!=' tsqa-master
++ test tsqa-master '!=' tsqa-master
++ export ATS_BRANCH
++ test tsqa-master '!=' tsqa-master
+ source /home/jenkins/bin/tsqa.sh
++ TSQA_LAYOUT_DIR=<https://ci.trafficserver.apache.org/job/tsqa-master/ws/816>
++ cd <https://ci.trafficserver.apache.org/job/tsqa-master/ws/src/ci/tsqa>
++ make test
New python executable in virtualenv/bin/python
Installing Setuptools..............................................................................................................................................................................................................................done.
Installing Pip.....................................................................................................................................................................................................................................................................................................................................done.
make update
make[1]: Entering directory `<https://ci.trafficserver.apache.org/job/tsqa-master/ws/src/ci/tsqa'>
Exception:
Traceback (most recent call last):
  File "<https://ci.trafficserver.apache.org/job/tsqa-master/ws/src/ci/tsqa/virtualenv/lib/python2.7/site-packages/pip/basecommand.py",> line 134, in main
    status = self.run(options, args)
  File "<https://ci.trafficserver.apache.org/job/tsqa-master/ws/src/ci/tsqa/virtualenv/lib/python2.7/site-packages/pip/commands/install.py",> line 220, in run
    for req in parse_requirements(filename, finder=finder, options=options):
  File "<https://ci.trafficserver.apache.org/job/tsqa-master/ws/src/ci/tsqa/virtualenv/lib/python2.7/site-packages/pip/req.py",> line 1477, in parse_requirements
    req = InstallRequirement.from_line(line, comes_from, prereleases=getattr(options, "pre", None))
  File "<https://ci.trafficserver.apache.org/job/tsqa-master/ws/src/ci/tsqa/virtualenv/lib/python2.7/site-packages/pip/req.py",> line 129, in from_line
    return cls(req, comes_from, url=url, prereleases=prereleases)
  File "<https://ci.trafficserver.apache.org/job/tsqa-master/ws/src/ci/tsqa/virtualenv/lib/python2.7/site-packages/pip/req.py",> line 44, in __init__
    req = pkg_resources.Requirement.parse(req)
  File "<https://ci.trafficserver.apache.org/job/tsqa-master/ws/src/ci/tsqa/virtualenv/lib/python2.7/site-packages/pkg_resources.py",> line 2914, in parse
    reqs = list(parse_requirements(s))
  File "<https://ci.trafficserver.apache.org/job/tsqa-master/ws/src/ci/tsqa/virtualenv/lib/python2.7/site-packages/pkg_resources.py",> line 2839, in parse_requirements
    line, p, specs = scan_list(VERSION,LINE_END,line,p,(1,2),"version spec")
  File "<https://ci.trafficserver.apache.org/job/tsqa-master/ws/src/ci/tsqa/virtualenv/lib/python2.7/site-packages/pkg_resources.py",> line 2807, in scan_list
    raise ValueError("Expected "+item_name+" in",line,"at",line[p:])
ValueError: ('Expected version spec in', "hyper; python_version >= '2.7'", 'at', "; python_version >= '2.7'")

Storing complete log in /home/jenkins/.pip/pip.log
make[1]: *** [update] Error 2
make[1]: Leaving directory `<https://ci.trafficserver.apache.org/job/tsqa-master/ws/src/ci/tsqa'>
make: *** [virtualenv/.done] Error 2
Build step 'Execute shell' marked build as failure
Recording test results
ERROR: Publisher hudson.tasks.junit.JUnitResultArchiver aborted due to exception
hudson.AbortException: No test report files were found. Configuration error?
	at hudson.tasks.junit.JUnitParser$ParseResultCallable.invoke(JUnitParser.java:116)
	at hudson.tasks.junit.JUnitParser$ParseResultCallable.invoke(JUnitParser.java:93)
	at hudson.FilePath$FileCallableWrapper.call(FilePath.java:2688)
	at hudson.remoting.UserRequest.perform(UserRequest.java:121)
	at hudson.remoting.UserRequest.perform(UserRequest.java:49)
	at hudson.remoting.Request$2.run(Request.java:324)
	at hudson.remoting.InterceptingExecutorService$1.call(InterceptingExecutorService.java:68)
	at java.util.concurrent.FutureTask.run(FutureTask.java:262)
	at java.util.concurrent.ThreadPoolExecutor.runWorker(ThreadPoolExecutor.java:1145)
	at java.util.concurrent.ThreadPoolExecutor$Worker.run(ThreadPoolExecutor.java:615)
	at java.lang.Thread.run(Thread.java:745)
	at ......remote call to QA3(Native Method)
	at hudson.remoting.Channel.attachCallSiteStackTrace(Channel.java:1356)
	at hudson.remoting.UserResponse.retrieve(UserRequest.java:221)
	at hudson.remoting.Channel.call(Channel.java:752)
	at hudson.FilePath.act(FilePath.java:978)
	at hudson.FilePath.act(FilePath.java:967)
	at hudson.tasks.junit.JUnitParser.parseResult(JUnitParser.java:90)
	at hudson.tasks.junit.JUnitResultArchiver.parse(JUnitResultArchiver.java:120)
	at hudson.tasks.junit.JUnitResultArchiver.perform(JUnitResultArchiver.java:137)
	at hudson.tasks.BuildStepCompatibilityLayer.perform(BuildStepCompatibilityLayer.java:74)
	at hudson.tasks.BuildStepMonitor$1.perform(BuildStepMonitor.java:20)
	at hudson.model.AbstractBuild$AbstractBuildExecution.perform(AbstractBuild.java:761)
	at hudson.model.AbstractBuild$AbstractBuildExecution.performAllBuildSteps(AbstractBuild.java:721)
	at hudson.model.Build$BuildExecution.post2(Build.java:183)
	at hudson.model.AbstractBuild$AbstractBuildExecution.post(AbstractBuild.java:670)
	at hudson.model.Run.execute(Run.java:1775)
	at hudson.model.FreeStyleBuild.run(FreeStyleBuild.java:43)
	at hudson.model.ResourceController.execute(ResourceController.java:89)
	at hudson.model.Executor.run(Executor.java:240)

Build failed in Jenkins: tsqa-master #815

Posted by je...@ci.trafficserver.apache.org.
See <https://ci.trafficserver.apache.org/job/tsqa-master/815/changes>

Changes:

[Sudheer Vinukonda] [TS-3869] clang format

------------------------------------------
Started by upstream project "out_of_tree-master" build number 1117
originally caused by:
 Started by an SCM change
Started by upstream project "in_tree-master" build number 1336
originally caused by:
 Started by an SCM change
Building remotely on QA3 (qa) in workspace <https://ci.trafficserver.apache.org/job/tsqa-master/ws/>
 > /usr/bin/git rev-parse --is-inside-work-tree # timeout=10
Fetching changes from the remote Git repository
 > /usr/bin/git config remote.origin.url https://git-wip-us.apache.org/repos/asf/trafficserver.git # timeout=10
Cleaning workspace
 > /usr/bin/git rev-parse --verify HEAD # timeout=10
Resetting working tree
 > /usr/bin/git reset --hard # timeout=10
 > /usr/bin/git clean -fdx # timeout=10
Fetching upstream changes from https://git-wip-us.apache.org/repos/asf/trafficserver.git
 > /usr/bin/git --version # timeout=10
 > /usr/bin/git -c core.askpass=true fetch --tags --progress https://git-wip-us.apache.org/repos/asf/trafficserver.git +refs/heads/*:refs/remotes/origin/*
 > /usr/bin/git rev-parse refs/remotes/origin/master^{commit} # timeout=10
 > /usr/bin/git rev-parse refs/remotes/origin/origin/master^{commit} # timeout=10
Checking out Revision 5ff70404075283cd8996ea5ae46a3caf3298190d (refs/remotes/origin/master)
 > /usr/bin/git config core.sparsecheckout # timeout=10
 > /usr/bin/git checkout -f 5ff70404075283cd8996ea5ae46a3caf3298190d
 > /usr/bin/git rev-list fc6037ef3f39b2e9551d86a3546c3013f35a791a # timeout=10
[tsqa-master] $ /bin/bash -xe /tmp/hudson1673283745715593254.sh
+ source /home/jenkins/bin/environment.sh
++ export ATS_SRC_HOME=/home/jenkins/src
++ ATS_SRC_HOME=/home/jenkins/src
++ test tsqa-master '!=' tsqa-master
++ ATS_MAKE=make
++ test tsqa-master '!=' tsqa-master
++ export ATS_MAKE
+++ /bin/date +%m%d%Y
++ export TODAY=08282015
++ TODAY=08282015
++ ATS_BRANCH=master
++ test tsqa-master '!=' tsqa-master
++ test tsqa-master '!=' tsqa-master
++ test tsqa-master '!=' tsqa-master
++ test tsqa-master '!=' tsqa-master
++ test tsqa-master '!=' tsqa-master
++ test tsqa-master '!=' tsqa-master
++ test tsqa-master '!=' tsqa-master
++ test tsqa-master '!=' tsqa-master
++ test tsqa-master '!=' tsqa-master
++ test tsqa-master '!=' tsqa-master
++ test tsqa-master '!=' tsqa-master
++ test tsqa-master '!=' tsqa-master
++ test tsqa-master '!=' tsqa-master
++ export ATS_BRANCH
++ test tsqa-master '!=' tsqa-master
+ source /home/jenkins/bin/tsqa.sh
++ TSQA_LAYOUT_DIR=<https://ci.trafficserver.apache.org/job/tsqa-master/ws/815>
++ cd <https://ci.trafficserver.apache.org/job/tsqa-master/ws/src/ci/tsqa>
++ make test
New python executable in virtualenv/bin/python
Installing Setuptools..............................................................................................................................................................................................................................done.
Installing Pip.....................................................................................................................................................................................................................................................................................................................................done.
make update
make[1]: Entering directory `<https://ci.trafficserver.apache.org/job/tsqa-master/ws/src/ci/tsqa'>
Exception:
Traceback (most recent call last):
  File "<https://ci.trafficserver.apache.org/job/tsqa-master/ws/src/ci/tsqa/virtualenv/lib/python2.7/site-packages/pip/basecommand.py",> line 134, in main
    status = self.run(options, args)
  File "<https://ci.trafficserver.apache.org/job/tsqa-master/ws/src/ci/tsqa/virtualenv/lib/python2.7/site-packages/pip/commands/install.py",> line 220, in run
    for req in parse_requirements(filename, finder=finder, options=options):
  File "<https://ci.trafficserver.apache.org/job/tsqa-master/ws/src/ci/tsqa/virtualenv/lib/python2.7/site-packages/pip/req.py",> line 1477, in parse_requirements
    req = InstallRequirement.from_line(line, comes_from, prereleases=getattr(options, "pre", None))
  File "<https://ci.trafficserver.apache.org/job/tsqa-master/ws/src/ci/tsqa/virtualenv/lib/python2.7/site-packages/pip/req.py",> line 129, in from_line
    return cls(req, comes_from, url=url, prereleases=prereleases)
  File "<https://ci.trafficserver.apache.org/job/tsqa-master/ws/src/ci/tsqa/virtualenv/lib/python2.7/site-packages/pip/req.py",> line 44, in __init__
    req = pkg_resources.Requirement.parse(req)
  File "<https://ci.trafficserver.apache.org/job/tsqa-master/ws/src/ci/tsqa/virtualenv/lib/python2.7/site-packages/pkg_resources.py",> line 2914, in parse
    reqs = list(parse_requirements(s))
  File "<https://ci.trafficserver.apache.org/job/tsqa-master/ws/src/ci/tsqa/virtualenv/lib/python2.7/site-packages/pkg_resources.py",> line 2839, in parse_requirements
    line, p, specs = scan_list(VERSION,LINE_END,line,p,(1,2),"version spec")
  File "<https://ci.trafficserver.apache.org/job/tsqa-master/ws/src/ci/tsqa/virtualenv/lib/python2.7/site-packages/pkg_resources.py",> line 2807, in scan_list
    raise ValueError("Expected "+item_name+" in",line,"at",line[p:])
ValueError: ('Expected version spec in', "hyper; python_version >= '2.7'", 'at', "; python_version >= '2.7'")

Storing complete log in /home/jenkins/.pip/pip.log
make[1]: *** [update] Error 2
make[1]: Leaving directory `<https://ci.trafficserver.apache.org/job/tsqa-master/ws/src/ci/tsqa'>
make: *** [virtualenv/.done] Error 2
Build step 'Execute shell' marked build as failure
Recording test results
ERROR: Publisher hudson.tasks.junit.JUnitResultArchiver aborted due to exception
hudson.AbortException: No test report files were found. Configuration error?
	at hudson.tasks.junit.JUnitParser$ParseResultCallable.invoke(JUnitParser.java:116)
	at hudson.tasks.junit.JUnitParser$ParseResultCallable.invoke(JUnitParser.java:93)
	at hudson.FilePath$FileCallableWrapper.call(FilePath.java:2688)
	at hudson.remoting.UserRequest.perform(UserRequest.java:121)
	at hudson.remoting.UserRequest.perform(UserRequest.java:49)
	at hudson.remoting.Request$2.run(Request.java:324)
	at hudson.remoting.InterceptingExecutorService$1.call(InterceptingExecutorService.java:68)
	at java.util.concurrent.FutureTask.run(FutureTask.java:262)
	at java.util.concurrent.ThreadPoolExecutor.runWorker(ThreadPoolExecutor.java:1145)
	at java.util.concurrent.ThreadPoolExecutor$Worker.run(ThreadPoolExecutor.java:615)
	at java.lang.Thread.run(Thread.java:745)
	at ......remote call to QA3(Native Method)
	at hudson.remoting.Channel.attachCallSiteStackTrace(Channel.java:1356)
	at hudson.remoting.UserResponse.retrieve(UserRequest.java:221)
	at hudson.remoting.Channel.call(Channel.java:752)
	at hudson.FilePath.act(FilePath.java:978)
	at hudson.FilePath.act(FilePath.java:967)
	at hudson.tasks.junit.JUnitParser.parseResult(JUnitParser.java:90)
	at hudson.tasks.junit.JUnitResultArchiver.parse(JUnitResultArchiver.java:120)
	at hudson.tasks.junit.JUnitResultArchiver.perform(JUnitResultArchiver.java:137)
	at hudson.tasks.BuildStepCompatibilityLayer.perform(BuildStepCompatibilityLayer.java:74)
	at hudson.tasks.BuildStepMonitor$1.perform(BuildStepMonitor.java:20)
	at hudson.model.AbstractBuild$AbstractBuildExecution.perform(AbstractBuild.java:761)
	at hudson.model.AbstractBuild$AbstractBuildExecution.performAllBuildSteps(AbstractBuild.java:721)
	at hudson.model.Build$BuildExecution.post2(Build.java:183)
	at hudson.model.AbstractBuild$AbstractBuildExecution.post(AbstractBuild.java:670)
	at hudson.model.Run.execute(Run.java:1775)
	at hudson.model.FreeStyleBuild.run(FreeStyleBuild.java:43)
	at hudson.model.ResourceController.execute(ResourceController.java:89)
	at hudson.model.Executor.run(Executor.java:240)

Build failed in Jenkins: tsqa-master #814

Posted by je...@ci.trafficserver.apache.org.
See <https://ci.trafficserver.apache.org/job/tsqa-master/814/>

------------------------------------------
Started by upstream project "in_tree-master" build number 1335
originally caused by:
 Started by an SCM change
Building remotely on QA3 (qa) in workspace <https://ci.trafficserver.apache.org/job/tsqa-master/ws/>
 > /usr/bin/git rev-parse --is-inside-work-tree # timeout=10
Fetching changes from the remote Git repository
 > /usr/bin/git config remote.origin.url https://git-wip-us.apache.org/repos/asf/trafficserver.git # timeout=10
Cleaning workspace
 > /usr/bin/git rev-parse --verify HEAD # timeout=10
Resetting working tree
 > /usr/bin/git reset --hard # timeout=10
 > /usr/bin/git clean -fdx # timeout=10
Fetching upstream changes from https://git-wip-us.apache.org/repos/asf/trafficserver.git
 > /usr/bin/git --version # timeout=10
 > /usr/bin/git -c core.askpass=true fetch --tags --progress https://git-wip-us.apache.org/repos/asf/trafficserver.git +refs/heads/*:refs/remotes/origin/*
 > /usr/bin/git rev-parse refs/remotes/origin/master^{commit} # timeout=10
 > /usr/bin/git rev-parse refs/remotes/origin/origin/master^{commit} # timeout=10
Checking out Revision fc6037ef3f39b2e9551d86a3546c3013f35a791a (refs/remotes/origin/master)
 > /usr/bin/git config core.sparsecheckout # timeout=10
 > /usr/bin/git checkout -f fc6037ef3f39b2e9551d86a3546c3013f35a791a
 > /usr/bin/git rev-list fc6037ef3f39b2e9551d86a3546c3013f35a791a # timeout=10
[tsqa-master] $ /bin/bash -xe /tmp/hudson6821286997970674702.sh
+ source /home/jenkins/bin/environment.sh
++ export ATS_SRC_HOME=/home/jenkins/src
++ ATS_SRC_HOME=/home/jenkins/src
++ test tsqa-master '!=' tsqa-master
++ ATS_MAKE=make
++ test tsqa-master '!=' tsqa-master
++ export ATS_MAKE
+++ /bin/date +%m%d%Y
++ export TODAY=08272015
++ TODAY=08272015
++ ATS_BRANCH=master
++ test tsqa-master '!=' tsqa-master
++ test tsqa-master '!=' tsqa-master
++ test tsqa-master '!=' tsqa-master
++ test tsqa-master '!=' tsqa-master
++ test tsqa-master '!=' tsqa-master
++ test tsqa-master '!=' tsqa-master
++ test tsqa-master '!=' tsqa-master
++ test tsqa-master '!=' tsqa-master
++ test tsqa-master '!=' tsqa-master
++ test tsqa-master '!=' tsqa-master
++ test tsqa-master '!=' tsqa-master
++ test tsqa-master '!=' tsqa-master
++ test tsqa-master '!=' tsqa-master
++ export ATS_BRANCH
++ test tsqa-master '!=' tsqa-master
+ source /home/jenkins/bin/tsqa.sh
++ TSQA_LAYOUT_DIR=<https://ci.trafficserver.apache.org/job/tsqa-master/ws/814>
++ cd <https://ci.trafficserver.apache.org/job/tsqa-master/ws/src/ci/tsqa>
++ make test
New python executable in virtualenv/bin/python
Installing Setuptools..............................................................................................................................................................................................................................done.
Installing Pip.....................................................................................................................................................................................................................................................................................................................................done.
make update
make[1]: Entering directory `<https://ci.trafficserver.apache.org/job/tsqa-master/ws/src/ci/tsqa'>
Exception:
Traceback (most recent call last):
  File "<https://ci.trafficserver.apache.org/job/tsqa-master/ws/src/ci/tsqa/virtualenv/lib/python2.7/site-packages/pip/basecommand.py",> line 134, in main
    status = self.run(options, args)
  File "<https://ci.trafficserver.apache.org/job/tsqa-master/ws/src/ci/tsqa/virtualenv/lib/python2.7/site-packages/pip/commands/install.py",> line 220, in run
    for req in parse_requirements(filename, finder=finder, options=options):
  File "<https://ci.trafficserver.apache.org/job/tsqa-master/ws/src/ci/tsqa/virtualenv/lib/python2.7/site-packages/pip/req.py",> line 1477, in parse_requirements
    req = InstallRequirement.from_line(line, comes_from, prereleases=getattr(options, "pre", None))
  File "<https://ci.trafficserver.apache.org/job/tsqa-master/ws/src/ci/tsqa/virtualenv/lib/python2.7/site-packages/pip/req.py",> line 129, in from_line
    return cls(req, comes_from, url=url, prereleases=prereleases)
  File "<https://ci.trafficserver.apache.org/job/tsqa-master/ws/src/ci/tsqa/virtualenv/lib/python2.7/site-packages/pip/req.py",> line 44, in __init__
    req = pkg_resources.Requirement.parse(req)
  File "<https://ci.trafficserver.apache.org/job/tsqa-master/ws/src/ci/tsqa/virtualenv/lib/python2.7/site-packages/pkg_resources.py",> line 2914, in parse
    reqs = list(parse_requirements(s))
  File "<https://ci.trafficserver.apache.org/job/tsqa-master/ws/src/ci/tsqa/virtualenv/lib/python2.7/site-packages/pkg_resources.py",> line 2839, in parse_requirements
    line, p, specs = scan_list(VERSION,LINE_END,line,p,(1,2),"version spec")
  File "<https://ci.trafficserver.apache.org/job/tsqa-master/ws/src/ci/tsqa/virtualenv/lib/python2.7/site-packages/pkg_resources.py",> line 2807, in scan_list
    raise ValueError("Expected "+item_name+" in",line,"at",line[p:])
ValueError: ('Expected version spec in', "hyper; python_version >= '2.7'", 'at', "; python_version >= '2.7'")

Storing complete log in /home/jenkins/.pip/pip.log
make[1]: *** [update] Error 2
make[1]: Leaving directory `<https://ci.trafficserver.apache.org/job/tsqa-master/ws/src/ci/tsqa'>
make: *** [virtualenv/.done] Error 2
Build step 'Execute shell' marked build as failure
Recording test results
ERROR: Publisher hudson.tasks.junit.JUnitResultArchiver aborted due to exception
hudson.AbortException: No test report files were found. Configuration error?
	at hudson.tasks.junit.JUnitParser$ParseResultCallable.invoke(JUnitParser.java:116)
	at hudson.tasks.junit.JUnitParser$ParseResultCallable.invoke(JUnitParser.java:93)
	at hudson.FilePath$FileCallableWrapper.call(FilePath.java:2688)
	at hudson.remoting.UserRequest.perform(UserRequest.java:121)
	at hudson.remoting.UserRequest.perform(UserRequest.java:49)
	at hudson.remoting.Request$2.run(Request.java:324)
	at hudson.remoting.InterceptingExecutorService$1.call(InterceptingExecutorService.java:68)
	at java.util.concurrent.FutureTask.run(FutureTask.java:262)
	at java.util.concurrent.ThreadPoolExecutor.runWorker(ThreadPoolExecutor.java:1145)
	at java.util.concurrent.ThreadPoolExecutor$Worker.run(ThreadPoolExecutor.java:615)
	at java.lang.Thread.run(Thread.java:745)
	at ......remote call to QA3(Native Method)
	at hudson.remoting.Channel.attachCallSiteStackTrace(Channel.java:1356)
	at hudson.remoting.UserResponse.retrieve(UserRequest.java:221)
	at hudson.remoting.Channel.call(Channel.java:752)
	at hudson.FilePath.act(FilePath.java:978)
	at hudson.FilePath.act(FilePath.java:967)
	at hudson.tasks.junit.JUnitParser.parseResult(JUnitParser.java:90)
	at hudson.tasks.junit.JUnitResultArchiver.parse(JUnitResultArchiver.java:120)
	at hudson.tasks.junit.JUnitResultArchiver.perform(JUnitResultArchiver.java:137)
	at hudson.tasks.BuildStepCompatibilityLayer.perform(BuildStepCompatibilityLayer.java:74)
	at hudson.tasks.BuildStepMonitor$1.perform(BuildStepMonitor.java:20)
	at hudson.model.AbstractBuild$AbstractBuildExecution.perform(AbstractBuild.java:761)
	at hudson.model.AbstractBuild$AbstractBuildExecution.performAllBuildSteps(AbstractBuild.java:721)
	at hudson.model.Build$BuildExecution.post2(Build.java:183)
	at hudson.model.AbstractBuild$AbstractBuildExecution.post(AbstractBuild.java:670)
	at hudson.model.Run.execute(Run.java:1775)
	at hudson.model.FreeStyleBuild.run(FreeStyleBuild.java:43)
	at hudson.model.ResourceController.execute(ResourceController.java:89)
	at hudson.model.Executor.run(Executor.java:240)

Build failed in Jenkins: tsqa-master #813

Posted by je...@ci.trafficserver.apache.org.
See <https://ci.trafficserver.apache.org/job/tsqa-master/813/changes>

Changes:

[Sudheer Vinukonda] [TS-3872] update docs for the new setting.

------------------------------------------
Started by upstream project "out_of_tree-master" build number 1116
originally caused by:
 Started by an SCM change
Building remotely on QA3 (qa) in workspace <https://ci.trafficserver.apache.org/job/tsqa-master/ws/>
 > /usr/bin/git rev-parse --is-inside-work-tree # timeout=10
Fetching changes from the remote Git repository
 > /usr/bin/git config remote.origin.url https://git-wip-us.apache.org/repos/asf/trafficserver.git # timeout=10
Cleaning workspace
 > /usr/bin/git rev-parse --verify HEAD # timeout=10
Resetting working tree
 > /usr/bin/git reset --hard # timeout=10
 > /usr/bin/git clean -fdx # timeout=10
Fetching upstream changes from https://git-wip-us.apache.org/repos/asf/trafficserver.git
 > /usr/bin/git --version # timeout=10
 > /usr/bin/git -c core.askpass=true fetch --tags --progress https://git-wip-us.apache.org/repos/asf/trafficserver.git +refs/heads/*:refs/remotes/origin/*
 > /usr/bin/git rev-parse refs/remotes/origin/master^{commit} # timeout=10
 > /usr/bin/git rev-parse refs/remotes/origin/origin/master^{commit} # timeout=10
Checking out Revision fc6037ef3f39b2e9551d86a3546c3013f35a791a (refs/remotes/origin/master)
 > /usr/bin/git config core.sparsecheckout # timeout=10
 > /usr/bin/git checkout -f fc6037ef3f39b2e9551d86a3546c3013f35a791a
 > /usr/bin/git rev-list 55d57be2b348e49d490859fe60a2a8cb1bf83351 # timeout=10
[tsqa-master] $ /bin/bash -xe /tmp/hudson5256341718752270313.sh
+ source /home/jenkins/bin/environment.sh
++ export ATS_SRC_HOME=/home/jenkins/src
++ ATS_SRC_HOME=/home/jenkins/src
++ test tsqa-master '!=' tsqa-master
++ ATS_MAKE=make
++ test tsqa-master '!=' tsqa-master
++ export ATS_MAKE
+++ /bin/date +%m%d%Y
++ export TODAY=08272015
++ TODAY=08272015
++ ATS_BRANCH=master
++ test tsqa-master '!=' tsqa-master
++ test tsqa-master '!=' tsqa-master
++ test tsqa-master '!=' tsqa-master
++ test tsqa-master '!=' tsqa-master
++ test tsqa-master '!=' tsqa-master
++ test tsqa-master '!=' tsqa-master
++ test tsqa-master '!=' tsqa-master
++ test tsqa-master '!=' tsqa-master
++ test tsqa-master '!=' tsqa-master
++ test tsqa-master '!=' tsqa-master
++ test tsqa-master '!=' tsqa-master
++ test tsqa-master '!=' tsqa-master
++ test tsqa-master '!=' tsqa-master
++ export ATS_BRANCH
++ test tsqa-master '!=' tsqa-master
+ source /home/jenkins/bin/tsqa.sh
++ TSQA_LAYOUT_DIR=<https://ci.trafficserver.apache.org/job/tsqa-master/ws/813>
++ cd <https://ci.trafficserver.apache.org/job/tsqa-master/ws/src/ci/tsqa>
++ make test
New python executable in virtualenv/bin/python
Installing Setuptools..............................................................................................................................................................................................................................done.
Installing Pip.....................................................................................................................................................................................................................................................................................................................................done.
make update
make[1]: Entering directory `<https://ci.trafficserver.apache.org/job/tsqa-master/ws/src/ci/tsqa'>
Exception:
Traceback (most recent call last):
  File "<https://ci.trafficserver.apache.org/job/tsqa-master/ws/src/ci/tsqa/virtualenv/lib/python2.7/site-packages/pip/basecommand.py",> line 134, in main
    status = self.run(options, args)
  File "<https://ci.trafficserver.apache.org/job/tsqa-master/ws/src/ci/tsqa/virtualenv/lib/python2.7/site-packages/pip/commands/install.py",> line 220, in run
    for req in parse_requirements(filename, finder=finder, options=options):
  File "<https://ci.trafficserver.apache.org/job/tsqa-master/ws/src/ci/tsqa/virtualenv/lib/python2.7/site-packages/pip/req.py",> line 1477, in parse_requirements
    req = InstallRequirement.from_line(line, comes_from, prereleases=getattr(options, "pre", None))
  File "<https://ci.trafficserver.apache.org/job/tsqa-master/ws/src/ci/tsqa/virtualenv/lib/python2.7/site-packages/pip/req.py",> line 129, in from_line
    return cls(req, comes_from, url=url, prereleases=prereleases)
  File "<https://ci.trafficserver.apache.org/job/tsqa-master/ws/src/ci/tsqa/virtualenv/lib/python2.7/site-packages/pip/req.py",> line 44, in __init__
    req = pkg_resources.Requirement.parse(req)
  File "<https://ci.trafficserver.apache.org/job/tsqa-master/ws/src/ci/tsqa/virtualenv/lib/python2.7/site-packages/pkg_resources.py",> line 2914, in parse
    reqs = list(parse_requirements(s))
  File "<https://ci.trafficserver.apache.org/job/tsqa-master/ws/src/ci/tsqa/virtualenv/lib/python2.7/site-packages/pkg_resources.py",> line 2839, in parse_requirements
    line, p, specs = scan_list(VERSION,LINE_END,line,p,(1,2),"version spec")
  File "<https://ci.trafficserver.apache.org/job/tsqa-master/ws/src/ci/tsqa/virtualenv/lib/python2.7/site-packages/pkg_resources.py",> line 2807, in scan_list
    raise ValueError("Expected "+item_name+" in",line,"at",line[p:])
ValueError: ('Expected version spec in', "hyper; python_version >= '2.7'", 'at', "; python_version >= '2.7'")

Storing complete log in /home/jenkins/.pip/pip.log
make[1]: *** [update] Error 2
make[1]: Leaving directory `<https://ci.trafficserver.apache.org/job/tsqa-master/ws/src/ci/tsqa'>
make: *** [virtualenv/.done] Error 2
Build step 'Execute shell' marked build as failure
Recording test results
ERROR: Publisher hudson.tasks.junit.JUnitResultArchiver aborted due to exception
hudson.AbortException: No test report files were found. Configuration error?
	at hudson.tasks.junit.JUnitParser$ParseResultCallable.invoke(JUnitParser.java:116)
	at hudson.tasks.junit.JUnitParser$ParseResultCallable.invoke(JUnitParser.java:93)
	at hudson.FilePath$FileCallableWrapper.call(FilePath.java:2688)
	at hudson.remoting.UserRequest.perform(UserRequest.java:121)
	at hudson.remoting.UserRequest.perform(UserRequest.java:49)
	at hudson.remoting.Request$2.run(Request.java:324)
	at hudson.remoting.InterceptingExecutorService$1.call(InterceptingExecutorService.java:68)
	at java.util.concurrent.FutureTask.run(FutureTask.java:262)
	at java.util.concurrent.ThreadPoolExecutor.runWorker(ThreadPoolExecutor.java:1145)
	at java.util.concurrent.ThreadPoolExecutor$Worker.run(ThreadPoolExecutor.java:615)
	at java.lang.Thread.run(Thread.java:745)
	at ......remote call to QA3(Native Method)
	at hudson.remoting.Channel.attachCallSiteStackTrace(Channel.java:1356)
	at hudson.remoting.UserResponse.retrieve(UserRequest.java:221)
	at hudson.remoting.Channel.call(Channel.java:752)
	at hudson.FilePath.act(FilePath.java:978)
	at hudson.FilePath.act(FilePath.java:967)
	at hudson.tasks.junit.JUnitParser.parseResult(JUnitParser.java:90)
	at hudson.tasks.junit.JUnitResultArchiver.parse(JUnitResultArchiver.java:120)
	at hudson.tasks.junit.JUnitResultArchiver.perform(JUnitResultArchiver.java:137)
	at hudson.tasks.BuildStepCompatibilityLayer.perform(BuildStepCompatibilityLayer.java:74)
	at hudson.tasks.BuildStepMonitor$1.perform(BuildStepMonitor.java:20)
	at hudson.model.AbstractBuild$AbstractBuildExecution.perform(AbstractBuild.java:761)
	at hudson.model.AbstractBuild$AbstractBuildExecution.performAllBuildSteps(AbstractBuild.java:721)
	at hudson.model.Build$BuildExecution.post2(Build.java:183)
	at hudson.model.AbstractBuild$AbstractBuildExecution.post(AbstractBuild.java:670)
	at hudson.model.Run.execute(Run.java:1775)
	at hudson.model.FreeStyleBuild.run(FreeStyleBuild.java:43)
	at hudson.model.ResourceController.execute(ResourceController.java:89)
	at hudson.model.Executor.run(Executor.java:240)

Build failed in Jenkins: tsqa-master #812

Posted by je...@ci.trafficserver.apache.org.
See <https://ci.trafficserver.apache.org/job/tsqa-master/812/changes>

Changes:

[Sudheer Vinukonda] [TS-3872] Enhance open_write_fail_action feature to support returning error on revalidation.

------------------------------------------
Started by upstream project "out_of_tree-master" build number 1115
originally caused by:
 Started by an SCM change
Started by upstream project "in_tree-master" build number 1334
originally caused by:
 Started by an SCM change
Building remotely on QA3 (qa) in workspace <https://ci.trafficserver.apache.org/job/tsqa-master/ws/>
 > /usr/bin/git rev-parse --is-inside-work-tree # timeout=10
Fetching changes from the remote Git repository
 > /usr/bin/git config remote.origin.url https://git-wip-us.apache.org/repos/asf/trafficserver.git # timeout=10
Cleaning workspace
 > /usr/bin/git rev-parse --verify HEAD # timeout=10
Resetting working tree
 > /usr/bin/git reset --hard # timeout=10
 > /usr/bin/git clean -fdx # timeout=10
Fetching upstream changes from https://git-wip-us.apache.org/repos/asf/trafficserver.git
 > /usr/bin/git --version # timeout=10
 > /usr/bin/git -c core.askpass=true fetch --tags --progress https://git-wip-us.apache.org/repos/asf/trafficserver.git +refs/heads/*:refs/remotes/origin/*
 > /usr/bin/git rev-parse refs/remotes/origin/master^{commit} # timeout=10
 > /usr/bin/git rev-parse refs/remotes/origin/origin/master^{commit} # timeout=10
Checking out Revision 55d57be2b348e49d490859fe60a2a8cb1bf83351 (refs/remotes/origin/master)
 > /usr/bin/git config core.sparsecheckout # timeout=10
 > /usr/bin/git checkout -f 55d57be2b348e49d490859fe60a2a8cb1bf83351
 > /usr/bin/git rev-list 2a5893a106f2c9661554eac1a6b7e20e44208c0e # timeout=10
[tsqa-master] $ /bin/bash -xe /tmp/hudson7263892060708680773.sh
+ source /home/jenkins/bin/environment.sh
++ export ATS_SRC_HOME=/home/jenkins/src
++ ATS_SRC_HOME=/home/jenkins/src
++ test tsqa-master '!=' tsqa-master
++ ATS_MAKE=make
++ test tsqa-master '!=' tsqa-master
++ export ATS_MAKE
+++ /bin/date +%m%d%Y
++ export TODAY=08272015
++ TODAY=08272015
++ ATS_BRANCH=master
++ test tsqa-master '!=' tsqa-master
++ test tsqa-master '!=' tsqa-master
++ test tsqa-master '!=' tsqa-master
++ test tsqa-master '!=' tsqa-master
++ test tsqa-master '!=' tsqa-master
++ test tsqa-master '!=' tsqa-master
++ test tsqa-master '!=' tsqa-master
++ test tsqa-master '!=' tsqa-master
++ test tsqa-master '!=' tsqa-master
++ test tsqa-master '!=' tsqa-master
++ test tsqa-master '!=' tsqa-master
++ test tsqa-master '!=' tsqa-master
++ test tsqa-master '!=' tsqa-master
++ export ATS_BRANCH
++ test tsqa-master '!=' tsqa-master
+ source /home/jenkins/bin/tsqa.sh
++ TSQA_LAYOUT_DIR=<https://ci.trafficserver.apache.org/job/tsqa-master/ws/812>
++ cd <https://ci.trafficserver.apache.org/job/tsqa-master/ws/src/ci/tsqa>
++ make test
New python executable in virtualenv/bin/python
Installing Setuptools..............................................................................................................................................................................................................................done.
Installing Pip.....................................................................................................................................................................................................................................................................................................................................done.
make update
make[1]: Entering directory `<https://ci.trafficserver.apache.org/job/tsqa-master/ws/src/ci/tsqa'>
Exception:
Traceback (most recent call last):
  File "<https://ci.trafficserver.apache.org/job/tsqa-master/ws/src/ci/tsqa/virtualenv/lib/python2.7/site-packages/pip/basecommand.py",> line 134, in main
    status = self.run(options, args)
  File "<https://ci.trafficserver.apache.org/job/tsqa-master/ws/src/ci/tsqa/virtualenv/lib/python2.7/site-packages/pip/commands/install.py",> line 220, in run
    for req in parse_requirements(filename, finder=finder, options=options):
  File "<https://ci.trafficserver.apache.org/job/tsqa-master/ws/src/ci/tsqa/virtualenv/lib/python2.7/site-packages/pip/req.py",> line 1477, in parse_requirements
    req = InstallRequirement.from_line(line, comes_from, prereleases=getattr(options, "pre", None))
  File "<https://ci.trafficserver.apache.org/job/tsqa-master/ws/src/ci/tsqa/virtualenv/lib/python2.7/site-packages/pip/req.py",> line 129, in from_line
    return cls(req, comes_from, url=url, prereleases=prereleases)
  File "<https://ci.trafficserver.apache.org/job/tsqa-master/ws/src/ci/tsqa/virtualenv/lib/python2.7/site-packages/pip/req.py",> line 44, in __init__
    req = pkg_resources.Requirement.parse(req)
  File "<https://ci.trafficserver.apache.org/job/tsqa-master/ws/src/ci/tsqa/virtualenv/lib/python2.7/site-packages/pkg_resources.py",> line 2914, in parse
    reqs = list(parse_requirements(s))
  File "<https://ci.trafficserver.apache.org/job/tsqa-master/ws/src/ci/tsqa/virtualenv/lib/python2.7/site-packages/pkg_resources.py",> line 2839, in parse_requirements
    line, p, specs = scan_list(VERSION,LINE_END,line,p,(1,2),"version spec")
  File "<https://ci.trafficserver.apache.org/job/tsqa-master/ws/src/ci/tsqa/virtualenv/lib/python2.7/site-packages/pkg_resources.py",> line 2807, in scan_list
    raise ValueError("Expected "+item_name+" in",line,"at",line[p:])
ValueError: ('Expected version spec in', "hyper; python_version >= '2.7'", 'at', "; python_version >= '2.7'")

Storing complete log in /home/jenkins/.pip/pip.log
make[1]: *** [update] Error 2
make[1]: Leaving directory `<https://ci.trafficserver.apache.org/job/tsqa-master/ws/src/ci/tsqa'>
make: *** [virtualenv/.done] Error 2
Build step 'Execute shell' marked build as failure
Recording test results
ERROR: Publisher hudson.tasks.junit.JUnitResultArchiver aborted due to exception
hudson.AbortException: No test report files were found. Configuration error?
	at hudson.tasks.junit.JUnitParser$ParseResultCallable.invoke(JUnitParser.java:116)
	at hudson.tasks.junit.JUnitParser$ParseResultCallable.invoke(JUnitParser.java:93)
	at hudson.FilePath$FileCallableWrapper.call(FilePath.java:2688)
	at hudson.remoting.UserRequest.perform(UserRequest.java:121)
	at hudson.remoting.UserRequest.perform(UserRequest.java:49)
	at hudson.remoting.Request$2.run(Request.java:324)
	at hudson.remoting.InterceptingExecutorService$1.call(InterceptingExecutorService.java:68)
	at java.util.concurrent.FutureTask.run(FutureTask.java:262)
	at java.util.concurrent.ThreadPoolExecutor.runWorker(ThreadPoolExecutor.java:1145)
	at java.util.concurrent.ThreadPoolExecutor$Worker.run(ThreadPoolExecutor.java:615)
	at java.lang.Thread.run(Thread.java:745)
	at ......remote call to QA3(Native Method)
	at hudson.remoting.Channel.attachCallSiteStackTrace(Channel.java:1356)
	at hudson.remoting.UserResponse.retrieve(UserRequest.java:221)
	at hudson.remoting.Channel.call(Channel.java:752)
	at hudson.FilePath.act(FilePath.java:978)
	at hudson.FilePath.act(FilePath.java:967)
	at hudson.tasks.junit.JUnitParser.parseResult(JUnitParser.java:90)
	at hudson.tasks.junit.JUnitResultArchiver.parse(JUnitResultArchiver.java:120)
	at hudson.tasks.junit.JUnitResultArchiver.perform(JUnitResultArchiver.java:137)
	at hudson.tasks.BuildStepCompatibilityLayer.perform(BuildStepCompatibilityLayer.java:74)
	at hudson.tasks.BuildStepMonitor$1.perform(BuildStepMonitor.java:20)
	at hudson.model.AbstractBuild$AbstractBuildExecution.perform(AbstractBuild.java:761)
	at hudson.model.AbstractBuild$AbstractBuildExecution.performAllBuildSteps(AbstractBuild.java:721)
	at hudson.model.Build$BuildExecution.post2(Build.java:183)
	at hudson.model.AbstractBuild$AbstractBuildExecution.post(AbstractBuild.java:670)
	at hudson.model.Run.execute(Run.java:1775)
	at hudson.model.FreeStyleBuild.run(FreeStyleBuild.java:43)
	at hudson.model.ResourceController.execute(ResourceController.java:89)
	at hudson.model.Executor.run(Executor.java:240)

Build failed in Jenkins: tsqa-master #811

Posted by je...@ci.trafficserver.apache.org.
See <https://ci.trafficserver.apache.org/job/tsqa-master/811/changes>

Changes:

[Bryan Call] Format changes to the CHANGES file

------------------------------------------
Started by upstream project "out_of_tree-master" build number 1114
originally caused by:
 Started by an SCM change
Started by upstream project "in_tree-master" build number 1333
originally caused by:
 Started by an SCM change
Building remotely on QA3 (qa) in workspace <https://ci.trafficserver.apache.org/job/tsqa-master/ws/>
 > /usr/bin/git rev-parse --is-inside-work-tree # timeout=10
Fetching changes from the remote Git repository
 > /usr/bin/git config remote.origin.url https://git-wip-us.apache.org/repos/asf/trafficserver.git # timeout=10
Cleaning workspace
 > /usr/bin/git rev-parse --verify HEAD # timeout=10
Resetting working tree
 > /usr/bin/git reset --hard # timeout=10
 > /usr/bin/git clean -fdx # timeout=10
Fetching upstream changes from https://git-wip-us.apache.org/repos/asf/trafficserver.git
 > /usr/bin/git --version # timeout=10
 > /usr/bin/git -c core.askpass=true fetch --tags --progress https://git-wip-us.apache.org/repos/asf/trafficserver.git +refs/heads/*:refs/remotes/origin/*
 > /usr/bin/git rev-parse refs/remotes/origin/master^{commit} # timeout=10
 > /usr/bin/git rev-parse refs/remotes/origin/origin/master^{commit} # timeout=10
Checking out Revision 2a5893a106f2c9661554eac1a6b7e20e44208c0e (refs/remotes/origin/master)
 > /usr/bin/git config core.sparsecheckout # timeout=10
 > /usr/bin/git checkout -f 2a5893a106f2c9661554eac1a6b7e20e44208c0e
 > /usr/bin/git rev-list 4c81be14eefe196018c9d12be6cefca35793f92b # timeout=10
[tsqa-master] $ /bin/bash -xe /tmp/hudson4958552398549418811.sh
+ source /home/jenkins/bin/environment.sh
++ export ATS_SRC_HOME=/home/jenkins/src
++ ATS_SRC_HOME=/home/jenkins/src
++ test tsqa-master '!=' tsqa-master
++ ATS_MAKE=make
++ test tsqa-master '!=' tsqa-master
++ export ATS_MAKE
+++ /bin/date +%m%d%Y
++ export TODAY=08272015
++ TODAY=08272015
++ ATS_BRANCH=master
++ test tsqa-master '!=' tsqa-master
++ test tsqa-master '!=' tsqa-master
++ test tsqa-master '!=' tsqa-master
++ test tsqa-master '!=' tsqa-master
++ test tsqa-master '!=' tsqa-master
++ test tsqa-master '!=' tsqa-master
++ test tsqa-master '!=' tsqa-master
++ test tsqa-master '!=' tsqa-master
++ test tsqa-master '!=' tsqa-master
++ test tsqa-master '!=' tsqa-master
++ test tsqa-master '!=' tsqa-master
++ test tsqa-master '!=' tsqa-master
++ test tsqa-master '!=' tsqa-master
++ export ATS_BRANCH
++ test tsqa-master '!=' tsqa-master
+ source /home/jenkins/bin/tsqa.sh
++ TSQA_LAYOUT_DIR=<https://ci.trafficserver.apache.org/job/tsqa-master/ws/811>
++ cd <https://ci.trafficserver.apache.org/job/tsqa-master/ws/src/ci/tsqa>
++ make test
New python executable in virtualenv/bin/python
Installing Setuptools..............................................................................................................................................................................................................................done.
Installing Pip.....................................................................................................................................................................................................................................................................................................................................done.
make update
make[1]: Entering directory `<https://ci.trafficserver.apache.org/job/tsqa-master/ws/src/ci/tsqa'>
Exception:
Traceback (most recent call last):
  File "<https://ci.trafficserver.apache.org/job/tsqa-master/ws/src/ci/tsqa/virtualenv/lib/python2.7/site-packages/pip/basecommand.py",> line 134, in main
    status = self.run(options, args)
  File "<https://ci.trafficserver.apache.org/job/tsqa-master/ws/src/ci/tsqa/virtualenv/lib/python2.7/site-packages/pip/commands/install.py",> line 220, in run
    for req in parse_requirements(filename, finder=finder, options=options):
  File "<https://ci.trafficserver.apache.org/job/tsqa-master/ws/src/ci/tsqa/virtualenv/lib/python2.7/site-packages/pip/req.py",> line 1477, in parse_requirements
    req = InstallRequirement.from_line(line, comes_from, prereleases=getattr(options, "pre", None))
  File "<https://ci.trafficserver.apache.org/job/tsqa-master/ws/src/ci/tsqa/virtualenv/lib/python2.7/site-packages/pip/req.py",> line 129, in from_line
    return cls(req, comes_from, url=url, prereleases=prereleases)
  File "<https://ci.trafficserver.apache.org/job/tsqa-master/ws/src/ci/tsqa/virtualenv/lib/python2.7/site-packages/pip/req.py",> line 44, in __init__
    req = pkg_resources.Requirement.parse(req)
  File "<https://ci.trafficserver.apache.org/job/tsqa-master/ws/src/ci/tsqa/virtualenv/lib/python2.7/site-packages/pkg_resources.py",> line 2914, in parse
    reqs = list(parse_requirements(s))
  File "<https://ci.trafficserver.apache.org/job/tsqa-master/ws/src/ci/tsqa/virtualenv/lib/python2.7/site-packages/pkg_resources.py",> line 2839, in parse_requirements
    line, p, specs = scan_list(VERSION,LINE_END,line,p,(1,2),"version spec")
  File "<https://ci.trafficserver.apache.org/job/tsqa-master/ws/src/ci/tsqa/virtualenv/lib/python2.7/site-packages/pkg_resources.py",> line 2807, in scan_list
    raise ValueError("Expected "+item_name+" in",line,"at",line[p:])
ValueError: ('Expected version spec in', "hyper; python_version >= '2.7'", 'at', "; python_version >= '2.7'")

Storing complete log in /home/jenkins/.pip/pip.log
make[1]: *** [update] Error 2
make[1]: Leaving directory `<https://ci.trafficserver.apache.org/job/tsqa-master/ws/src/ci/tsqa'>
make: *** [virtualenv/.done] Error 2
Build step 'Execute shell' marked build as failure
Recording test results
ERROR: Publisher hudson.tasks.junit.JUnitResultArchiver aborted due to exception
hudson.AbortException: No test report files were found. Configuration error?
	at hudson.tasks.junit.JUnitParser$ParseResultCallable.invoke(JUnitParser.java:116)
	at hudson.tasks.junit.JUnitParser$ParseResultCallable.invoke(JUnitParser.java:93)
	at hudson.FilePath$FileCallableWrapper.call(FilePath.java:2688)
	at hudson.remoting.UserRequest.perform(UserRequest.java:121)
	at hudson.remoting.UserRequest.perform(UserRequest.java:49)
	at hudson.remoting.Request$2.run(Request.java:324)
	at hudson.remoting.InterceptingExecutorService$1.call(InterceptingExecutorService.java:68)
	at java.util.concurrent.FutureTask.run(FutureTask.java:262)
	at java.util.concurrent.ThreadPoolExecutor.runWorker(ThreadPoolExecutor.java:1145)
	at java.util.concurrent.ThreadPoolExecutor$Worker.run(ThreadPoolExecutor.java:615)
	at java.lang.Thread.run(Thread.java:745)
	at ......remote call to QA3(Native Method)
	at hudson.remoting.Channel.attachCallSiteStackTrace(Channel.java:1356)
	at hudson.remoting.UserResponse.retrieve(UserRequest.java:221)
	at hudson.remoting.Channel.call(Channel.java:752)
	at hudson.FilePath.act(FilePath.java:978)
	at hudson.FilePath.act(FilePath.java:967)
	at hudson.tasks.junit.JUnitParser.parseResult(JUnitParser.java:90)
	at hudson.tasks.junit.JUnitResultArchiver.parse(JUnitResultArchiver.java:120)
	at hudson.tasks.junit.JUnitResultArchiver.perform(JUnitResultArchiver.java:137)
	at hudson.tasks.BuildStepCompatibilityLayer.perform(BuildStepCompatibilityLayer.java:74)
	at hudson.tasks.BuildStepMonitor$1.perform(BuildStepMonitor.java:20)
	at hudson.model.AbstractBuild$AbstractBuildExecution.perform(AbstractBuild.java:761)
	at hudson.model.AbstractBuild$AbstractBuildExecution.performAllBuildSteps(AbstractBuild.java:721)
	at hudson.model.Build$BuildExecution.post2(Build.java:183)
	at hudson.model.AbstractBuild$AbstractBuildExecution.post(AbstractBuild.java:670)
	at hudson.model.Run.execute(Run.java:1775)
	at hudson.model.FreeStyleBuild.run(FreeStyleBuild.java:43)
	at hudson.model.ResourceController.execute(ResourceController.java:89)
	at hudson.model.Executor.run(Executor.java:240)

Build failed in Jenkins: tsqa-master #810

Posted by je...@ci.trafficserver.apache.org.
See <https://ci.trafficserver.apache.org/job/tsqa-master/810/changes>

Changes:

[Leif Hedstrom] [TS-3534] Wiretracing for SSL connections (doc change only)

[Bryan Call] TS-3869: HTTP/2 Stream uses the clients window size for the servers setting

------------------------------------------
Started by upstream project "out_of_tree-master" build number 1113
originally caused by:
 Started by an SCM change
Started by upstream project "in_tree-master" build number 1332
originally caused by:
 Started by an SCM change
Building remotely on QA3 (qa) in workspace <https://ci.trafficserver.apache.org/job/tsqa-master/ws/>
 > /usr/bin/git rev-parse --is-inside-work-tree # timeout=10
Fetching changes from the remote Git repository
 > /usr/bin/git config remote.origin.url https://git-wip-us.apache.org/repos/asf/trafficserver.git # timeout=10
Cleaning workspace
 > /usr/bin/git rev-parse --verify HEAD # timeout=10
Resetting working tree
 > /usr/bin/git reset --hard # timeout=10
 > /usr/bin/git clean -fdx # timeout=10
Fetching upstream changes from https://git-wip-us.apache.org/repos/asf/trafficserver.git
 > /usr/bin/git --version # timeout=10
 > /usr/bin/git -c core.askpass=true fetch --tags --progress https://git-wip-us.apache.org/repos/asf/trafficserver.git +refs/heads/*:refs/remotes/origin/*
 > /usr/bin/git rev-parse refs/remotes/origin/master^{commit} # timeout=10
 > /usr/bin/git rev-parse refs/remotes/origin/origin/master^{commit} # timeout=10
Checking out Revision 4c81be14eefe196018c9d12be6cefca35793f92b (refs/remotes/origin/master)
 > /usr/bin/git config core.sparsecheckout # timeout=10
 > /usr/bin/git checkout -f 4c81be14eefe196018c9d12be6cefca35793f92b
 > /usr/bin/git rev-list b081f52e347e5363e512067313a51837713e5741 # timeout=10
[tsqa-master] $ /bin/bash -xe /tmp/hudson736831716073666831.sh
+ source /home/jenkins/bin/environment.sh
++ export ATS_SRC_HOME=/home/jenkins/src
++ ATS_SRC_HOME=/home/jenkins/src
++ test tsqa-master '!=' tsqa-master
++ ATS_MAKE=make
++ test tsqa-master '!=' tsqa-master
++ export ATS_MAKE
+++ /bin/date +%m%d%Y
++ export TODAY=08262015
++ TODAY=08262015
++ ATS_BRANCH=master
++ test tsqa-master '!=' tsqa-master
++ test tsqa-master '!=' tsqa-master
++ test tsqa-master '!=' tsqa-master
++ test tsqa-master '!=' tsqa-master
++ test tsqa-master '!=' tsqa-master
++ test tsqa-master '!=' tsqa-master
++ test tsqa-master '!=' tsqa-master
++ test tsqa-master '!=' tsqa-master
++ test tsqa-master '!=' tsqa-master
++ test tsqa-master '!=' tsqa-master
++ test tsqa-master '!=' tsqa-master
++ test tsqa-master '!=' tsqa-master
++ test tsqa-master '!=' tsqa-master
++ export ATS_BRANCH
++ test tsqa-master '!=' tsqa-master
+ source /home/jenkins/bin/tsqa.sh
++ TSQA_LAYOUT_DIR=<https://ci.trafficserver.apache.org/job/tsqa-master/ws/810>
++ cd <https://ci.trafficserver.apache.org/job/tsqa-master/ws/src/ci/tsqa>
++ make test
New python executable in virtualenv/bin/python
Installing Setuptools..............................................................................................................................................................................................................................done.
Installing Pip.....................................................................................................................................................................................................................................................................................................................................done.
make update
make[1]: Entering directory `<https://ci.trafficserver.apache.org/job/tsqa-master/ws/src/ci/tsqa'>
Exception:
Traceback (most recent call last):
  File "<https://ci.trafficserver.apache.org/job/tsqa-master/ws/src/ci/tsqa/virtualenv/lib/python2.7/site-packages/pip/basecommand.py",> line 134, in main
    status = self.run(options, args)
  File "<https://ci.trafficserver.apache.org/job/tsqa-master/ws/src/ci/tsqa/virtualenv/lib/python2.7/site-packages/pip/commands/install.py",> line 220, in run
    for req in parse_requirements(filename, finder=finder, options=options):
  File "<https://ci.trafficserver.apache.org/job/tsqa-master/ws/src/ci/tsqa/virtualenv/lib/python2.7/site-packages/pip/req.py",> line 1477, in parse_requirements
    req = InstallRequirement.from_line(line, comes_from, prereleases=getattr(options, "pre", None))
  File "<https://ci.trafficserver.apache.org/job/tsqa-master/ws/src/ci/tsqa/virtualenv/lib/python2.7/site-packages/pip/req.py",> line 129, in from_line
    return cls(req, comes_from, url=url, prereleases=prereleases)
  File "<https://ci.trafficserver.apache.org/job/tsqa-master/ws/src/ci/tsqa/virtualenv/lib/python2.7/site-packages/pip/req.py",> line 44, in __init__
    req = pkg_resources.Requirement.parse(req)
  File "<https://ci.trafficserver.apache.org/job/tsqa-master/ws/src/ci/tsqa/virtualenv/lib/python2.7/site-packages/pkg_resources.py",> line 2914, in parse
    reqs = list(parse_requirements(s))
  File "<https://ci.trafficserver.apache.org/job/tsqa-master/ws/src/ci/tsqa/virtualenv/lib/python2.7/site-packages/pkg_resources.py",> line 2839, in parse_requirements
    line, p, specs = scan_list(VERSION,LINE_END,line,p,(1,2),"version spec")
  File "<https://ci.trafficserver.apache.org/job/tsqa-master/ws/src/ci/tsqa/virtualenv/lib/python2.7/site-packages/pkg_resources.py",> line 2807, in scan_list
    raise ValueError("Expected "+item_name+" in",line,"at",line[p:])
ValueError: ('Expected version spec in', "hyper; python_version >= '2.7'", 'at', "; python_version >= '2.7'")

Storing complete log in /home/jenkins/.pip/pip.log
make[1]: *** [update] Error 2
make[1]: Leaving directory `<https://ci.trafficserver.apache.org/job/tsqa-master/ws/src/ci/tsqa'>
make: *** [virtualenv/.done] Error 2
Build step 'Execute shell' marked build as failure
Recording test results
ERROR: Publisher hudson.tasks.junit.JUnitResultArchiver aborted due to exception
hudson.AbortException: No test report files were found. Configuration error?
	at hudson.tasks.junit.JUnitParser$ParseResultCallable.invoke(JUnitParser.java:116)
	at hudson.tasks.junit.JUnitParser$ParseResultCallable.invoke(JUnitParser.java:93)
	at hudson.FilePath$FileCallableWrapper.call(FilePath.java:2688)
	at hudson.remoting.UserRequest.perform(UserRequest.java:121)
	at hudson.remoting.UserRequest.perform(UserRequest.java:49)
	at hudson.remoting.Request$2.run(Request.java:324)
	at hudson.remoting.InterceptingExecutorService$1.call(InterceptingExecutorService.java:68)
	at java.util.concurrent.FutureTask.run(FutureTask.java:262)
	at java.util.concurrent.ThreadPoolExecutor.runWorker(ThreadPoolExecutor.java:1145)
	at java.util.concurrent.ThreadPoolExecutor$Worker.run(ThreadPoolExecutor.java:615)
	at java.lang.Thread.run(Thread.java:745)
	at ......remote call to QA3(Native Method)
	at hudson.remoting.Channel.attachCallSiteStackTrace(Channel.java:1356)
	at hudson.remoting.UserResponse.retrieve(UserRequest.java:221)
	at hudson.remoting.Channel.call(Channel.java:752)
	at hudson.FilePath.act(FilePath.java:978)
	at hudson.FilePath.act(FilePath.java:967)
	at hudson.tasks.junit.JUnitParser.parseResult(JUnitParser.java:90)
	at hudson.tasks.junit.JUnitResultArchiver.parse(JUnitResultArchiver.java:120)
	at hudson.tasks.junit.JUnitResultArchiver.perform(JUnitResultArchiver.java:137)
	at hudson.tasks.BuildStepCompatibilityLayer.perform(BuildStepCompatibilityLayer.java:74)
	at hudson.tasks.BuildStepMonitor$1.perform(BuildStepMonitor.java:20)
	at hudson.model.AbstractBuild$AbstractBuildExecution.perform(AbstractBuild.java:761)
	at hudson.model.AbstractBuild$AbstractBuildExecution.performAllBuildSteps(AbstractBuild.java:721)
	at hudson.model.Build$BuildExecution.post2(Build.java:183)
	at hudson.model.AbstractBuild$AbstractBuildExecution.post(AbstractBuild.java:670)
	at hudson.model.Run.execute(Run.java:1775)
	at hudson.model.FreeStyleBuild.run(FreeStyleBuild.java:43)
	at hudson.model.ResourceController.execute(ResourceController.java:89)
	at hudson.model.Executor.run(Executor.java:240)