You are viewing a plain text version of this content. The canonical link for it is here.
Posted to dev@kafka.apache.org by Apache Jenkins Server <je...@builds.apache.org> on 2018/08/13 09:57:40 UTC

Build failed in Jenkins: kafka-2.0-jdk8 #115

See <https://builds.apache.org/job/kafka-2.0-jdk8/115/display/redirect?page=changes>

Changes:

[jason] KAFKA-7164; Follower should truncate after every missed leader epoch

------------------------------------------
[...truncated 882.89 KB...]
kafka.controller.PartitionStateMachineTest > testInvalidNonexistentPartitionToOfflinePartitionTransition STARTED

kafka.controller.PartitionStateMachineTest > testInvalidNonexistentPartitionToOfflinePartitionTransition PASSED

kafka.controller.PartitionStateMachineTest > testOnlinePartitionToOnlineTransition STARTED

kafka.controller.PartitionStateMachineTest > testOnlinePartitionToOnlineTransition PASSED

kafka.controller.PartitionStateMachineTest > testNewPartitionToOnlinePartitionTransitionZkUtilsExceptionFromCreateStates STARTED

kafka.controller.PartitionStateMachineTest > testNewPartitionToOnlinePartitionTransitionZkUtilsExceptionFromCreateStates PASSED

kafka.controller.PartitionStateMachineTest > testInvalidNewPartitionToNonexistentPartitionTransition STARTED

kafka.controller.PartitionStateMachineTest > testInvalidNewPartitionToNonexistentPartitionTransition PASSED

kafka.controller.PartitionStateMachineTest > testNewPartitionToOnlinePartitionTransition STARTED

kafka.controller.PartitionStateMachineTest > testNewPartitionToOnlinePartitionTransition PASSED

kafka.controller.PartitionStateMachineTest > testInvalidOnlinePartitionToNewPartitionTransition STARTED

kafka.controller.PartitionStateMachineTest > testInvalidOnlinePartitionToNewPartitionTransition PASSED

kafka.controller.PartitionStateMachineTest > testOfflinePartitionToOnlinePartitionTransitionErrorCodeFromStateLookup STARTED

kafka.controller.PartitionStateMachineTest > testOfflinePartitionToOnlinePartitionTransitionErrorCodeFromStateLookup PASSED

kafka.controller.PartitionStateMachineTest > testOnlinePartitionToOnlineTransitionForControlledShutdown STARTED

kafka.controller.PartitionStateMachineTest > testOnlinePartitionToOnlineTransitionForControlledShutdown PASSED

kafka.controller.PartitionStateMachineTest > testOfflinePartitionToOnlinePartitionTransitionZkUtilsExceptionFromStateLookup STARTED

kafka.controller.PartitionStateMachineTest > testOfflinePartitionToOnlinePartitionTransitionZkUtilsExceptionFromStateLookup PASSED

kafka.controller.PartitionStateMachineTest > testInvalidOnlinePartitionToNonexistentPartitionTransition STARTED

kafka.controller.PartitionStateMachineTest > testInvalidOnlinePartitionToNonexistentPartitionTransition PASSED

kafka.controller.PartitionStateMachineTest > testInvalidOfflinePartitionToNewPartitionTransition STARTED

kafka.controller.PartitionStateMachineTest > testInvalidOfflinePartitionToNewPartitionTransition PASSED

kafka.controller.PartitionStateMachineTest > testOfflinePartitionToOnlinePartitionTransition STARTED

kafka.controller.PartitionStateMachineTest > testOfflinePartitionToOnlinePartitionTransition PASSED

kafka.controller.ControllerEventManagerTest > testEventThatThrowsException STARTED

kafka.controller.ControllerEventManagerTest > testEventThatThrowsException PASSED

kafka.controller.ControllerEventManagerTest > testSuccessfulEvent STARTED

kafka.controller.ControllerEventManagerTest > testSuccessfulEvent PASSED

kafka.controller.ControllerFailoverTest > testHandleIllegalStateException STARTED

kafka.controller.ControllerFailoverTest > testHandleIllegalStateException PASSED

kafka.network.SocketServerTest > testGracefulClose STARTED

kafka.network.SocketServerTest > testGracefulClose PASSED

kafka.network.SocketServerTest > testSendActionResponseWithThrottledChannelWhereThrottlingAlreadyDone STARTED

kafka.network.SocketServerTest > testSendActionResponseWithThrottledChannelWhereThrottlingAlreadyDone PASSED

kafka.network.SocketServerTest > controlThrowable STARTED

kafka.network.SocketServerTest > controlThrowable PASSED

kafka.network.SocketServerTest > testRequestMetricsAfterStop STARTED

kafka.network.SocketServerTest > testRequestMetricsAfterStop PASSED

kafka.network.SocketServerTest > testConnectionIdReuse STARTED

kafka.network.SocketServerTest > testConnectionIdReuse PASSED

kafka.network.SocketServerTest > testClientDisconnectionUpdatesRequestMetrics STARTED

kafka.network.SocketServerTest > testClientDisconnectionUpdatesRequestMetrics PASSED

kafka.network.SocketServerTest > testProcessorMetricsTags STARTED

kafka.network.SocketServerTest > testProcessorMetricsTags PASSED

kafka.network.SocketServerTest > testMaxConnectionsPerIp STARTED

kafka.network.SocketServerTest > testMaxConnectionsPerIp PASSED

kafka.network.SocketServerTest > testConnectionId STARTED

kafka.network.SocketServerTest > testConnectionId PASSED

kafka.network.SocketServerTest > testBrokerSendAfterChannelClosedUpdatesRequestMetrics STARTED

kafka.network.SocketServerTest > testBrokerSendAfterChannelClosedUpdatesRequestMetrics PASSED

kafka.network.SocketServerTest > testNoOpAction STARTED

kafka.network.SocketServerTest > testNoOpAction PASSED

kafka.network.SocketServerTest > simpleRequest STARTED

kafka.network.SocketServerTest > simpleRequest PASSED

kafka.network.SocketServerTest > closingChannelException STARTED

kafka.network.SocketServerTest > closingChannelException PASSED

kafka.network.SocketServerTest > testSendActionResponseWithThrottledChannelWhereThrottlingInProgress STARTED

kafka.network.SocketServerTest > testSendActionResponseWithThrottledChannelWhereThrottlingInProgress PASSED

kafka.network.SocketServerTest > testIdleConnection STARTED

kafka.network.SocketServerTest > testIdleConnection PASSED

kafka.network.SocketServerTest > testClientDisconnectionWithStagedReceivesFullyProcessed STARTED

kafka.network.SocketServerTest > testClientDisconnectionWithStagedReceivesFullyProcessed PASSED

kafka.network.SocketServerTest > testZeroMaxConnectionsPerIp STARTED

kafka.network.SocketServerTest > testZeroMaxConnectionsPerIp PASSED

kafka.network.SocketServerTest > testMetricCollectionAfterShutdown STARTED

kafka.network.SocketServerTest > testMetricCollectionAfterShutdown PASSED

kafka.network.SocketServerTest > testSessionPrincipal STARTED

kafka.network.SocketServerTest > testSessionPrincipal PASSED

kafka.network.SocketServerTest > configureNewConnectionException STARTED

kafka.network.SocketServerTest > configureNewConnectionException PASSED

kafka.network.SocketServerTest > testMaxConnectionsPerIpOverrides STARTED

kafka.network.SocketServerTest > testMaxConnectionsPerIpOverrides PASSED

kafka.network.SocketServerTest > processNewResponseException STARTED

kafka.network.SocketServerTest > processNewResponseException PASSED

kafka.network.SocketServerTest > processCompletedSendException STARTED

kafka.network.SocketServerTest > processCompletedSendException PASSED

kafka.network.SocketServerTest > processDisconnectedException STARTED

kafka.network.SocketServerTest > processDisconnectedException PASSED

kafka.network.SocketServerTest > sendCancelledKeyException STARTED

kafka.network.SocketServerTest > sendCancelledKeyException PASSED

kafka.network.SocketServerTest > processCompletedReceiveException STARTED

kafka.network.SocketServerTest > processCompletedReceiveException PASSED

kafka.network.SocketServerTest > testSocketsCloseOnShutdown STARTED

kafka.network.SocketServerTest > testSocketsCloseOnShutdown PASSED

kafka.network.SocketServerTest > testNoOpActionResponseWithThrottledChannelWhereThrottlingAlreadyDone STARTED

kafka.network.SocketServerTest > testNoOpActionResponseWithThrottledChannelWhereThrottlingAlreadyDone PASSED

kafka.network.SocketServerTest > pollException STARTED

kafka.network.SocketServerTest > pollException PASSED

kafka.network.SocketServerTest > testSslSocketServer STARTED

kafka.network.SocketServerTest > testSslSocketServer PASSED

kafka.network.SocketServerTest > tooBigRequestIsRejected STARTED

kafka.network.SocketServerTest > tooBigRequestIsRejected PASSED

kafka.network.SocketServerTest > testNoOpActionResponseWithThrottledChannelWhereThrottlingInProgress STARTED

kafka.network.SocketServerTest > testNoOpActionResponseWithThrottledChannelWhereThrottlingInProgress PASSED

kafka.integration.MetricsDuringTopicCreationDeletionTest > testMetricsDuringTopicCreateDelete STARTED

kafka.integration.MetricsDuringTopicCreationDeletionTest > testMetricsDuringTopicCreateDelete PASSED

kafka.integration.UncleanLeaderElectionTest > testUncleanLeaderElectionEnabled STARTED

kafka.integration.UncleanLeaderElectionTest > testUncleanLeaderElectionEnabled PASSED

kafka.integration.UncleanLeaderElectionTest > testCleanLeaderElectionDisabledByTopicOverride STARTED

kafka.integration.UncleanLeaderElectionTest > testCleanLeaderElectionDisabledByTopicOverride SKIPPED

kafka.integration.UncleanLeaderElectionTest > testUncleanLeaderElectionDisabled STARTED

kafka.integration.UncleanLeaderElectionTest > testUncleanLeaderElectionDisabled SKIPPED

kafka.integration.UncleanLeaderElectionTest > testUncleanLeaderElectionInvalidTopicOverride STARTED

kafka.integration.UncleanLeaderElectionTest > testUncleanLeaderElectionInvalidTopicOverride PASSED

kafka.integration.UncleanLeaderElectionTest > testUncleanLeaderElectionEnabledByTopicOverride STARTED

kafka.integration.UncleanLeaderElectionTest > testUncleanLeaderElectionEnabledByTopicOverride PASSED

kafka.integration.MinIsrConfigTest > testDefaultKafkaConfig STARTED

kafka.integration.MinIsrConfigTest > testDefaultKafkaConfig PASSED

2029 tests completed, 1 failed, 4 skipped

> Task :kafka-2.0-jdk8:core:test FAILED
> Task :testScala_2_12 FAILED

FAILURE: Build failed with an exception.

* What went wrong:
Execution failed for task ':kafka-2.0-jdk8:core:test'.
> There were failing tests. See the report at: file://<https://builds.apache.org/job/kafka-2.0-jdk8/ws/core/build/reports/tests/test/index.html>

* Try:
Run with --stacktrace option to get the stack trace. Run with --info or --debug option to get more log output. Run with --scan to get full insights.

* Get more help at https://help.gradle.org

BUILD FAILED in 2h 17m 5s
26 actionable tasks: 18 executed, 8 up-to-date
Build step 'Execute shell' marked build as failure
[FINDBUGS] Collecting findbugs analysis files...
Setting GRADLE_4_8_1_HOME=/home/jenkins/tools/gradle/4.8.1
[FINDBUGS] Searching for all files in <https://builds.apache.org/job/kafka-2.0-jdk8/ws/> that match the pattern **/build/reports/findbugs/*.xml
[FINDBUGS] Parsing 2 files in <https://builds.apache.org/job/kafka-2.0-jdk8/ws/>
[FINDBUGS] Successfully parsed file <https://builds.apache.org/job/kafka-2.0-jdk8/ws/core/build/reports/findbugs/main.xml> with 0 unique warnings and 0 duplicates.
[FINDBUGS] Successfully parsed file <https://builds.apache.org/job/kafka-2.0-jdk8/ws/streams/streams-scala/build/reports/findbugs/main.xml> with 0 unique warnings and 0 duplicates.
Setting GRADLE_4_8_1_HOME=/home/jenkins/tools/gradle/4.8.1
Setting GRADLE_4_8_1_HOME=/home/jenkins/tools/gradle/4.8.1
<Git Blamer> Using GitBlamer to create author and commit information for all warnings.
<Git Blamer> GIT_COMMIT=5152c80129c317951bdcf23acf753c62b4033e34, workspace=<https://builds.apache.org/job/kafka-2.0-jdk8/ws/>
[FINDBUGS] Computing warning deltas based on reference build #114
Recording test results
Setting GRADLE_4_8_1_HOME=/home/jenkins/tools/gradle/4.8.1
Setting GRADLE_4_8_1_HOME=/home/jenkins/tools/gradle/4.8.1

Jenkins build is back to normal : kafka-2.0-jdk8 #117

Posted by Apache Jenkins Server <je...@builds.apache.org>.
See <https://builds.apache.org/job/kafka-2.0-jdk8/117/display/redirect?page=changes>


Build failed in Jenkins: kafka-2.0-jdk8 #116

Posted by Apache Jenkins Server <je...@builds.apache.org>.
See <https://builds.apache.org/job/kafka-2.0-jdk8/116/display/redirect?page=changes>

Changes:

[matthias] KAFKA-7284: streams should unwrap fenced exception (#5499)

------------------------------------------
[...truncated 2.48 MB...]

org.apache.kafka.streams.kstream.internals.KStreamWindowAggregateTest > testJoin STARTED

org.apache.kafka.streams.kstream.internals.KStreamWindowAggregateTest > testJoin PASSED

org.apache.kafka.streams.kstream.internals.KStreamWindowAggregateTest > shouldLogAndMeterWhenSkippingNullKey STARTED

org.apache.kafka.streams.kstream.internals.KStreamWindowAggregateTest > shouldLogAndMeterWhenSkippingNullKey PASSED

org.apache.kafka.streams.kstream.internals.KStreamSelectKeyTest > testSelectKey STARTED

org.apache.kafka.streams.kstream.internals.KStreamSelectKeyTest > testSelectKey PASSED

org.apache.kafka.streams.kstream.internals.KStreamSelectKeyTest > testTypeVariance STARTED

org.apache.kafka.streams.kstream.internals.KStreamSelectKeyTest > testTypeVariance PASSED

org.apache.kafka.streams.kstream.internals.GlobalKTableJoinsTest > shouldInnerJoinWithStream STARTED

org.apache.kafka.streams.kstream.internals.GlobalKTableJoinsTest > shouldInnerJoinWithStream PASSED

org.apache.kafka.streams.kstream.internals.GlobalKTableJoinsTest > shouldLeftJoinWithStream STARTED

org.apache.kafka.streams.kstream.internals.GlobalKTableJoinsTest > shouldLeftJoinWithStream PASSED

org.apache.kafka.streams.kstream.internals.KStreamWindowReduceTest > shouldLogAndMeterOnNullKey STARTED

org.apache.kafka.streams.kstream.internals.KStreamWindowReduceTest > shouldLogAndMeterOnNullKey PASSED

org.apache.kafka.streams.kstream.WindowsTest > retentionTimeMustNotBeNegative STARTED

org.apache.kafka.streams.kstream.WindowsTest > retentionTimeMustNotBeNegative PASSED

org.apache.kafka.streams.kstream.WindowsTest > numberOfSegmentsMustBeAtLeastTwo STARTED

org.apache.kafka.streams.kstream.WindowsTest > numberOfSegmentsMustBeAtLeastTwo PASSED

org.apache.kafka.streams.kstream.WindowsTest > shouldSetWindowRetentionTime STARTED

org.apache.kafka.streams.kstream.WindowsTest > shouldSetWindowRetentionTime PASSED

org.apache.kafka.streams.kstream.WindowsTest > shouldSetNumberOfSegments STARTED

org.apache.kafka.streams.kstream.WindowsTest > shouldSetNumberOfSegments PASSED

org.apache.kafka.streams.kstream.UnlimitedWindowsTest > startTimeMustNotBeNegative STARTED

org.apache.kafka.streams.kstream.UnlimitedWindowsTest > startTimeMustNotBeNegative PASSED

org.apache.kafka.streams.kstream.UnlimitedWindowsTest > shouldThrowOnUntil STARTED

org.apache.kafka.streams.kstream.UnlimitedWindowsTest > shouldThrowOnUntil PASSED

org.apache.kafka.streams.kstream.UnlimitedWindowsTest > shouldIncludeRecordsThatHappenedOnWindowStart STARTED

org.apache.kafka.streams.kstream.UnlimitedWindowsTest > shouldIncludeRecordsThatHappenedOnWindowStart PASSED

org.apache.kafka.streams.kstream.UnlimitedWindowsTest > shouldSetWindowStartTime STARTED

org.apache.kafka.streams.kstream.UnlimitedWindowsTest > shouldSetWindowStartTime PASSED

org.apache.kafka.streams.kstream.UnlimitedWindowsTest > shouldIncludeRecordsThatHappenedAfterWindowStart STARTED

org.apache.kafka.streams.kstream.UnlimitedWindowsTest > shouldIncludeRecordsThatHappenedAfterWindowStart PASSED

org.apache.kafka.streams.kstream.UnlimitedWindowsTest > shouldExcludeRecordsThatHappenedBeforeWindowStart STARTED

org.apache.kafka.streams.kstream.UnlimitedWindowsTest > shouldExcludeRecordsThatHappenedBeforeWindowStart PASSED

org.apache.kafka.streams.kstream.JoinWindowsTest > endTimeShouldNotBeBeforeStart STARTED

org.apache.kafka.streams.kstream.JoinWindowsTest > endTimeShouldNotBeBeforeStart PASSED

org.apache.kafka.streams.kstream.JoinWindowsTest > shouldUseWindowSizeForMaintainDurationWhenSizeLargerThanDefaultMaintainMs STARTED

org.apache.kafka.streams.kstream.JoinWindowsTest > shouldUseWindowSizeForMaintainDurationWhenSizeLargerThanDefaultMaintainMs PASSED

org.apache.kafka.streams.kstream.JoinWindowsTest > shouldHaveSaneEqualsAndHashCode STARTED

org.apache.kafka.streams.kstream.JoinWindowsTest > shouldHaveSaneEqualsAndHashCode PASSED

org.apache.kafka.streams.kstream.JoinWindowsTest > validWindows STARTED

org.apache.kafka.streams.kstream.JoinWindowsTest > validWindows PASSED

org.apache.kafka.streams.kstream.JoinWindowsTest > startTimeShouldNotBeAfterEnd STARTED

org.apache.kafka.streams.kstream.JoinWindowsTest > startTimeShouldNotBeAfterEnd PASSED

org.apache.kafka.streams.kstream.JoinWindowsTest > untilShouldSetMaintainDuration STARTED

org.apache.kafka.streams.kstream.JoinWindowsTest > untilShouldSetMaintainDuration PASSED

org.apache.kafka.streams.kstream.JoinWindowsTest > retentionTimeMustNoBeSmallerThanWindowSize STARTED

org.apache.kafka.streams.kstream.JoinWindowsTest > retentionTimeMustNoBeSmallerThanWindowSize PASSED

org.apache.kafka.streams.kstream.JoinWindowsTest > timeDifferenceMustNotBeNegative STARTED

org.apache.kafka.streams.kstream.JoinWindowsTest > timeDifferenceMustNotBeNegative PASSED

org.apache.kafka.streams.kstream.WindowTest > shouldThrowIfEndIsSmallerThanStart STARTED

org.apache.kafka.streams.kstream.WindowTest > shouldThrowIfEndIsSmallerThanStart PASSED

org.apache.kafka.streams.kstream.WindowTest > shouldNotBeEqualIfDifferentWindowType STARTED

org.apache.kafka.streams.kstream.WindowTest > shouldNotBeEqualIfDifferentWindowType PASSED

org.apache.kafka.streams.kstream.WindowTest > shouldBeEqualIfStartAndEndSame STARTED

org.apache.kafka.streams.kstream.WindowTest > shouldBeEqualIfStartAndEndSame PASSED

org.apache.kafka.streams.kstream.WindowTest > shouldNotBeEqualIfNull STARTED

org.apache.kafka.streams.kstream.WindowTest > shouldNotBeEqualIfNull PASSED

org.apache.kafka.streams.kstream.WindowTest > shouldThrowIfStartIsNegative STARTED

org.apache.kafka.streams.kstream.WindowTest > shouldThrowIfStartIsNegative PASSED

org.apache.kafka.streams.kstream.WindowTest > shouldNotBeEqualIfStartOrEndIsDifferent STARTED

org.apache.kafka.streams.kstream.WindowTest > shouldNotBeEqualIfStartOrEndIsDifferent PASSED

org.apache.kafka.streams.kstream.SessionWindowedDeserializerTest > testWindowedValueDeserializerNoArgConstructors STARTED

org.apache.kafka.streams.kstream.SessionWindowedDeserializerTest > testWindowedValueDeserializerNoArgConstructors PASSED

org.apache.kafka.streams.kstream.SessionWindowedDeserializerTest > testWindowedKeyDeserializerNoArgConstructors STARTED

org.apache.kafka.streams.kstream.SessionWindowedDeserializerTest > testWindowedKeyDeserializerNoArgConstructors PASSED

org.apache.kafka.streams.kstream.TimeWindowedSerializerTest > testWindowedValueSerializerNoArgConstructors STARTED

org.apache.kafka.streams.kstream.TimeWindowedSerializerTest > testWindowedValueSerializerNoArgConstructors PASSED

org.apache.kafka.streams.kstream.TimeWindowedSerializerTest > testWindowedKeySerializerNoArgConstructors STARTED

org.apache.kafka.streams.kstream.TimeWindowedSerializerTest > testWindowedKeySerializerNoArgConstructors PASSED

org.apache.kafka.streams.kstream.SessionWindowsTest > retentionTimeShouldBeGapIfGapIsLargerThanDefaultRetentionTime STARTED

org.apache.kafka.streams.kstream.SessionWindowsTest > retentionTimeShouldBeGapIfGapIsLargerThanDefaultRetentionTime PASSED

org.apache.kafka.streams.kstream.SessionWindowsTest > shouldSetWindowGap STARTED

org.apache.kafka.streams.kstream.SessionWindowsTest > shouldSetWindowGap PASSED

org.apache.kafka.streams.kstream.SessionWindowsTest > shouldBeEqualWhenGapAndMaintainMsAreTheSame STARTED

org.apache.kafka.streams.kstream.SessionWindowsTest > shouldBeEqualWhenGapAndMaintainMsAreTheSame PASSED

org.apache.kafka.streams.kstream.SessionWindowsTest > retentionTimeMustNotBeNegative STARTED

org.apache.kafka.streams.kstream.SessionWindowsTest > retentionTimeMustNotBeNegative PASSED

org.apache.kafka.streams.kstream.SessionWindowsTest > shouldNotBeEqualWhenMaintainMsDifferent STARTED

org.apache.kafka.streams.kstream.SessionWindowsTest > shouldNotBeEqualWhenMaintainMsDifferent PASSED

org.apache.kafka.streams.kstream.SessionWindowsTest > windowSizeMustNotBeZero STARTED

org.apache.kafka.streams.kstream.SessionWindowsTest > windowSizeMustNotBeZero PASSED

org.apache.kafka.streams.kstream.SessionWindowsTest > windowSizeMustNotBeNegative STARTED

org.apache.kafka.streams.kstream.SessionWindowsTest > windowSizeMustNotBeNegative PASSED

org.apache.kafka.streams.kstream.SessionWindowsTest > shouldSetWindowRetentionTime STARTED

org.apache.kafka.streams.kstream.SessionWindowsTest > shouldSetWindowRetentionTime PASSED

org.apache.kafka.streams.kstream.SessionWindowsTest > shouldNotBeEqualWhenGapIsDifferent STARTED

org.apache.kafka.streams.kstream.SessionWindowsTest > shouldNotBeEqualWhenGapIsDifferent PASSED

org.apache.kafka.streams.kstream.PrintedTest > shouldCreateProcessorThatPrintsToStdOut STARTED

org.apache.kafka.streams.kstream.PrintedTest > shouldCreateProcessorThatPrintsToStdOut PASSED

org.apache.kafka.streams.kstream.PrintedTest > shouldPrintWithKeyValueMapper STARTED

org.apache.kafka.streams.kstream.PrintedTest > shouldPrintWithKeyValueMapper PASSED

org.apache.kafka.streams.kstream.PrintedTest > shouldThrowTopologyExceptionIfFilePathIsEmpty STARTED

org.apache.kafka.streams.kstream.PrintedTest > shouldThrowTopologyExceptionIfFilePathIsEmpty PASSED

org.apache.kafka.streams.kstream.PrintedTest > shouldThrowNullPointerExceptionIfLabelIsNull STARTED

org.apache.kafka.streams.kstream.PrintedTest > shouldThrowNullPointerExceptionIfLabelIsNull PASSED

org.apache.kafka.streams.kstream.PrintedTest > shouldThrowNullPointerExceptionIfMapperIsNull STARTED

org.apache.kafka.streams.kstream.PrintedTest > shouldThrowNullPointerExceptionIfMapperIsNull PASSED

org.apache.kafka.streams.kstream.PrintedTest > shouldPrintWithLabel STARTED

org.apache.kafka.streams.kstream.PrintedTest > shouldPrintWithLabel PASSED

org.apache.kafka.streams.kstream.PrintedTest > shouldThrowNullPointerExceptionIfFilePathIsNull STARTED

org.apache.kafka.streams.kstream.PrintedTest > shouldThrowNullPointerExceptionIfFilePathIsNull PASSED

org.apache.kafka.streams.kstream.PrintedTest > shouldCreateProcessorThatPrintsToFile STARTED

org.apache.kafka.streams.kstream.PrintedTest > shouldCreateProcessorThatPrintsToFile PASSED

org.apache.kafka.streams.kstream.PrintedTest > shouldThrowTopologyExceptionIfFilePathDoesntExist STARTED

org.apache.kafka.streams.kstream.PrintedTest > shouldThrowTopologyExceptionIfFilePathDoesntExist PASSED

1894 tests completed, 3 failed

> Task :streams:test FAILED

FAILURE: Build failed with an exception.

* What went wrong:
Execution failed for task ':streams:test'.
> There were failing tests. See the report at: file://<https://builds.apache.org/job/kafka-2.0-jdk8/ws/streams/build/reports/tests/test/index.html>

* Try:
Run with --stacktrace option to get the stack trace. Run with --info or --debug option to get more log output. Run with --scan to get full insights.

* Get more help at https://help.gradle.org

BUILD FAILED in 4h 36m 50s
68 actionable tasks: 30 executed, 38 up-to-date
Build step 'Execute shell' marked build as failure
[FINDBUGS] Collecting findbugs analysis files...
Setting GRADLE_4_8_1_HOME=/home/jenkins/tools/gradle/4.8.1
[FINDBUGS] Searching for all files in <https://builds.apache.org/job/kafka-2.0-jdk8/ws/> that match the pattern **/build/reports/findbugs/*.xml
[FINDBUGS] Parsing 6 files in <https://builds.apache.org/job/kafka-2.0-jdk8/ws/>
[FINDBUGS] Successfully parsed file <https://builds.apache.org/job/kafka-2.0-jdk8/ws/clients/build/reports/findbugs/main.xml> with 0 unique warnings and 0 duplicates.
[FINDBUGS] Successfully parsed file <https://builds.apache.org/job/kafka-2.0-jdk8/ws/core/build/reports/findbugs/main.xml> with 0 unique warnings and 0 duplicates.
[FINDBUGS] Successfully parsed file <https://builds.apache.org/job/kafka-2.0-jdk8/ws/examples/build/reports/findbugs/main.xml> with 0 unique warnings and 0 duplicates.
[FINDBUGS] Successfully parsed file <https://builds.apache.org/job/kafka-2.0-jdk8/ws/log4j-appender/build/reports/findbugs/main.xml> with 0 unique warnings and 0 duplicates.
[FINDBUGS] Successfully parsed file <https://builds.apache.org/job/kafka-2.0-jdk8/ws/streams/build/reports/findbugs/main.xml> with 0 unique warnings and 0 duplicates.
[FINDBUGS] Successfully parsed file <https://builds.apache.org/job/kafka-2.0-jdk8/ws/streams/streams-scala/build/reports/findbugs/main.xml> with 0 unique warnings and 0 duplicates.
Setting GRADLE_4_8_1_HOME=/home/jenkins/tools/gradle/4.8.1
Setting GRADLE_4_8_1_HOME=/home/jenkins/tools/gradle/4.8.1
<Git Blamer> Using GitBlamer to create author and commit information for all warnings.
<Git Blamer> GIT_COMMIT=8ba90edd8f3b0335f68d3faa3ffccd7a114b5e89, workspace=<https://builds.apache.org/job/kafka-2.0-jdk8/ws/>
[FINDBUGS] Computing warning deltas based on reference build #114
Recording test results
Setting GRADLE_4_8_1_HOME=/home/jenkins/tools/gradle/4.8.1
Setting GRADLE_4_8_1_HOME=/home/jenkins/tools/gradle/4.8.1