You are viewing a plain text version of this content. The canonical link for it is here.
Posted to builds@beam.apache.org by Apache Jenkins Server <je...@builds.apache.org> on 2022/10/20 05:14:49 UTC
Build failed in Jenkins: beam_PreCommit_PythonDocker_Cron #3675
See <https://ci-beam.apache.org/job/beam_PreCommit_PythonDocker_Cron/3675/display/redirect?page=changes>
Changes:
[noreply] Add PytorchBatchConverter (#23296)
[noreply] Pin version to grpcio in build-requirements.txt (#23735)
[noreply] Bump up python container versions. (#23716)
[noreply] Reduce log flood in Python PostCommit flink task (#23635)
[noreply] Speed up check on website links (#23737)
------------------------------------------
[...truncated 1.48 MB...]
Removing intermediate container f44838ddbe8f
---> 31b8889097fb
Successfully built 31b8889097fb
Successfully tagged apache/beam_python3.9_sdk:2.43.0.dev
:sdks:python:container:py39:docker (Thread[Execution worker Thread 7,5,main]) completed. Took 10 mins 48.261 secs.
> Task :sdks:python:container:py310:docker
Removing intermediate container 502598c673d0
---> b6776b15ae96
Step 16/32 : RUN pip freeze --all
---> Running in b0704f360664
absl-py==1.2.0
apache-beam @ file:///opt/apache/beam/tars/apache-beam.tar.gz
astunparse==1.6.3
attrs==22.1.0
beautifulsoup4==4.11.1
bs4==0.0.1
cachetools==4.2.4
certifi==2022.9.24
cffi==1.15.1
charset-normalizer==2.1.1
click==8.1.3
cloudpickle==2.2.0
crcmod==1.7
cryptography==38.0.1
Cython==0.29.32
deprecation==2.1.0
dill==0.3.1.1
docker==6.0.0
docopt==0.6.2
exceptiongroup==1.0.0rc9
execnet==1.9.0
fastavro==1.6.1
fasteners==0.18
flatbuffers==22.9.24
freezegun==1.2.2
future==0.18.2
gast==0.4.0
google-api-core==2.10.2
google-api-python-client==2.64.0
google-apitools==0.5.31
google-auth==2.12.0
google-auth-httplib2==0.1.0
google-auth-oauthlib==0.4.6
google-cloud-bigquery==3.3.5
google-cloud-bigquery-storage==2.13.2
google-cloud-bigtable==1.7.2
google-cloud-core==2.3.2
google-cloud-datastore==1.15.5
google-cloud-dlp==3.9.2
google-cloud-language==1.3.2
google-cloud-profiler==3.1.0
google-cloud-pubsub==2.13.9
google-cloud-pubsublite==1.5.0
google-cloud-recommendations-ai==0.7.1
google-cloud-spanner==3.22.2
google-cloud-videointelligence==1.16.3
google-cloud-vision==1.0.2
google-crc32c==1.5.0
google-pasta==0.2.0
google-resumable-media==2.4.0
googleapis-common-protos==1.56.4
greenlet==1.1.3.post0
grpc-google-iam-v1==0.12.4
grpcio==1.49.1
grpcio-status==1.48.2
guppy3==3.1.2
h5py==3.7.0
hdfs==2.7.0
httplib2==0.20.4
hypothesis==6.56.2
idna==3.4
iniconfig==1.1.1
joblib==1.2.0
keras==2.10.0
Keras-Preprocessing==1.1.2
libclang==14.0.6
Markdown==3.4.1
MarkupSafe==2.1.1
mmh3==3.0.0
mock==2.0.0
nltk==3.7
nose==1.3.7
numpy==1.22.4
oauth2client==4.1.3
oauthlib==3.2.1
objsize==0.5.2
opt-einsum==3.3.0
orjson==3.8.0
overrides==6.5.0
packaging==21.3
pandas==1.4.4
parameterized==0.8.1
pbr==5.10.0
pip==22.3
pluggy==1.0.0
proto-plus==1.22.1
protobuf==3.19.6
psycopg2-binary==2.9.4
py==1.11.0
pyarrow==9.0.0
pyasn1==0.4.8
pyasn1-modules==0.2.8
pycparser==2.21
pydot==1.4.2
PyHamcrest==1.10.1
pymongo==3.12.3
PyMySQL==1.0.2
pyparsing==3.0.9
pytest==7.1.3
pytest-forked==1.4.0
pytest-timeout==2.1.0
pytest-xdist==2.5.0
python-dateutil==2.8.2
python-snappy==0.6.1
pytz==2022.4
PyYAML==6.0
regex==2022.9.13
requests==2.28.1
requests-mock==1.10.0
requests-oauthlib==1.3.1
rsa==4.9
scikit-learn==1.1.2
scipy==1.9.2
setuptools==65.5.0
six==1.16.0
sortedcontainers==2.4.0
soupsieve==2.3.2.post1
SQLAlchemy==1.4.41
sqlparse==0.4.3
tenacity==5.1.5
tensorboard==2.10.1
tensorboard-data-server==0.6.1
tensorboard-plugin-wit==1.8.1
tensorflow==2.10.0
tensorflow-estimator==2.10.0
tensorflow-io-gcs-filesystem==0.27.0
termcolor==2.0.1
testcontainers==3.7.0
threadpoolctl==3.1.0
tomli==2.0.1
tqdm==4.64.1
typing_extensions==4.4.0
uritemplate==4.1.1
urllib3==1.26.12
websocket-client==1.4.1
Werkzeug==2.2.2
wheel==0.37.1
wrapt==1.14.1
zstandard==0.18.0
Removing intermediate container b0704f360664
---> cf7e6d366d88
Step 17/32 : COPY target/LICENSE /opt/apache/beam/
---> efcf02ae5727
Step 18/32 : COPY target/LICENSE.python /opt/apache/beam/
---> 20de91a1ae11
Step 19/32 : COPY target/NOTICE /opt/apache/beam/
---> 682f5de8000f
Step 20/32 : COPY target/launcher/linux_amd64/boot /opt/apache/beam/
---> 2a229142f43e
Step 21/32 : ENTRYPOINT ["/opt/apache/beam/boot"]
---> Running in c9aef6e43a95
Removing intermediate container c9aef6e43a95
---> 869eefb25796
Step 22/32 : FROM beam as third_party_licenses
---> 869eefb25796
Step 23/32 : ARG pull_licenses
---> Running in af7c9246ddb5
Removing intermediate container af7c9246ddb5
---> 8a5c838a0e99
Step 24/32 : COPY target/license_scripts /tmp/license_scripts/
---> ba861350e492
Step 25/32 : COPY target/LICENSE target/go-licenses/* /opt/apache/beam/third_party_licenses/golang/
---> 78c4ec0581c7
Step 26/32 : RUN rm /opt/apache/beam/third_party_licenses/golang/LICENSE
---> Running in 066c53734f2e
Removing intermediate container 066c53734f2e
---> f42a37254c6b
Step 27/32 : COPY target/license_scripts /tmp/license_scripts/
---> 685b853769d8
Step 28/32 : RUN if [ "$pull_licenses" = "true" ] ; then pip install 'pip-licenses<4.0.0' pyyaml tenacity && python /tmp/license_scripts/pull_licenses_py.py ; fi
---> Running in 840b9c392e29
Collecting pip-licenses<4.0.0
Downloading pip_licenses-3.5.4-py3-none-any.whl (17 kB)
Requirement already satisfied: pyyaml in /usr/local/lib/python3.10/site-packages (6.0)
Requirement already satisfied: tenacity in /usr/local/lib/python3.10/site-packages (5.1.5)
Collecting PTable
Downloading PTable-0.9.2.tar.gz (31 kB)
Preparing metadata (setup.py): started
Preparing metadata (setup.py): finished with status 'done'
Requirement already satisfied: six>=1.9.0 in /usr/local/lib/python3.10/site-packages (from tenacity) (1.16.0)
Building wheels for collected packages: PTable
Building wheel for PTable (setup.py): started
Building wheel for PTable (setup.py): finished with status 'done'
Created wheel for PTable: filename=PTable-0.9.2-py3-none-any.whl size=22908 sha256=4d4957eb8b652375ae192ff45e3d8f852133f392ac08dd29d662cf3753a81038
Stored in directory: /root/.cache/pip/wheels/62/2a/42/c655cf57d84ab59535337af009892aaf16256a813826b465f7
Successfully built PTable
Installing collected packages: PTable, pip-licenses
Successfully installed PTable-0.9.2 pip-licenses-3.5.4
[91mWARNING: Running pip as the 'root' user can result in broken permissions and conflicting behaviour with the system package manager. It is recommended to use a virtual environment instead: https://pip.pypa.io/warnings/venv
[0mSkip pulling license for bs4
[91mINFO:root:Successfully pulled licenses for 135 dependencies
[0mRemoving intermediate container 840b9c392e29
---> 9c60fd8039d5
Step 29/32 : FROM beam
---> 869eefb25796
Step 30/32 : ARG pull_licenses
---> Running in acd1b5375f3f
Removing intermediate container acd1b5375f3f
---> c0d3f2ddb0aa
Step 31/32 : COPY --from=third_party_licenses /opt/apache/beam/third_party_licenses /opt/apache/beam/third_party_licenses
---> 79d3e852c858
Step 32/32 : RUN if [ "$pull_licenses" != "true" ] ; then rm -rf /opt/apache/beam/third_party_licenses ; fi
---> Running in 371dbc4417bf
> Task :sdks:python:container:py38:docker
Removing intermediate container d0e36a4dac52
---> 7d93b95cb98c
Successfully built 7d93b95cb98c
Successfully tagged apache/beam_python3.8_sdk:2.43.0.dev
:sdks:python:container:py38:docker (Thread[included builds,5,main]) completed. Took 10 mins 48.342 secs.
> Task :sdks:python:container:py310:docker
Removing intermediate container 371dbc4417bf
---> d88d6b40a1a9
Successfully built d88d6b40a1a9
Successfully tagged apache/beam_python3.10_sdk:2.43.0.dev
:sdks:python:container:py310:docker (Thread[Execution worker,5,main]) completed. Took 10 mins 48.403 secs.
FAILURE: Build failed with an exception.
* What went wrong:
Execution failed for task ':sdks:python:container:py37:docker'.
> Process 'command 'docker'' finished with non-zero exit value 2
* Try:
> Run with --stacktrace option to get the stack trace.
> Run with --debug option to get more log output.
* Get more help at https://help.gradle.org
BUILD FAILED in 12m 19s
50 actionable tasks: 39 executed, 4 from cache, 7 up-to-date
Publishing build scan...
https://gradle.com/s/n36h4d537ysjq
Build step 'Invoke Gradle script' changed build result to FAILURE
Build step 'Invoke Gradle script' marked build as failure
---------------------------------------------------------------------
To unsubscribe, e-mail: builds-unsubscribe@beam.apache.org
For additional commands, e-mail: builds-help@beam.apache.org
Jenkins build is back to normal : beam_PreCommit_PythonDocker_Cron #3676
Posted by Apache Jenkins Server <je...@builds.apache.org>.
See <https://ci-beam.apache.org/job/beam_PreCommit_PythonDocker_Cron/3676/display/redirect>
---------------------------------------------------------------------
To unsubscribe, e-mail: builds-unsubscribe@beam.apache.org
For additional commands, e-mail: builds-help@beam.apache.org