You are viewing a plain text version of this content. The canonical link for it is here.
Posted to builds@beam.apache.org by Apache Jenkins Server <je...@builds.apache.org> on 2023/09/21 18:37:50 UTC

Build failed in Jenkins: beam_PostCommit_Java_Examples_Spark #2167

See <https://ci-beam.apache.org/job/beam_PostCommit_Java_Examples_Spark/2167/display/redirect>

Changes:


------------------------------------------
Started by timer
Running as SYSTEM
[EnvInject] - Loading node environment variables.
Building remotely on apache-beam-jenkins-14 (beam) in workspace <https://ci-beam.apache.org/job/beam_PostCommit_Java_Examples_Spark/ws/>
The recommended git tool is: NONE
No credentials specified
Wiping out workspace first.
Cloning the remote Git repository
Using shallow clone with depth 1
Avoid fetching tags
Cloning repository https://github.com/apache/beam.git
 > git init <https://ci-beam.apache.org/job/beam_PostCommit_Java_Examples_Spark/ws/src> # timeout=10
Fetching upstream changes from https://github.com/apache/beam.git
 > git --version # timeout=10
 > git --version # 'git version 2.25.1'
 > git fetch --no-tags --force --progress --depth=1 -- https://github.com/apache/beam.git +refs/heads/*:refs/remotes/origin/* # timeout=10
 > git config remote.origin.url https://github.com/apache/beam.git # timeout=10
 > git config --add remote.origin.fetch +refs/heads/*:refs/remotes/origin/* # timeout=10
 > git config remote.origin.url https://github.com/apache/beam.git # timeout=10
Using shallow fetch with depth 1
Fetching upstream changes from https://github.com/apache/beam.git
 > git fetch --no-tags --force --progress --depth=1 -- https://github.com/apache/beam.git +refs/heads/*:refs/remotes/origin/* +refs/pull/${ghprbPullId}/*:refs/remotes/origin/pr/${ghprbPullId}/* # timeout=10
 > git rev-parse origin/master^{commit} # timeout=10
Checking out Revision 18ce60c2d9a41d01c7716fc85aeb1a554532d99e (origin/master)
 > git config core.sparsecheckout # timeout=10
 > git checkout -f 18ce60c2d9a41d01c7716fc85aeb1a554532d99e # timeout=10
Commit message: "Add Load Tests GBK Dataflow Batch Go workflow (#28449)"
 > git rev-list --no-walk a0d014ae36f5e0b3384e38d4646ed7d30120867e # timeout=10
First time build. Skipping changelog.
No emails were triggered.
[EnvInject] - Executing scripts and injecting environment variables after the SCM step.
[EnvInject] - Injecting as environment variables the properties content 
SETUPTOOLS_USE_DISTUTILS=stdlib
SPARK_LOCAL_IP=127.0.0.1

[EnvInject] - Variables injected successfully.
[Gradle] - Launching build.
[src] $ <https://ci-beam.apache.org/job/beam_PostCommit_Java_Examples_Spark/ws/src/gradlew> --continue --max-workers=8 -Dorg.gradle.jvmargs=-Xms2g -Dorg.gradle.jvmargs=-Xmx6g -Dorg.gradle.vfs.watch=false -Pdocker-pull-licenses :runners:spark:3:examplesIntegrationTest
To honour the JVM settings for this build a single-use Daemon process will be forked. See https://docs.gradle.org/7.6.2/userguide/gradle_daemon.html#sec:disabling_the_daemon.
Daemon will be stopped at the end of the build 
Configuration on demand is an incubating feature.
Gradle Enterprise plugins resolution: https://plugins.gradle.org/m2
Enforcing Gradle Enterprise: https://ge.apache.org, allowUntrustedServer: false
> Task :buildSrc:compileJava NO-SOURCE
> Task :buildSrc:compileGroovy
> Task :buildSrc:compileGroovy FAILED
> Task :buildSrc:pluginDescriptors
> Task :buildSrc:processResources
> Task :buildSrc:spotlessGroovy
> Task :buildSrc:spotlessGroovy FAILED
> Task :buildSrc:spotlessGroovyGradle
> Task :buildSrc:spotlessGroovyGradle FAILED
> Task :buildSrc:processTestResources NO-SOURCE

FAILURE: Build completed with 3 failures.

1: Task failed with an exception.
-----------
* What went wrong:
Execution failed for task ':buildSrc:compileGroovy'.
> Failed to load cache entry 8b74e8525d30441d262cc43b5c1d3028 for task ':buildSrc:compileGroovy': Could not load from local cache: Timeout waiting to lock Build cache (/home/jenkins/.gradle/caches/build-cache-1). It is currently in use by another Gradle instance.
  Owner PID: 2416188
  Our PID: 2440157
  Owner Operation: 
  Our operation: 
  Lock file: /home/jenkins/.gradle/caches/build-cache-1/build-cache-1.lock

* Try:
> Run with --stacktrace option to get the stack trace.
> Run with --info or --debug option to get more log output.
==============================================================================

2: Task failed with an exception.
-----------
* What went wrong:
Execution failed for task ':buildSrc:spotlessGroovy'.
> Failed to load cache entry f84f2cfa2297abdaa2550ec10ca4768d for task ':buildSrc:spotlessGroovy': Could not load from local cache: Timeout waiting to lock Build cache (/home/jenkins/.gradle/caches/build-cache-1). It is currently in use by another Gradle instance.
  Owner PID: 2416188
  Our PID: 2440157
  Owner Operation: 
  Our operation: 
  Lock file: /home/jenkins/.gradle/caches/build-cache-1/build-cache-1.lock

* Try:
> Run with --stacktrace option to get the stack trace.
> Run with --info or --debug option to get more log output.
==============================================================================

3: Task failed with an exception.
-----------
* What went wrong:
Execution failed for task ':buildSrc:spotlessGroovyGradle'.
> Failed to load cache entry 24f9b7cba777e3dcc4c65ace7f2c5bc0 for task ':buildSrc:spotlessGroovyGradle': Could not load from local cache: Timeout waiting to lock Build cache (/home/jenkins/.gradle/caches/build-cache-1). It is currently in use by another Gradle instance.
  Owner PID: 2416188
  Our PID: 2440157
  Owner Operation: 
  Our operation: 
  Lock file: /home/jenkins/.gradle/caches/build-cache-1/build-cache-1.lock

* Try:
> Run with --stacktrace option to get the stack trace.
> Run with --info or --debug option to get more log output.
==============================================================================

* Get more help at https://help.gradle.org

BUILD FAILED in 3m 11s
5 actionable tasks: 5 executed

Publishing build scan...
https://ge.apache.org/s/ljmik6agiywdm

Build step 'Invoke Gradle script' changed build result to FAILURE
Build step 'Invoke Gradle script' marked build as failure

---------------------------------------------------------------------
To unsubscribe, e-mail: builds-unsubscribe@beam.apache.org
For additional commands, e-mail: builds-help@beam.apache.org


Jenkins build is back to normal : beam_PostCommit_Java_Examples_Spark #2168

Posted by Apache Jenkins Server <je...@builds.apache.org>.
See <https://ci-beam.apache.org/job/beam_PostCommit_Java_Examples_Spark/2168/display/redirect>


---------------------------------------------------------------------
To unsubscribe, e-mail: builds-unsubscribe@beam.apache.org
For additional commands, e-mail: builds-help@beam.apache.org