You are viewing a plain text version of this content. The canonical link for it is here.
Posted to builds@beam.apache.org by Apache Jenkins Server <je...@builds.apache.org> on 2020/08/17 00:21:48 UTC

Build failed in Jenkins: beam_PostCommit_Py_ValCont #6714

See <https://ci-beam.apache.org/job/beam_PostCommit_Py_ValCont/6714/display/redirect>

Changes:


------------------------------------------
[...truncated 695.42 KB...]
copying apache_beam/testing/load_tests/__init__.py -> apache-beam-2.25.0.dev0/apache_beam/testing/load_tests
copying apache_beam/testing/load_tests/co_group_by_key_test.py -> apache-beam-2.25.0.dev0/apache_beam/testing/load_tests
copying apache_beam/testing/load_tests/combine_test.py -> apache-beam-2.25.0.dev0/apache_beam/testing/load_tests
copying apache_beam/testing/load_tests/group_by_key_test.py -> apache-beam-2.25.0.dev0/apache_beam/testing/load_tests
copying apache_beam/testing/load_tests/load_test.py -> apache-beam-2.25.0.dev0/apache_beam/testing/load_tests
copying apache_beam/testing/load_tests/load_test_metrics_utils.py -> apache-beam-2.25.0.dev0/apache_beam/testing/load_tests
copying apache_beam/testing/load_tests/pardo_test.py -> apache-beam-2.25.0.dev0/apache_beam/testing/load_tests
copying apache_beam/testing/load_tests/sideinput_test.py -> apache-beam-2.25.0.dev0/apache_beam/testing/load_tests
copying apache_beam/testing/load_tests/streaming/__init__.py -> apache-beam-2.25.0.dev0/apache_beam/testing/load_tests/streaming
copying apache_beam/testing/load_tests/streaming/group_by_key_streaming_pipeline.py -> apache-beam-2.25.0.dev0/apache_beam/testing/load_tests/streaming
copying apache_beam/testing/load_tests/streaming/group_by_key_streaming_test.py -> apache-beam-2.25.0.dev0/apache_beam/testing/load_tests/streaming
copying apache_beam/tools/__init__.py -> apache-beam-2.25.0.dev0/apache_beam/tools
copying apache_beam/tools/coders_microbenchmark.py -> apache-beam-2.25.0.dev0/apache_beam/tools
copying apache_beam/tools/distribution_counter_microbenchmark.py -> apache-beam-2.25.0.dev0/apache_beam/tools
copying apache_beam/tools/fn_api_runner_microbenchmark.py -> apache-beam-2.25.0.dev0/apache_beam/tools
copying apache_beam/tools/map_fn_microbenchmark.py -> apache-beam-2.25.0.dev0/apache_beam/tools
copying apache_beam/tools/microbenchmarks_test.py -> apache-beam-2.25.0.dev0/apache_beam/tools
copying apache_beam/tools/sideinput_microbenchmark.py -> apache-beam-2.25.0.dev0/apache_beam/tools
copying apache_beam/tools/utils.py -> apache-beam-2.25.0.dev0/apache_beam/tools
copying apache_beam/transforms/__init__.py -> apache-beam-2.25.0.dev0/apache_beam/transforms
copying apache_beam/transforms/combiners.py -> apache-beam-2.25.0.dev0/apache_beam/transforms
copying apache_beam/transforms/combiners_test.py -> apache-beam-2.25.0.dev0/apache_beam/transforms
copying apache_beam/transforms/core.py -> apache-beam-2.25.0.dev0/apache_beam/transforms
copying apache_beam/transforms/create_source.py -> apache-beam-2.25.0.dev0/apache_beam/transforms
copying apache_beam/transforms/create_test.py -> apache-beam-2.25.0.dev0/apache_beam/transforms
copying apache_beam/transforms/cy_combiners.pxd -> apache-beam-2.25.0.dev0/apache_beam/transforms
copying apache_beam/transforms/cy_combiners.py -> apache-beam-2.25.0.dev0/apache_beam/transforms
copying apache_beam/transforms/cy_dataflow_distribution_counter.pxd -> apache-beam-2.25.0.dev0/apache_beam/transforms
copying apache_beam/transforms/cy_dataflow_distribution_counter.pyx -> apache-beam-2.25.0.dev0/apache_beam/transforms
copying apache_beam/transforms/dataflow_distribution_counter_test.py -> apache-beam-2.25.0.dev0/apache_beam/transforms
copying apache_beam/transforms/deduplicate.py -> apache-beam-2.25.0.dev0/apache_beam/transforms
copying apache_beam/transforms/deduplicate_test.py -> apache-beam-2.25.0.dev0/apache_beam/transforms
copying apache_beam/transforms/display.py -> apache-beam-2.25.0.dev0/apache_beam/transforms
copying apache_beam/transforms/display_test.py -> apache-beam-2.25.0.dev0/apache_beam/transforms
copying apache_beam/transforms/dofn_lifecycle_test.py -> apache-beam-2.25.0.dev0/apache_beam/transforms
copying apache_beam/transforms/environments.py -> apache-beam-2.25.0.dev0/apache_beam/transforms
copying apache_beam/transforms/environments_test.py -> apache-beam-2.25.0.dev0/apache_beam/transforms
copying apache_beam/transforms/external.py -> apache-beam-2.25.0.dev0/apache_beam/transforms
copying apache_beam/transforms/external_it_test.py -> apache-beam-2.25.0.dev0/apache_beam/transforms
copying apache_beam/transforms/external_java.py -> apache-beam-2.25.0.dev0/apache_beam/transforms
copying apache_beam/transforms/external_test.py -> apache-beam-2.25.0.dev0/apache_beam/transforms
copying apache_beam/transforms/external_test_py3.py -> apache-beam-2.25.0.dev0/apache_beam/transforms
copying apache_beam/transforms/external_test_py37.py -> apache-beam-2.25.0.dev0/apache_beam/transforms
copying apache_beam/transforms/periodicsequence.py -> apache-beam-2.25.0.dev0/apache_beam/transforms
copying apache_beam/transforms/periodicsequence_test.py -> apache-beam-2.25.0.dev0/apache_beam/transforms
copying apache_beam/transforms/ptransform.py -> apache-beam-2.25.0.dev0/apache_beam/transforms
copying apache_beam/transforms/ptransform_test.py -> apache-beam-2.25.0.dev0/apache_beam/transforms
copying apache_beam/transforms/py_dataflow_distribution_counter.py -> apache-beam-2.25.0.dev0/apache_beam/transforms
copying apache_beam/transforms/sideinputs.py -> apache-beam-2.25.0.dev0/apache_beam/transforms
copying apache_beam/transforms/sideinputs_test.py -> apache-beam-2.25.0.dev0/apache_beam/transforms
copying apache_beam/transforms/sql.py -> apache-beam-2.25.0.dev0/apache_beam/transforms
copying apache_beam/transforms/sql_test.py -> apache-beam-2.25.0.dev0/apache_beam/transforms
copying apache_beam/transforms/stats.py -> apache-beam-2.25.0.dev0/apache_beam/transforms
copying apache_beam/transforms/stats_test.py -> apache-beam-2.25.0.dev0/apache_beam/transforms
copying apache_beam/transforms/timeutil.py -> apache-beam-2.25.0.dev0/apache_beam/transforms
copying apache_beam/transforms/transforms_keyword_only_args_test_py3.py -> apache-beam-2.25.0.dev0/apache_beam/transforms
copying apache_beam/transforms/trigger.py -> apache-beam-2.25.0.dev0/apache_beam/transforms
copying apache_beam/transforms/trigger_test.py -> apache-beam-2.25.0.dev0/apache_beam/transforms
copying apache_beam/transforms/userstate.py -> apache-beam-2.25.0.dev0/apache_beam/transforms
copying apache_beam/transforms/userstate_test.py -> apache-beam-2.25.0.dev0/apache_beam/transforms
copying apache_beam/transforms/util.py -> apache-beam-2.25.0.dev0/apache_beam/transforms
copying apache_beam/transforms/util_test.py -> apache-beam-2.25.0.dev0/apache_beam/transforms
copying apache_beam/transforms/validate_runner_xlang_test.py -> apache-beam-2.25.0.dev0/apache_beam/transforms
copying apache_beam/transforms/window.py -> apache-beam-2.25.0.dev0/apache_beam/transforms
copying apache_beam/transforms/window_test.py -> apache-beam-2.25.0.dev0/apache_beam/transforms
copying apache_beam/transforms/write_ptransform_test.py -> apache-beam-2.25.0.dev0/apache_beam/transforms
copying apache_beam/typehints/__init__.py -> apache-beam-2.25.0.dev0/apache_beam/typehints
copying apache_beam/typehints/decorators.py -> apache-beam-2.25.0.dev0/apache_beam/typehints
copying apache_beam/typehints/decorators_test.py -> apache-beam-2.25.0.dev0/apache_beam/typehints
copying apache_beam/typehints/decorators_test_py3.py -> apache-beam-2.25.0.dev0/apache_beam/typehints
copying apache_beam/typehints/native_type_compatibility.py -> apache-beam-2.25.0.dev0/apache_beam/typehints
copying apache_beam/typehints/native_type_compatibility_test.py -> apache-beam-2.25.0.dev0/apache_beam/typehints
copying apache_beam/typehints/opcodes.py -> apache-beam-2.25.0.dev0/apache_beam/typehints
copying apache_beam/typehints/row_type.py -> apache-beam-2.25.0.dev0/apache_beam/typehints
copying apache_beam/typehints/schemas.py -> apache-beam-2.25.0.dev0/apache_beam/typehints
copying apache_beam/typehints/schemas_test.py -> apache-beam-2.25.0.dev0/apache_beam/typehints
copying apache_beam/typehints/trivial_inference.py -> apache-beam-2.25.0.dev0/apache_beam/typehints
copying apache_beam/typehints/trivial_inference_test.py -> apache-beam-2.25.0.dev0/apache_beam/typehints
copying apache_beam/typehints/trivial_inference_test_py3.py -> apache-beam-2.25.0.dev0/apache_beam/typehints
copying apache_beam/typehints/typecheck.py -> apache-beam-2.25.0.dev0/apache_beam/typehints
copying apache_beam/typehints/typecheck_test_py3.py -> apache-beam-2.25.0.dev0/apache_beam/typehints
copying apache_beam/typehints/typed_pipeline_test.py -> apache-beam-2.25.0.dev0/apache_beam/typehints
copying apache_beam/typehints/typed_pipeline_test_py3.py -> apache-beam-2.25.0.dev0/apache_beam/typehints
copying apache_beam/typehints/typehints.py -> apache-beam-2.25.0.dev0/apache_beam/typehints
copying apache_beam/typehints/typehints_test.py -> apache-beam-2.25.0.dev0/apache_beam/typehints
copying apache_beam/typehints/typehints_test_py3.py -> apache-beam-2.25.0.dev0/apache_beam/typehints
copying apache_beam/utils/__init__.py -> apache-beam-2.25.0.dev0/apache_beam/utils
copying apache_beam/utils/annotations.py -> apache-beam-2.25.0.dev0/apache_beam/utils
copying apache_beam/utils/annotations_test.py -> apache-beam-2.25.0.dev0/apache_beam/utils
copying apache_beam/utils/counters.pxd -> apache-beam-2.25.0.dev0/apache_beam/utils
copying apache_beam/utils/counters.py -> apache-beam-2.25.0.dev0/apache_beam/utils
copying apache_beam/utils/counters_test.py -> apache-beam-2.25.0.dev0/apache_beam/utils
copying apache_beam/utils/interactive_utils.py -> apache-beam-2.25.0.dev0/apache_beam/utils
copying apache_beam/utils/plugin.py -> apache-beam-2.25.0.dev0/apache_beam/utils
copying apache_beam/utils/processes.py -> apache-beam-2.25.0.dev0/apache_beam/utils
copying apache_beam/utils/processes_test.py -> apache-beam-2.25.0.dev0/apache_beam/utils
copying apache_beam/utils/profiler.py -> apache-beam-2.25.0.dev0/apache_beam/utils
copying apache_beam/utils/proto_utils.py -> apache-beam-2.25.0.dev0/apache_beam/utils
copying apache_beam/utils/retry.py -> apache-beam-2.25.0.dev0/apache_beam/utils
copying apache_beam/utils/retry_test.py -> apache-beam-2.25.0.dev0/apache_beam/utils
copying apache_beam/utils/shared.py -> apache-beam-2.25.0.dev0/apache_beam/utils
copying apache_beam/utils/shared_test.py -> apache-beam-2.25.0.dev0/apache_beam/utils
copying apache_beam/utils/subprocess_server.py -> apache-beam-2.25.0.dev0/apache_beam/utils
copying apache_beam/utils/subprocess_server_test.py -> apache-beam-2.25.0.dev0/apache_beam/utils
copying apache_beam/utils/thread_pool_executor.py -> apache-beam-2.25.0.dev0/apache_beam/utils
copying apache_beam/utils/thread_pool_executor_test.py -> apache-beam-2.25.0.dev0/apache_beam/utils
copying apache_beam/utils/timestamp.py -> apache-beam-2.25.0.dev0/apache_beam/utils
copying apache_beam/utils/timestamp_test.py -> apache-beam-2.25.0.dev0/apache_beam/utils
copying apache_beam/utils/urns.py -> apache-beam-2.25.0.dev0/apache_beam/utils
copying apache_beam/utils/windowed_value.pxd -> apache-beam-2.25.0.dev0/apache_beam/utils
copying apache_beam/utils/windowed_value.py -> apache-beam-2.25.0.dev0/apache_beam/utils
copying apache_beam/utils/windowed_value_test.py -> apache-beam-2.25.0.dev0/apache_beam/utils
Writing apache-beam-2.25.0.dev0/setup.cfg
creating dist
Creating tar archive
removing 'apache-beam-2.25.0.dev0' (and everything under it)
SDK_LOCATION=$(find dist/apache-beam-*.tar.gz)
find dist/apache-beam-*.tar.gz

# Run ValidatesRunner tests on Google Cloud Dataflow service
echo ">>> RUNNING DATAFLOW RUNNER VALIDATESCONTAINER TEST"
>>> RUNNING DATAFLOW RUNNER VALIDATESCONTAINER TEST
python setup.py nosetests \
  --attr ValidatesContainer \
  --nologcapture \
  --processes=1 \
  --process-timeout=900 \
  --with-xunitmp \
  --xunitmp-file=$XUNIT_FILE \
  --ignore-files '.*py3\d?\.py$' \
  --test-pipeline-options=" \
    --runner=TestDataflowRunner \
    --project=$PROJECT \
    --region=$REGION \
    --worker_harness_container_image=$CONTAINER:$TAG \
    --staging_location=$GCS_LOCATION/staging-validatesrunner-test \
    --temp_location=$GCS_LOCATION/temp-validatesrunner-test \
    --output=$GCS_LOCATION/output \
    --sdk_location=$SDK_LOCATION \
    --num_workers=1"
setup.py:266: UserWarning: You are using the final Apache Beam release with Python 2 support. New releases of Apache Beam will require Python 3.6 or a newer version.
  'You are using the final Apache Beam release with Python 2 support. '
<https://ci-beam.apache.org/job/beam_PostCommit_Py_ValCont/ws/src/sdks/python/container/venv/python/local/lib/python2.7/site-packages/setuptools/dist.py>:476: UserWarning: Normalizing '2.25.0.dev' to '2.25.0.dev0'
  normalized_version,
running nosetests
running egg_info
<https://ci-beam.apache.org/job/beam_PostCommit_Py_ValCont/ws/src/sdks/python/gen_protos.py>:241: UserWarning: Installing grpcio-tools is recommended for development.
  warnings.warn('Installing grpcio-tools is recommended for development.')
INFO:gen_protos:Skipping proto regeneration: all files up to date
writing requirements to apache_beam.egg-info/requires.txt
writing apache_beam.egg-info/PKG-INFO
writing top-level names to apache_beam.egg-info/top_level.txt
writing dependency_links to apache_beam.egg-info/dependency_links.txt
writing entry points to apache_beam.egg-info/entry_points.txt
reading manifest file 'apache_beam.egg-info/SOURCES.txt'
reading manifest template 'MANIFEST.in'
warning: no files found matching 'README.md'
warning: no files found matching 'NOTICE'
warning: no files found matching 'LICENSE'
writing manifest file 'apache_beam.egg-info/SOURCES.txt'
<https://ci-beam.apache.org/job/beam_PostCommit_Py_ValCont/ws/src/sdks/python/apache_beam/__init__.py>:82: UserWarning: You are using the final Apache Beam release with Python 2 support. New releases of Apache Beam will require Python 3.6 or a newer version.
  'You are using the final Apache Beam release with Python 2 support. '
WARNING:root:python-snappy is not installed; some tests will be skipped.
WARNING:root:Tensorflow is not installed, so skipping some tests.
WARNING:apache_beam.runners.interactive.interactive_environment:Interactive Beam requires Python 3.5.3+.
WARNING:apache_beam.runners.interactive.interactive_environment:Dependencies required for Interactive Beam PCollection visualization are not available, please use: `pip install apache-beam[interactive]` to install necessary dependencies to enable all data visualization features.
WARNING:apache_beam.runners.interactive.interactive_environment:You cannot use Interactive Beam features when you are not in an interactive environment such as a Jupyter notebook or ipython terminal.
WARNING:root:Make sure that locally built Python SDK docker image has Python 2.7 interpreter.
WARNING:root:Make sure that locally built Python SDK docker image has Python 2.7 interpreter.
test_wordcount_fnapi_it (apache_beam.examples.wordcount_it_test.WordCountIT) ... FAIL
WARNING:root:Make sure that locally built Python SDK docker image has Python 2.7 interpreter.
test_metrics_fnapi_it (apache_beam.runners.dataflow.dataflow_exercise_metrics_pipeline_test.ExerciseMetricsPipelineTest) ... ok

======================================================================
FAIL: test_wordcount_fnapi_it (apache_beam.examples.wordcount_it_test.WordCountIT)
----------------------------------------------------------------------
Traceback (most recent call last):
  File "<https://ci-beam.apache.org/job/beam_PostCommit_Py_ValCont/ws/src/sdks/python/apache_beam/examples/wordcount_it_test.py",> line 57, in test_wordcount_fnapi_it
    self._run_wordcount_it(wordcount.run, experiment='beam_fn_api')
  File "<https://ci-beam.apache.org/job/beam_PostCommit_Py_ValCont/ws/src/sdks/python/apache_beam/examples/wordcount_it_test.py",> line 100, in _run_wordcount_it
    save_main_session=False,
  File "<https://ci-beam.apache.org/job/beam_PostCommit_Py_ValCont/ws/src/sdks/python/apache_beam/examples/wordcount.py",> line 94, in run
    output | 'Write' >> WriteToText(known_args.output)
  File "<https://ci-beam.apache.org/job/beam_PostCommit_Py_ValCont/ws/src/sdks/python/apache_beam/pipeline.py",> line 555, in __exit__
    self.result = self.run()
  File "<https://ci-beam.apache.org/job/beam_PostCommit_Py_ValCont/ws/src/sdks/python/apache_beam/pipeline.py",> line 521, in run
    allow_proto_holders=True).run(False)
  File "<https://ci-beam.apache.org/job/beam_PostCommit_Py_ValCont/ws/src/sdks/python/apache_beam/pipeline.py",> line 534, in run
    return self.runner.run_pipeline(self, self._options)
  File "<https://ci-beam.apache.org/job/beam_PostCommit_Py_ValCont/ws/src/sdks/python/apache_beam/runners/dataflow/test_dataflow_runner.py",> line 72, in run_pipeline
    hc_assert_that(self.result, pickler.loads(on_success_matcher))
AssertionError: 
Expected: (Test pipeline expected terminated in state: DONE and Expected checksum is 33535a832b7db6d78389759577d4ff495980b9c0)
     but: Test pipeline expected terminated in state: DONE Test pipeline job terminated in state: FAILED

-------------------- >> begin captured stdout << ---------------------
Worker logs: https://console.cloud.google.com/dataflow/jobs/us-central1/2020-08-16_17_16_27-15103053301806140394?project=apache-beam-testing

--------------------- >> end captured stdout << ----------------------

----------------------------------------------------------------------
XML: nosetests-beam_python2.7_sdk.xml
----------------------------------------------------------------------
XML: <https://ci-beam.apache.org/job/beam_PostCommit_Py_ValCont/ws/src/sdks/python/nosetests.xml>
----------------------------------------------------------------------
Ran 2 tests in 322.496s

FAILED (failures=1)
cleanup_container
Untagged: us.gcr.io/apache-beam-testing/jenkins/beam_python2.7_sdk:20200817-000033
Untagged: us.gcr.io/apache-beam-testing/jenkins/beam_python2.7_sdk@sha256:9b489505ccd2ca48def3c36dc9915b88dd87c905443c0cb6868e7da03838a6d8
Deleted: sha256:6074c8f2975c7b1550cf130c7214abb2e15aaab3043608241c66efe458e40fea
Deleted: sha256:01df7ebca88aa0909939dc432524c25f31980a2240df10c22b1171158397c358
Deleted: sha256:b039b850c6c392f201990647773048471fafd96ab720083f5a1d6742d939a331
Deleted: sha256:b4026ca990955930effebd9579058a4d146bf12ca1195bce8962c03594286bdc
Deleted: sha256:d0a020e05bfbdda576f90233dc996158d8038feaa4d19613e300c461a7633b4f
Deleted: sha256:2e53ca7f3953889ab51ae16246b120b8e7f48012e6f70bc9a6dd2d6c81691cd4
Deleted: sha256:e3343b5f2e660998065723790d9638faae3a408497757d9314c88c6508e423ae
Deleted: sha256:f0b085146fe9ad96d90a51674c5195bf99e68b3369071ab6f45f874460489f26
Deleted: sha256:273f85f0e4e921fd0b05fc133d8ae7aaafd9f0010ffd1448efc2467b22fa9683
Deleted: sha256:a7913814ed93cafb82fad09266266465bc48a4f1814c60f20cfae82e9fcf1a64
Deleted: sha256:fc60a1831e911ecdef767fff22be53e311613ce3e3358b81ee5ad13e618e7e29
Deleted: sha256:7c2d521fe725b30682383be15d0e9805d6de18cd91b5d408dc57c8b2323d06ee
Deleted: sha256:d630d19eff2ce2e0870ce7b9970f484d0f3398285b23c4b84f96b0c9ebbe9c60
Deleted: sha256:7f4e78cfc3cc29ef60b1120bd97a2d9bac9b029b3963a5470a27c166ce192115
Deleted: sha256:afe881858513259f3b1a8ef00f3ab021c64e04e50e19b5adcbb0498fdf45ec99
Deleted: sha256:2eccdd46f4f2eeada6913cc6b0d659d08f3efcd918314ef5c2ed16e2b385f0e5
Deleted: sha256:8d296f55c23bb40187e581f92028fd2416cdd2f5e45793522864359f642db235
Deleted: sha256:ba311fdfd098c4a5639821e5b33fb19c76000e4f76973d087fcb36577aa1395e
Deleted: sha256:65128e7d4c7145f094897eb4d62cffce13280d2419be2d26f4ea72d0443a3aa2
Deleted: sha256:7fe8a9d747bf67efb631d4e14b34b88db92690fafa389b64021231b607252477
Deleted: sha256:56548bc39a122bd4ce14dd2a9a6ca831668132b85a96c75abd15788916f8ff3d
Deleted: sha256:2782a0c05d1a350c48a2600edf0d37d87df12b26db5bbaf7b991389dc8b9ded6
Deleted: sha256:2d8cb4b0dcc2b73a39a2c164a9ec010f29954c660008308e879c42ea04951e50
Deleted: sha256:5d32fd6caa0018e1a2da53a8068092271cdc31550e62847cd14acce50d9a11d9
Deleted: sha256:b110ad5a649e398ac9902bb1816800d9557996e89a41bdc829aef847a7967d68
Deleted: sha256:38e09bc534b21d73ee4f6bc7029efaf24871e4092ae6967e0d51bb833ce32926
Deleted: sha256:87a16f209e862123b4f81a1053f6175737bd4f1fcbd8000738052d797701381c
Deleted: sha256:6f830ac8491a871db6a9f94890b0d00c4588862f9f4aec271beb1d9b799f53de
Digests:
- us.gcr.io/apache-beam-testing/jenkins/beam_python2.7_sdk@sha256:9b489505ccd2ca48def3c36dc9915b88dd87c905443c0cb6868e7da03838a6d8
  Associated tags:
 - 20200817-000033
Tags:
- us.gcr.io/apache-beam-testing/jenkins/beam_python2.7_sdk:20200817-000033
Deleted [us.gcr.io/apache-beam-testing/jenkins/beam_python2.7_sdk:20200817-000033].
Deleted [us.gcr.io/apache-beam-testing/jenkins/beam_python2.7_sdk@sha256:9b489505ccd2ca48def3c36dc9915b88dd87c905443c0cb6868e7da03838a6d8].
Removed the container
Build step 'Execute shell' marked build as failure

---------------------------------------------------------------------
To unsubscribe, e-mail: builds-unsubscribe@beam.apache.org
For additional commands, e-mail: builds-help@beam.apache.org


Jenkins build is back to normal : beam_PostCommit_Py_ValCont #6717

Posted by Apache Jenkins Server <je...@builds.apache.org>.
See <https://ci-beam.apache.org/job/beam_PostCommit_Py_ValCont/6717/display/redirect?page=changes>


---------------------------------------------------------------------
To unsubscribe, e-mail: builds-unsubscribe@beam.apache.org
For additional commands, e-mail: builds-help@beam.apache.org


Build failed in Jenkins: beam_PostCommit_Py_ValCont #6716

Posted by Apache Jenkins Server <je...@builds.apache.org>.
See <https://ci-beam.apache.org/job/beam_PostCommit_Py_ValCont/6716/display/redirect>

Changes:


------------------------------------------
[...truncated 2.12 MB...]
Ignoring scipy: markers 'python_version <= "2.7"' don't match your environment
Ignoring pandas: markers 'python_version <= "2.7"' don't match your environment
Ignoring tensorflow: markers 'python_version <= "2.7"' don't match your environment
Collecting avro-python3==1.8.2
  Downloading avro-python3-1.8.2.tar.gz (36 kB)
Collecting fastavro==0.23.3
  Downloading fastavro-0.23.3-cp37-cp37m-manylinux2010_x86_64.whl (1.4 MB)
Collecting crcmod==1.7
  Downloading crcmod-1.7.tar.gz (89 kB)
Collecting dill==0.3.1.1
  Downloading dill-0.3.1.1.tar.gz (151 kB)
Collecting future==0.18.2
  Downloading future-0.18.2.tar.gz (829 kB)
Collecting grpcio==1.29.0
  Downloading grpcio-1.29.0-cp37-cp37m-manylinux2010_x86_64.whl (3.0 MB)
Collecting hdfs==2.5.8
  Downloading hdfs-2.5.8.tar.gz (41 kB)
Collecting httplib2==0.12.0
  Downloading httplib2-0.12.0.tar.gz (218 kB)
Collecting mock==2.0.0
  Downloading mock-2.0.0-py2.py3-none-any.whl (56 kB)
Collecting oauth2client==3.0.0
  Downloading oauth2client-3.0.0.tar.gz (77 kB)
Collecting protobuf==3.12.2
  Downloading protobuf-3.12.2-cp37-cp37m-manylinux1_x86_64.whl (1.3 MB)
Collecting pyarrow==0.16.0
  Downloading pyarrow-0.16.0-cp37-cp37m-manylinux2014_x86_64.whl (63.1 MB)
Collecting pydot==1.4.1
  Downloading pydot-1.4.1-py2.py3-none-any.whl (19 kB)
Collecting pytz==2019.3
  Downloading pytz-2019.3-py2.py3-none-any.whl (509 kB)
Collecting pyyaml==5.1
  Downloading PyYAML-5.1.tar.gz (274 kB)
Collecting typing-extensions==3.7.4.1
  Downloading typing_extensions-3.7.4.1-py3-none-any.whl (20 kB)
Collecting google-api-core==1.21.0
  Downloading google_api_core-1.21.0-py2.py3-none-any.whl (90 kB)
Collecting google-apitools==0.5.28
  Downloading google-apitools-0.5.28.tar.gz (172 kB)
Collecting google-cloud-pubsub==1.0.2
  Downloading google_cloud_pubsub-1.0.2-py2.py3-none-any.whl (118 kB)
Collecting google-cloud-bigquery==1.26.1
  Downloading google_cloud_bigquery-1.26.1-py2.py3-none-any.whl (170 kB)
Collecting google-cloud-bigtable==1.0.0
  Downloading google_cloud_bigtable-1.0.0-py2.py3-none-any.whl (232 kB)
Collecting google-cloud-core==1.1.0
  Downloading google_cloud_core-1.1.0-py2.py3-none-any.whl (26 kB)
Collecting google-cloud-datastore==1.7.4
  Downloading google_cloud_datastore-1.7.4-py2.py3-none-any.whl (82 kB)
Collecting cython==0.29.13
  Downloading Cython-0.29.13-cp37-cp37m-manylinux1_x86_64.whl (2.1 MB)
Collecting guppy3==3.0.9
  Downloading guppy3-3.0.9-cp37-cp37m-manylinux1_x86_64.whl (614 kB)
Collecting numpy==1.17.3
  Downloading numpy-1.17.3-cp37-cp37m-manylinux1_x86_64.whl (20.0 MB)
Collecting scipy==1.4.1
  Downloading scipy-1.4.1-cp37-cp37m-manylinux1_x86_64.whl (26.1 MB)
Collecting pandas==0.25.2
  Downloading pandas-0.25.2-cp37-cp37m-manylinux1_x86_64.whl (10.4 MB)
Collecting protorpc==0.12.0
  Downloading protorpc-0.12.0.tar.gz (117 kB)
Collecting python-gflags==3.0.6
  Downloading python-gflags-3.0.6.tar.gz (49 kB)
Collecting tensorflow==2.2.0
  Downloading tensorflow-2.2.0-cp37-cp37m-manylinux2010_x86_64.whl (516.2 MB)
Collecting pymongo==3.9.0
  Downloading pymongo-3.9.0-cp37-cp37m-manylinux1_x86_64.whl (447 kB)
Collecting tenacity>=5.0.2
  Downloading tenacity-6.2.0-py2.py3-none-any.whl (24 kB)
Collecting pyhamcrest<2.0,>=1.9
  Downloading PyHamcrest-1.10.1-py3-none-any.whl (48 kB)
Collecting nose==1.3.7
  Downloading nose-1.3.7-py3-none-any.whl (154 kB)
Collecting six>=1.5.2
  Downloading six-1.15.0-py2.py3-none-any.whl (10 kB)
Collecting docopt
  Downloading docopt-0.6.2.tar.gz (25 kB)
Collecting requests>=2.7.0
  Downloading requests-2.24.0-py2.py3-none-any.whl (61 kB)
Collecting pbr>=0.11
  Downloading pbr-5.4.5-py2.py3-none-any.whl (110 kB)
Collecting pyasn1>=0.1.7
  Downloading pyasn1-0.4.8-py2.py3-none-any.whl (77 kB)
Collecting pyasn1-modules>=0.0.5
  Downloading pyasn1_modules-0.2.8-py2.py3-none-any.whl (155 kB)
Collecting rsa>=3.1.4
  Downloading rsa-4.6-py3-none-any.whl (47 kB)
Requirement already satisfied: setuptools in /usr/local/lib/python3.7/site-packages (from protobuf==3.12.2->-r /tmp/base_image_requirements.txt (line 38)) (49.3.1)
Collecting pyparsing>=2.1.4
  Downloading pyparsing-2.4.7-py2.py3-none-any.whl (67 kB)
Collecting googleapis-common-protos<2.0dev,>=1.6.0
  Downloading googleapis_common_protos-1.52.0-py2.py3-none-any.whl (100 kB)
Collecting google-auth<2.0dev,>=1.18.0
  Downloading google_auth-1.20.1-py2.py3-none-any.whl (91 kB)
Collecting fasteners>=0.14
  Downloading fasteners-0.15-py2.py3-none-any.whl (23 kB)
Collecting grpc-google-iam-v1<0.13dev,>=0.12.3
  Downloading grpc-google-iam-v1-0.12.3.tar.gz (13 kB)
Collecting google-resumable-media<2.0dev,>=0.5.0
  Downloading google_resumable_media-0.7.1-py2.py3-none-any.whl (42 kB)
Collecting python-dateutil>=2.6.1
  Downloading python_dateutil-2.8.1-py2.py3-none-any.whl (227 kB)
Collecting gast==0.3.3
  Downloading gast-0.3.3-py2.py3-none-any.whl (9.7 kB)
Collecting h5py<2.11.0,>=2.10.0
  Downloading h5py-2.10.0-cp37-cp37m-manylinux1_x86_64.whl (2.9 MB)
Collecting astunparse==1.6.3
  Downloading astunparse-1.6.3-py2.py3-none-any.whl (12 kB)
Collecting google-pasta>=0.1.8
  Downloading google_pasta-0.2.0-py3-none-any.whl (57 kB)
Collecting opt-einsum>=2.3.2
  Downloading opt_einsum-3.3.0-py3-none-any.whl (65 kB)
Collecting absl-py>=0.7.0
  Downloading absl-py-0.9.0.tar.gz (104 kB)
Collecting wrapt>=1.11.1
  Downloading wrapt-1.12.1.tar.gz (27 kB)
Collecting termcolor>=1.1.0
  Downloading termcolor-1.1.0.tar.gz (3.9 kB)
Collecting keras-preprocessing>=1.1.0
  Downloading Keras_Preprocessing-1.1.2-py2.py3-none-any.whl (42 kB)
Requirement already satisfied: wheel>=0.26; python_version >= "3" in /usr/local/lib/python3.7/site-packages (from tensorflow==2.2.0->-r /tmp/base_image_requirements.txt (line 71)) (0.34.2)
Collecting tensorboard<2.3.0,>=2.2.0
  Downloading tensorboard-2.2.2-py3-none-any.whl (3.0 MB)
Collecting tensorflow-estimator<2.3.0,>=2.2.0
  Downloading tensorflow_estimator-2.2.0-py2.py3-none-any.whl (454 kB)
Collecting idna<3,>=2.5
  Downloading idna-2.10-py2.py3-none-any.whl (58 kB)
Collecting chardet<4,>=3.0.2
  Downloading chardet-3.0.4-py2.py3-none-any.whl (133 kB)
Collecting certifi>=2017.4.17
  Downloading certifi-2020.6.20-py2.py3-none-any.whl (156 kB)
Collecting urllib3!=1.25.0,!=1.25.1,<1.26,>=1.21.1
  Downloading urllib3-1.25.10-py2.py3-none-any.whl (127 kB)
Collecting cachetools<5.0,>=2.0.0
  Downloading cachetools-4.1.1-py3-none-any.whl (10 kB)
Collecting monotonic>=0.1
  Downloading monotonic-1.5-py2.py3-none-any.whl (5.3 kB)
Collecting google-crc32c<0.2dev,>=0.1.0; python_version >= "3.5"
  Downloading google_crc32c-0.1.0-cp37-cp37m-manylinux2010_x86_64.whl (39 kB)
Collecting google-auth-oauthlib<0.5,>=0.4.1
  Downloading google_auth_oauthlib-0.4.1-py2.py3-none-any.whl (18 kB)
Collecting markdown>=2.6.8
  Downloading Markdown-3.2.2-py3-none-any.whl (88 kB)
Collecting tensorboard-plugin-wit>=1.6.0
  Downloading tensorboard_plugin_wit-1.7.0-py3-none-any.whl (779 kB)
Collecting werkzeug>=0.11.15
  Downloading Werkzeug-1.0.1-py2.py3-none-any.whl (298 kB)
Collecting cffi>=1.0.0
  Downloading cffi-1.14.2-cp37-cp37m-manylinux1_x86_64.whl (401 kB)
Collecting requests-oauthlib>=0.7.0
  Downloading requests_oauthlib-1.3.0-py2.py3-none-any.whl (23 kB)
Collecting importlib-metadata; python_version < "3.8"
  Downloading importlib_metadata-1.7.0-py2.py3-none-any.whl (31 kB)
Collecting pycparser
  Downloading pycparser-2.20-py2.py3-none-any.whl (112 kB)
Collecting oauthlib>=3.0.0
  Downloading oauthlib-3.1.0-py2.py3-none-any.whl (147 kB)
Collecting zipp>=0.5
  Downloading zipp-3.1.0-py3-none-any.whl (4.9 kB)
Building wheels for collected packages: avro-python3, crcmod, dill, future, hdfs, httplib2, oauth2client, pyyaml, google-apitools, protorpc, python-gflags, docopt, grpc-google-iam-v1, absl-py, wrapt, termcolor
  Building wheel for avro-python3 (setup.py): started
  Building wheel for avro-python3 (setup.py): finished with status 'done'
  Created wheel for avro-python3: filename=avro_python3-1.8.2-py3-none-any.whl size=43249 sha256=4655b1dbad1ea2dc79768b61eb70650ad1c48e3727866086c68745d2f6fd8bba
  Stored in directory: /root/.cache/pip/wheels/21/13/6f/cb2fe781dd05d05084356d29f660cd669fffc0bbfd87a9a613
  Building wheel for crcmod (setup.py): started
  Building wheel for crcmod (setup.py): finished with status 'done'
  Created wheel for crcmod: filename=crcmod-1.7-cp37-cp37m-linux_x86_64.whl size=36933 sha256=703a88bf00b3f51d6b1b301f50962b1beb9b7c091c97b0eab095947117a57ce5
  Stored in directory: /root/.cache/pip/wheels/dc/9a/e9/49e627353476cec8484343c4ab656f1e0d783ee77b9dde2d1f
  Building wheel for dill (setup.py): started
  Building wheel for dill (setup.py): finished with status 'done'
  Created wheel for dill: filename=dill-0.3.1.1-py3-none-any.whl size=78530 sha256=d740f759965236da1d2170152d00df993c284909b4e6e577295da7bc205b8c8a
  Stored in directory: /root/.cache/pip/wheels/a4/61/fd/c57e374e580aa78a45ed78d5859b3a44436af17e22ca53284f
  Building wheel for future (setup.py): started
  Building wheel for future (setup.py): finished with status 'done'
  Created wheel for future: filename=future-0.18.2-py3-none-any.whl size=491058 sha256=b7f03de4761f375569bd3cc744dd52e1011956b84850e71da659ed19e07c14e5
  Stored in directory: /root/.cache/pip/wheels/56/b0/fe/4410d17b32f1f0c3cf54cdfb2bc04d7b4b8f4ae377e2229ba0
  Building wheel for hdfs (setup.py): started
  Building wheel for hdfs (setup.py): finished with status 'done'
  Created wheel for hdfs: filename=hdfs-2.5.8-py3-none-any.whl size=33213 sha256=5e7e9136e65497a77c13b1ad0c62f55479d0e1002a9f3975bf88efb698161378
  Stored in directory: /root/.cache/pip/wheels/0a/7d/38/ea4eaf831518e6cd867b515b88919a9785eb66f11def5ab859
  Building wheel for httplib2 (setup.py): started
  Building wheel for httplib2 (setup.py): finished with status 'done'
  Created wheel for httplib2: filename=httplib2-0.12.0-py3-none-any.whl size=93464 sha256=a2f201582384b645897cca61b86a001693f5528f6a0f402678a8ed6b0d7db5ca
  Stored in directory: /root/.cache/pip/wheels/0d/e7/b6/0dd30343ceca921cfbd91f355041bd9c69e0f40b49f25b7b8a
  Building wheel for oauth2client (setup.py): started
  Building wheel for oauth2client (setup.py): finished with status 'done'
  Created wheel for oauth2client: filename=oauth2client-3.0.0-py3-none-any.whl size=106383 sha256=5a837f4a71c085eea89a28491730aaffc3f7ea0ec1cc455f8a4818b2e94478a3
  Stored in directory: /root/.cache/pip/wheels/86/73/7a/3b3f76a2142176605ff38fbca574327962c71e25a43197a4c1
  Building wheel for pyyaml (setup.py): started

> Task :sdks:python:container:py37:docker FAILED
:sdks:python:container:py37:docker (Thread[Execution worker for ':',5,main]) completed. Took 57.13 secs.

FAILURE: Build failed with an exception.

* What went wrong:
Execution failed for task ':sdks:python:container:py37:docker'.
> Process 'command 'docker'' finished with non-zero exit value 143

* Try:
Run with --stacktrace option to get the stack trace. Run with --debug option to get more log output. Run with --scan to get full insights.

* Get more help at https://help.gradle.org

Deprecated Gradle features were used in this build, making it incompatible with Gradle 6.0.
Use '--warning-mode all' to show the individual deprecation warnings.
See https://docs.gradle.org/5.2.1/userguide/command_line_interface.html#sec:command_line_warnings

BUILD FAILED in 1m 6s
20 actionable tasks: 14 executed, 6 up-to-date
The message received from the daemon indicates that the daemon has disappeared.
Build request sent: Build{id=be0e91d8-5ec0-4589-aa7c-e646ca6fabb2, currentDir=<https://ci-beam.apache.org/job/beam_PostCommit_Py_ValCont/ws/src}>
Attempting to read last messages from the daemon log...
Daemon pid: 2145
  log file: /home/jenkins/.gradle/daemon/5.2.1/daemon-2145.out.log
----- Last  20 lines from daemon log file - daemon-2145.out.log -----
:sdks:python:container:py37:docker (Thread[Execution worker for ':',5,main]) completed. Took 57.13 secs.

FAILURE: Build failed with an exception.

* What went wrong:
Execution failed for task ':sdks:python:container:py37:docker'.
> Process 'command 'docker'' finished with non-zero exit value 143

* Try:
Run with --stacktrace option to get the stack trace. Run with --debug option to get more log output. Run with --scan to get full insights.

* Get more help at https://help.gradle.org

Deprecated Gradle features were used in this build, making it incompatible with Gradle 6.0.
Use '--warning-mode all' to show the individual deprecation warnings.
See https://docs.gradle.org/5.2.1/userguide/command_line_interface.html#sec:command_line_warnings

BUILD FAILED in 1m 6s
20 actionable tasks: 14 executed, 6 up-to-date
Daemon vm is shutting down... The daemon has exited normally or was terminated in response to a user interrupt.
----- End of the daemon log -----


FAILURE: Build failed with an exception.

* What went wrong:
Gradle build daemon disappeared unexpectedly (it may have been killed or may have crashed)

* Try:
Run with --stacktrace option to get the stack trace. Run with --debug option to get more log output. Run with --scan to get full insights.

* Get more help at https://help.gradle.org
Build step 'Execute shell' marked build as failure

---------------------------------------------------------------------
To unsubscribe, e-mail: builds-unsubscribe@beam.apache.org
For additional commands, e-mail: builds-help@beam.apache.org


Build failed in Jenkins: beam_PostCommit_Py_ValCont #6715

Posted by Apache Jenkins Server <je...@builds.apache.org>.
See <https://ci-beam.apache.org/job/beam_PostCommit_Py_ValCont/6715/display/redirect>

Changes:


------------------------------------------
[...truncated 1.25 MB...]
  Found link https://files.pythonhosted.org/packages/69/81/52b68d0a4de760a2f1979b0931ba7889202f302072cc7a0d614211bc7579/pip-18.0.tar.gz#sha256=a0e11645ee37c90b40c46d607070c4fd583e2cd46231b1c06e389c5e814eed76 (from https://pypi.org/simple/pip/) (requires-python:>=2.7,!=3.0.*,!=3.1.*,!=3.2.*,!=3.3.*), version: 18.0
  Found link https://files.pythonhosted.org/packages/c2/d7/90f34cb0d83a6c5631cf71dfe64cc1054598c843a92b400e55675cc2ac37/pip-18.1-py2.py3-none-any.whl#sha256=7909d0a0932e88ea53a7014dfd14522ffef91a464daaaf5c573343852ef98550 (from https://pypi.org/simple/pip/) (requires-python:>=2.7,!=3.0.*,!=3.1.*,!=3.2.*,!=3.3.*), version: 18.1
  Found link https://files.pythonhosted.org/packages/45/ae/8a0ad77defb7cc903f09e551d88b443304a9bd6e6f124e75c0fbbf6de8f7/pip-18.1.tar.gz#sha256=c0a292bd977ef590379a3f05d7b7f65135487b67470f6281289a94e015650ea1 (from https://pypi.org/simple/pip/) (requires-python:>=2.7,!=3.0.*,!=3.1.*,!=3.2.*,!=3.3.*), version: 18.1
  Found link https://files.pythonhosted.org/packages/60/64/73b729587b6b0d13e690a7c3acd2231ee561e8dd28a58ae1b0409a5a2b20/pip-19.0-py2.py3-none-any.whl#sha256=249ab0de4c1cef3dba4cf3f8cca722a07fc447b1692acd9f84e19c646db04c9a (from https://pypi.org/simple/pip/) (requires-python:>=2.7,!=3.0.*,!=3.1.*,!=3.2.*,!=3.3.*), version: 19.0
  Found link https://files.pythonhosted.org/packages/11/31/c483614095176ddfa06ac99c2af4171375053b270842c7865ca0b4438dc1/pip-19.0.tar.gz#sha256=c82bf8bc00c5732f0dd49ac1dea79b6242a1bd42a5012e308ed4f04369b17e54 (from https://pypi.org/simple/pip/) (requires-python:>=2.7,!=3.0.*,!=3.1.*,!=3.2.*,!=3.3.*), version: 19.0
  Found link https://files.pythonhosted.org/packages/46/dc/7fd5df840efb3e56c8b4f768793a237ec4ee59891959d6a215d63f727023/pip-19.0.1-py2.py3-none-any.whl#sha256=aae79c7afe895fb986ec751564f24d97df1331bb99cdfec6f70dada2f40c0044 (from https://pypi.org/simple/pip/) (requires-python:>=2.7,!=3.0.*,!=3.1.*,!=3.2.*,!=3.3.*), version: 19.0.1
  Found link https://files.pythonhosted.org/packages/c8/89/ad7f27938e59db1f0f55ce214087460f65048626e2226531ba6cb6da15f0/pip-19.0.1.tar.gz#sha256=e81ddd35e361b630e94abeda4a1eddd36d47a90e71eb00f38f46b57f787cd1a5 (from https://pypi.org/simple/pip/) (requires-python:>=2.7,!=3.0.*,!=3.1.*,!=3.2.*,!=3.3.*), version: 19.0.1
  Found link https://files.pythonhosted.org/packages/d7/41/34dd96bd33958e52cb4da2f1bf0818e396514fd4f4725a79199564cd0c20/pip-19.0.2-py2.py3-none-any.whl#sha256=6a59f1083a63851aeef60c7d68b119b46af11d9d803ddc1cf927b58edcd0b312 (from https://pypi.org/simple/pip/) (requires-python:>=2.7,!=3.0.*,!=3.1.*,!=3.2.*,!=3.3.*), version: 19.0.2
  Found link https://files.pythonhosted.org/packages/4c/4d/88bc9413da11702cbbace3ccc51350ae099bb351febae8acc85fec34f9af/pip-19.0.2.tar.gz#sha256=f851133f8b58283fa50d8c78675eb88d4ff4cde29b6c41205cd938b06338e0e5 (from https://pypi.org/simple/pip/) (requires-python:>=2.7,!=3.0.*,!=3.1.*,!=3.2.*,!=3.3.*), version: 19.0.2
  Found link https://files.pythonhosted.org/packages/d8/f3/413bab4ff08e1fc4828dfc59996d721917df8e8583ea85385d51125dceff/pip-19.0.3-py2.py3-none-any.whl#sha256=bd812612bbd8ba84159d9ddc0266b7fbce712fc9bc98c82dee5750546ec8ec64 (from https://pypi.org/simple/pip/) (requires-python:>=2.7,!=3.0.*,!=3.1.*,!=3.2.*,!=3.3.*), version: 19.0.3
  Found link https://files.pythonhosted.org/packages/36/fa/51ca4d57392e2f69397cd6e5af23da2a8d37884a605f9e3f2d3bfdc48397/pip-19.0.3.tar.gz#sha256=6e6f197a1abfb45118dbb878b5c859a0edbdd33fd250100bc015b67fded4b9f2 (from https://pypi.org/simple/pip/) (requires-python:>=2.7,!=3.0.*,!=3.1.*,!=3.2.*,!=3.3.*), version: 19.0.3
  Found link https://files.pythonhosted.org/packages/f9/fb/863012b13912709c13cf5cfdbfb304fa6c727659d6290438e1a88df9d848/pip-19.1-py2.py3-none-any.whl#sha256=8f59b6cf84584d7962d79fd1be7a8ec0eb198aa52ea864896551736b3614eee9 (from https://pypi.org/simple/pip/) (requires-python:>=2.7,!=3.0.*,!=3.1.*,!=3.2.*,!=3.3.*), version: 19.1
  Found link https://files.pythonhosted.org/packages/51/5f/802a04274843f634469ef299fcd273de4438386deb7b8681dd059f0ee3b7/pip-19.1.tar.gz#sha256=d9137cb543d8a4d73140a3282f6d777b2e786bb6abb8add3ac5b6539c82cd624 (from https://pypi.org/simple/pip/) (requires-python:>=2.7,!=3.0.*,!=3.1.*,!=3.2.*,!=3.3.*), version: 19.1
  Found link https://files.pythonhosted.org/packages/5c/e0/be401c003291b56efc55aeba6a80ab790d3d4cece2778288d65323009420/pip-19.1.1-py2.py3-none-any.whl#sha256=993134f0475471b91452ca029d4390dc8f298ac63a712814f101cd1b6db46676 (from https://pypi.org/simple/pip/) (requires-python:>=2.7,!=3.0.*,!=3.1.*,!=3.2.*,!=3.3.*), version: 19.1.1
  Found link https://files.pythonhosted.org/packages/93/ab/f86b61bef7ab14909bd7ec3cd2178feb0a1c86d451bc9bccd5a1aedcde5f/pip-19.1.1.tar.gz#sha256=44d3d7d3d30a1eb65c7e5ff1173cdf8f7467850605ac7cc3707b6064bddd0958 (from https://pypi.org/simple/pip/) (requires-python:>=2.7,!=3.0.*,!=3.1.*,!=3.2.*,!=3.3.*), version: 19.1.1
  Found link https://files.pythonhosted.org/packages/3a/6f/35de4f49ae5c7fdb2b64097ab195020fb48faa8ad3a85386ece6953c11b1/pip-19.2-py2.py3-none-any.whl#sha256=468c67b0b1120cd0329dc72972cf0651310783a922e7609f3102bd5fb4acbf17 (from https://pypi.org/simple/pip/) (requires-python:>=2.7,!=3.0.*,!=3.1.*,!=3.2.*,!=3.3.*,!=3.4.*), version: 19.2
  Found link https://files.pythonhosted.org/packages/41/13/b6e68eae78405af6e4e9a93319ae5bb371057786f1590b157341f7542d7d/pip-19.2.tar.gz#sha256=aa6fdd80d13caac75d92b5eced06778712859b1606ba92d62389c11be12b2dad (from https://pypi.org/simple/pip/) (requires-python:>=2.7,!=3.0.*,!=3.1.*,!=3.2.*,!=3.3.*,!=3.4.*), version: 19.2
  Found link https://files.pythonhosted.org/packages/62/ca/94d32a6516ed197a491d17d46595ce58a83cbb2fca280414e57cd86b84dc/pip-19.2.1-py2.py3-none-any.whl#sha256=80d7452630a67c1e7763b5f0a515690f2c1e9ad06dda48e0ae85b7fdf2f59d97 (from https://pypi.org/simple/pip/) (requires-python:>=2.7,!=3.0.*,!=3.1.*,!=3.2.*,!=3.3.*,!=3.4.*), version: 19.2.1
  Found link https://files.pythonhosted.org/packages/8b/8a/1b2aadd922db1afe6bc107b03de41d6d37a28a5923383e60695fba24ae81/pip-19.2.1.tar.gz#sha256=258d702483dd749400aec59c23d638a5b2249ae28a0f478b6cab12ad45681a80 (from https://pypi.org/simple/pip/) (requires-python:>=2.7,!=3.0.*,!=3.1.*,!=3.2.*,!=3.3.*,!=3.4.*), version: 19.2.1
  Found link https://files.pythonhosted.org/packages/8d/07/f7d7ced2f97ca3098c16565efbe6b15fafcba53e8d9bdb431e09140514b0/pip-19.2.2-py2.py3-none-any.whl#sha256=4b956bd8b7b481fc5fa222637ff6d0823a327e5118178f1ec47618a480e61997 (from https://pypi.org/simple/pip/) (requires-python:>=2.7,!=3.0.*,!=3.1.*,!=3.2.*,!=3.3.*,!=3.4.*), version: 19.2.2
  Found link https://files.pythonhosted.org/packages/aa/1a/62fb0b95b1572c76dbc3cc31124a8b6866cbe9139eb7659ac7349457cf7c/pip-19.2.2.tar.gz#sha256=e05103825871e210d50a44c7e448587b0ed99dd775d3ef586304c58f40224a53 (from https://pypi.org/simple/pip/) (requires-python:>=2.7,!=3.0.*,!=3.1.*,!=3.2.*,!=3.3.*,!=3.4.*), version: 19.2.2
  Found link https://files.pythonhosted.org/packages/30/db/9e38760b32e3e7f40cce46dd5fb107b8c73840df38f0046d8e6514e675a1/pip-19.2.3-py2.py3-none-any.whl#sha256=340a0ba40fdeb16413914c0fcd8e0b4ebb0bf39a900ec80e11c05d836c05103f (from https://pypi.org/simple/pip/) (requires-python:>=2.7,!=3.0.*,!=3.1.*,!=3.2.*,!=3.3.*,!=3.4.*), version: 19.2.3
  Found link https://files.pythonhosted.org/packages/00/9e/4c83a0950d8bdec0b4ca72afd2f9cea92d08eb7c1a768363f2ea458d08b4/pip-19.2.3.tar.gz#sha256=e7a31f147974362e6c82d84b91c7f2bdf57e4d3163d3d454e6c3e71944d67135 (from https://pypi.org/simple/pip/) (requires-python:>=2.7,!=3.0.*,!=3.1.*,!=3.2.*,!=3.3.*,!=3.4.*), version: 19.2.3
  Found link https://files.pythonhosted.org/packages/4a/08/6ca123073af4ebc4c5488a5bc8a010ac57aa39ce4d3c8a931ad504de4185/pip-19.3-py2.py3-none-any.whl#sha256=e100a7eccf085f0720b4478d3bb838e1c179b1e128ec01c0403f84e86e0e2dfb (from https://pypi.org/simple/pip/) (requires-python:>=2.7,!=3.0.*,!=3.1.*,!=3.2.*,!=3.3.*,!=3.4.*), version: 19.3
  Found link https://files.pythonhosted.org/packages/af/7a/5dd1e6efc894613c432ce86f1011fcc3bbd8ac07dfeae6393b7b97f1de8b/pip-19.3.tar.gz#sha256=324d234b8f6124846b4e390df255cacbe09ce22791c3b714aa1ea6e44a4f2861 (from https://pypi.org/simple/pip/) (requires-python:>=2.7,!=3.0.*,!=3.1.*,!=3.2.*,!=3.3.*,!=3.4.*), version: 19.3
  Found link https://files.pythonhosted.org/packages/00/b6/9cfa56b4081ad13874b0c6f96af8ce16cfbc1cb06bedf8e9164ce5551ec1/pip-19.3.1-py2.py3-none-any.whl#sha256=6917c65fc3769ecdc61405d3dfd97afdedd75808d200b2838d7d961cebc0c2c7 (from https://pypi.org/simple/pip/) (requires-python:>=2.7,!=3.0.*,!=3.1.*,!=3.2.*,!=3.3.*,!=3.4.*), version: 19.3.1
  Found link https://files.pythonhosted.org/packages/ce/ea/9b445176a65ae4ba22dce1d93e4b5fe182f953df71a145f557cffaffc1bf/pip-19.3.1.tar.gz#sha256=21207d76c1031e517668898a6b46a9fb1501c7a4710ef5dfd6a40ad9e6757ea7 (from https://pypi.org/simple/pip/) (requires-python:>=2.7,!=3.0.*,!=3.1.*,!=3.2.*,!=3.3.*,!=3.4.*), version: 19.3.1
  Skipping link: yanked for reason: <none given>: https://files.pythonhosted.org/packages/60/65/16487a7c4e0f95bb3fc89c2e377be331fd496b7a9b08fd3077de7f3ae2cf/pip-20.0-py2.py3-none-any.whl#sha256=eea07b449d969dbc8c062c157852cf8ed2ad1b8b5ac965a6b819e62929e41703 (from https://pypi.org/simple/pip/) (requires-python:>=2.7,!=3.0.*,!=3.1.*,!=3.2.*,!=3.3.*,!=3.4.*)
  Skipping link: yanked for reason: <none given>: https://files.pythonhosted.org/packages/8c/5c/c18d58ab5c1a702bf670e0bd6a77cd4645e4aeca021c6118ef850895cc96/pip-20.0.tar.gz#sha256=5128e9a9401f1d16c1d15b2ed766a79d7813db1538428d0b0ce74838249e3a41 (from https://pypi.org/simple/pip/) (requires-python:>=2.7,!=3.0.*,!=3.1.*,!=3.2.*,!=3.3.*,!=3.4.*)
  Found link https://files.pythonhosted.org/packages/57/36/67f809c135c17ec9b8276466cc57f35b98c240f55c780689ea29fa32f512/pip-20.0.1-py2.py3-none-any.whl#sha256=b7110a319790ae17e8105ecd6fe07dbcc098a280c6d27b6dd7a20174927c24d7 (from https://pypi.org/simple/pip/) (requires-python:>=2.7,!=3.0.*,!=3.1.*,!=3.2.*,!=3.3.*,!=3.4.*), version: 20.0.1
  Found link https://files.pythonhosted.org/packages/28/af/2c76c8aa46ccdf7578b83d97a11a2d1858794d4be4a1610ade0d30182e8b/pip-20.0.1.tar.gz#sha256=3cebbac2a1502e09265f94e5717408339de846b3c0f0ed086d7b817df9cab822 (from https://pypi.org/simple/pip/) (requires-python:>=2.7,!=3.0.*,!=3.1.*,!=3.2.*,!=3.3.*,!=3.4.*), version: 20.0.1
  Found link https://files.pythonhosted.org/packages/54/0c/d01aa759fdc501a58f431eb594a17495f15b88da142ce14b5845662c13f3/pip-20.0.2-py2.py3-none-any.whl#sha256=4ae14a42d8adba3205ebeb38aa68cfc0b6c346e1ae2e699a0b3bad4da19cef5c (from https://pypi.org/simple/pip/) (requires-python:>=2.7,!=3.0.*,!=3.1.*,!=3.2.*,!=3.3.*,!=3.4.*), version: 20.0.2
  Found link https://files.pythonhosted.org/packages/8e/76/66066b7bc71817238924c7e4b448abdb17eb0c92d645769c223f9ace478f/pip-20.0.2.tar.gz#sha256=7db0c8ea4c7ea51c8049640e8e6e7fde949de672bfa4949920675563a5a6967f (from https://pypi.org/simple/pip/) (requires-python:>=2.7,!=3.0.*,!=3.1.*,!=3.2.*,!=3.3.*,!=3.4.*), version: 20.0.2
  Found link https://files.pythonhosted.org/packages/ec/05/82d3fababbf462d876883ebc36f030f4fa057a563a80f5a26ee63679d9ea/pip-20.1b1-py2.py3-none-any.whl#sha256=4cf0348b683937da883ccaae8c8bcfc9b4c7ba4c48b38cc2d89cd7b8d0b220d9 (from https://pypi.org/simple/pip/) (requires-python:>=2.7,!=3.0.*,!=3.1.*,!=3.2.*,!=3.3.*,!=3.4.*), version: 20.1b1
  Found link https://files.pythonhosted.org/packages/cd/81/c1184456fe506bd50992571c9f8581907976ce71502e36741f033e2da1f1/pip-20.1b1.tar.gz#sha256=699880a47f6d306f4f9a87ca151ef33d41d2223b81ff343b786d38c297923a19 (from https://pypi.org/simple/pip/) (requires-python:>=2.7,!=3.0.*,!=3.1.*,!=3.2.*,!=3.3.*,!=3.4.*), version: 20.1b1
  Found link https://files.pythonhosted.org/packages/54/2e/df11ea7e23e7e761d484ed3740285a34e38548cf2bad2bed3dd5768ec8b9/pip-20.1-py2.py3-none-any.whl#sha256=4fdc7fd2db7636777d28d2e1432e2876e30c2b790d461f135716577f73104369 (from https://pypi.org/simple/pip/) (requires-python:>=2.7,!=3.0.*,!=3.1.*,!=3.2.*,!=3.3.*,!=3.4.*), version: 20.1
  Found link https://files.pythonhosted.org/packages/d1/05/059c78cd5d740d2299266ffa15514dad6692d4694df571bf168e2cdd98fb/pip-20.1.tar.gz#sha256=572c0f25eca7c87217b21f6945b7192744103b18f4e4b16b8a83b227a811e192 (from https://pypi.org/simple/pip/) (requires-python:>=2.7,!=3.0.*,!=3.1.*,!=3.2.*,!=3.3.*,!=3.4.*), version: 20.1
  Found link https://files.pythonhosted.org/packages/43/84/23ed6a1796480a6f1a2d38f2802901d078266bda38388954d01d3f2e821d/pip-20.1.1-py2.py3-none-any.whl#sha256=b27c4dedae8c41aa59108f2fa38bf78e0890e590545bc8ece7cdceb4ba60f6e4 (from https://pypi.org/simple/pip/) (requires-python:>=2.7,!=3.0.*,!=3.1.*,!=3.2.*,!=3.3.*,!=3.4.*), version: 20.1.1
  Found link https://files.pythonhosted.org/packages/08/25/f204a6138dade2f6757b4ae99bc3994aac28a5602c97ddb2a35e0e22fbc4/pip-20.1.1.tar.gz#sha256=27f8dc29387dd83249e06e681ce087e6061826582198a425085e0bf4c1cf3a55 (from https://pypi.org/simple/pip/) (requires-python:>=2.7,!=3.0.*,!=3.1.*,!=3.2.*,!=3.3.*,!=3.4.*), version: 20.1.1
  Found link https://files.pythonhosted.org/packages/fe/3b/0fc5e63eb277d5a50a95ce5c896f742ef243be27382303a4a44dd0197e29/pip-20.2b1-py2.py3-none-any.whl#sha256=b4e230e2b8ece18c5a19b818f3c20a8d4eeac8172962779fd9898d7c4ceb1636 (from https://pypi.org/simple/pip/) (requires-python:>=2.7,!=3.0.*,!=3.1.*,!=3.2.*,!=3.3.*,!=3.4.*), version: 20.2b1
  Found link https://files.pythonhosted.org/packages/77/3e/6a1fd8e08a06e3e0f54182c7c937bba3f4e9cf1b26f54946d3915021ea2e/pip-20.2b1.tar.gz#sha256=dbf65ecb1c30d35d72f5fda052fcd2f1ea9aca8eaf03d930846d990f51d3f6f6 (from https://pypi.org/simple/pip/) (requires-python:>=2.7,!=3.0.*,!=3.1.*,!=3.2.*,!=3.3.*,!=3.4.*), version: 20.2b1
  Found link https://files.pythonhosted.org/packages/36/74/38c2410d688ac7b48afa07d413674afc1f903c1c1f854de51dc8eb2367a5/pip-20.2-py2.py3-none-any.whl#sha256=d75f1fc98262dabf74656245c509213a5d0f52137e40e8f8ed5cc256ddd02923 (from https://pypi.org/simple/pip/) (requires-python:>=2.7,!=3.0.*,!=3.1.*,!=3.2.*,!=3.3.*,!=3.4.*), version: 20.2
  Found link https://files.pythonhosted.org/packages/b9/27/a9007a575c8a8e80c22144fec5df3943fd304dfa791bed44a0130e984803/pip-20.2.tar.gz#sha256=912935eb20ea6a3b5ed5810dde9754fde5563f5ca9be44a8a6e5da806ade970b (from https://pypi.org/simple/pip/) (requires-python:>=2.7,!=3.0.*,!=3.1.*,!=3.2.*,!=3.3.*,!=3.4.*), version: 20.2
  Found link https://files.pythonhosted.org/packages/bd/b1/56a834acdbe23b486dea16aaf4c27ed28eb292695b90d01dff96c96597de/pip-20.2.1-py2.py3-none-any.whl#sha256=7792c1a4f60fca3a9d674e7dee62c24e21a32df1f47d308524d3507455784f29 (from https://pypi.org/simple/pip/) (requires-python:>=2.7,!=3.0.*,!=3.1.*,!=3.2.*,!=3.3.*,!=3.4.*), version: 20.2.1
  Found link https://files.pythonhosted.org/packages/68/1a/8cfcf3a8cba0dd0f125927c986b1502f2eed284c63fdfd6797ea74300ae4/pip-20.2.1.tar.gz#sha256=c87c2b2620f2942dfd5f3cf1bb2a18a99ae70de07384e847c8e3afd1d1604cf2 (from https://pypi.org/simple/pip/) (requires-python:>=2.7,!=3.0.*,!=3.1.*,!=3.2.*,!=3.3.*,!=3.4.*), version: 20.2.1
  Found link https://files.pythonhosted.org/packages/5a/4a/39400ff9b36e719bdf8f31c99fe1fa7842a42fa77432e584f707a5080063/pip-20.2.2-py2.py3-none-any.whl#sha256=5244e51494f5d1dfbb89da492d4250cb07f9246644736d10ed6c45deb1a48500 (from https://pypi.org/simple/pip/) (requires-python:>=2.7,!=3.0.*,!=3.1.*,!=3.2.*,!=3.3.*,!=3.4.*), version: 20.2.2
  Found link https://files.pythonhosted.org/packages/73/8e/7774190ac616c69194688ffce7c1b2a097749792fea42e390e7ddfdef8bc/pip-20.2.2.tar.gz#sha256=58a3b0b55ee2278104165c7ee7bc8e2db6f635067f3c66cf637113ec5aa71584 (from https://pypi.org/simple/pip/) (requires-python:>=2.7,!=3.0.*,!=3.1.*,!=3.2.*,!=3.3.*,!=3.4.*), version: 20.2.2
Given no hashes to check 145 links for project 'pip': discarding no candidates
Removed build tracker: '/tmp/pip-req-tracker-2v576v38'
Removing intermediate container 0ad9d893a510
 ---> aafba9e6aafa
Step 12/18 : COPY target/license_scripts /tmp/license_scripts/
 ---> 095349d6b6cd
Step 13/18 : RUN if [ "$pull_licenses" = "true" ] ; then     pip install 'pip-licenses<3.0.0;python_version>="3.5"' &&     pip install 'pip-licenses==1.18.0;python_version<="2.7"' &&     python /tmp/license_scripts/pull_licenses_py.py &&     pip uninstall -y pip-licenses &&     rm -rf /root/.cache/pip ;    fi
 ---> Running in 751a9ae11cd4
Removing intermediate container 751a9ae11cd4
 ---> 164d8650e86e
Step 14/18 : RUN pip freeze --all
 ---> Running in ded2ca8c2c80
absl-py==0.9.0
apache-beam @ file:///opt/apache/beam/tars/apache-beam.tar.gz
astunparse==1.6.3
avro-python3==1.8.2
cachetools==3.1.1
certifi==2020.6.20
cffi==1.14.2
chardet==3.0.4
crcmod==1.7
Cython==0.29.13
dill==0.3.1.1
docopt==0.6.2
fastavro==0.23.3
fasteners==0.15
future==0.18.2
gast==0.3.3
google-api-core==1.21.0
google-apitools==0.5.31
google-auth==1.20.1
google-auth-oauthlib==0.4.1
google-cloud-bigquery==1.26.1
google-cloud-bigtable==1.0.0
google-cloud-core==1.1.0
google-cloud-datastore==1.7.4
google-cloud-dlp==1.0.0
google-cloud-language==1.3.0
google-cloud-pubsub==1.0.2
google-cloud-spanner==1.17.1
google-cloud-videointelligence==1.15.0
google-cloud-vision==1.0.0
google-crc32c==0.1.0
google-pasta==0.2.0
google-resumable-media==0.7.1
googleapis-common-protos==1.52.0
grpc-google-iam-v1==0.12.3
grpcio==1.29.0
grpcio-gcp==0.2.2
guppy3==3.0.9
h5py==2.10.0
hdfs==2.5.8
httplib2==0.12.0
idna==2.10
importlib-metadata==1.7.0
Keras-Preprocessing==1.1.2
Markdown==3.2.2
mock==2.0.0
monotonic==1.5
nose==1.3.7
numpy==1.17.3
oauth2client==3.0.0
oauthlib==3.1.0
opt-einsum==3.3.0
pandas==0.25.2
pbr==5.4.5
pip==20.2.2
protobuf==3.12.2
protorpc==0.12.0
pyarrow==0.16.0
pyasn1==0.4.8
pyasn1-modules==0.2.8
pycparser==2.20
pydot==1.4.1
PyHamcrest==1.10.1
pymongo==3.9.0
pyparsing==2.4.7
python-dateutil==2.8.1
python-gflags==3.0.6
pytz==2019.3
PyYAML==5.1
requests==2.24.0
requests-oauthlib==1.3.0
rsa==4.6
scipy==1.4.1
setuptools==49.3.1
six==1.15.0
tenacity==6.2.0
tensorboard==2.2.2
tensorboard-plugin-wit==1.7.0
tensorflow==2.2.0
tensorflow-estimator==2.2.0
termcolor==1.1.0
typing-extensions==3.7.4.1
urllib3==1.25.10
Werkzeug==1.0.1
wheel==0.34.2
wrapt==1.12.1
zipp==1.2.0
Removing intermediate container ded2ca8c2c80
 ---> ecd8cb9a98bd
Step 15/18 : COPY target/LICENSE /opt/apache/beam/
 ---> 8bbe483a8cee
Step 16/18 : COPY target/NOTICE /opt/apache/beam/
 ---> 55277a45832c
Step 17/18 : ADD target/launcher/linux_amd64/boot /opt/apache/beam/
 ---> d85e81c0ccdc
Step 18/18 : ENTRYPOINT ["/opt/apache/beam/boot"]
 ---> Running in 6f20bd64b723
Removing intermediate container 6f20bd64b723
 ---> d55bbc416a3d
Successfully built d55bbc416a3d
Successfully tagged us.gcr.io/apache-beam-testing/jenkins/beam_python3.5_sdk:20200817-062307
:sdks:python:container:py35:docker (Thread[Execution worker for ':' Thread 11,5,main]) completed. Took 5 mins 21.605 secs.

Deprecated Gradle features were used in this build, making it incompatible with Gradle 6.0.
Use '--warning-mode all' to show the individual deprecation warnings.
See https://docs.gradle.org/5.2.1/userguide/command_line_interface.html#sec:command_line_warnings

BUILD SUCCESSFUL in 5m 34s
20 actionable tasks: 15 executed, 5 up-to-date

Publishing build scan...
https://gradle.com/s/s3c3imqc5oz5w


# Verify it exists
docker images | grep $TAG
us.gcr.io/apache-beam-testing/jenkins/beam_python3.5_sdk                     20200817-062307     d55bbc416a3d        Less than a second ago   3.08GB

# Push the container
gcloud docker -- push $CONTAINER
WARNING: `gcloud docker` will not be supported for Docker client versions above 18.03.

As an alternative, use `gcloud auth configure-docker` to configure `docker` to
use `gcloud` as a credential helper, then use `docker` as you would for non-GCR
registries, e.g. `docker pull gcr.io/project-id/my-image`. Add
`--verbosity=error` to silence this warning: `gcloud docker
--verbosity=error -- pull gcr.io/project-id/my-image`.

See: https://cloud.google.com/container-registry/docs/support/deprecation-notices#gcloud-docker

The push refers to repository [us.gcr.io/apache-beam-testing/jenkins/beam_python3.5_sdk]
2a0af811e0f9: Preparing
8ac9840ee7a2: Preparing
81ab76fdd863: Preparing
2e56913b5c1f: Preparing
0cd9c1fe7b1c: Preparing
d207d6f392fd: Preparing
c76ece514a50: Preparing
fd0bae9e0f27: Preparing
fb121cd19eb1: Preparing
5985726e2726: Preparing
639b3f6cc805: Preparing
6cb07c5ace4a: Preparing
e8113e3cc178: Preparing
28ecb941c7e3: Preparing
848621c1eece: Preparing
51ba40d1caab: Preparing
e480b226ea6b: Preparing
c76ece514a50: Waiting
e5df62d9b33a: Preparing
7a9460d53218: Preparing
fd0bae9e0f27: Waiting
b2765ac0333a: Preparing
0ced13fcf944: Preparing
fb121cd19eb1: Waiting
5985726e2726: Waiting
b2765ac0333a: Waiting
639b3f6cc805: Waiting
d207d6f392fd: Waiting
7a9460d53218: Waiting
6cb07c5ace4a: Waiting
e5df62d9b33a: Waiting
28ecb941c7e3: Waiting
51ba40d1caab: Waiting
848621c1eece: Waiting
e480b226ea6b: Waiting
0ced13fcf944: Waiting
0cd9c1fe7b1c: Pushed
8ac9840ee7a2: Pushed
81ab76fdd863: Pushed
2e56913b5c1f: Pushed
fb121cd19eb1: Pushed
fd0bae9e0f27: Pushed
c76ece514a50: Pushed
2a0af811e0f9: Pushed
639b3f6cc805: Pushed
6cb07c5ace4a: Pushed
e8113e3cc178: Pushed
28ecb941c7e3: Pushed
e480b226ea6b: Layer already exists
e5df62d9b33a: Layer already exists
7a9460d53218: Layer already exists
b2765ac0333a: Layer already exists
0ced13fcf944: Layer already exists
51ba40d1caab: Pushed
848621c1eece: Pushed
d207d6f392fd: Pushed
5985726e2726: Pushed
name unknown: Failed to get blob sizes.
Build step 'Execute shell' marked build as failure

---------------------------------------------------------------------
To unsubscribe, e-mail: builds-unsubscribe@beam.apache.org
For additional commands, e-mail: builds-help@beam.apache.org