You are viewing a plain text version of this content. The canonical link for it is here.
Posted to builds@solr.apache.org by Apache Jenkins Server <je...@builds.apache.org> on 2024/01/30 12:37:50 UTC
[JENKINS] Lucene » Lucene-Solr-Tests-8.11 - Build # 490 - Unstable!
Build: https://ci-builds.apache.org/job/Lucene/job/Lucene-Solr-Tests-8.11/490/
3 tests failed.
FAILED: org.apache.solr.cloud.api.collections.ShardSplitTest.testSplitMixedReplicaTypesLink
Error Message:
Timeout occurred while waiting response from server at: http://127.0.0.1:38679
Stack Trace:
org.apache.solr.client.solrj.SolrServerException: Timeout occurred while waiting response from server at: http://127.0.0.1:38679
at __randomizedtesting.SeedInfo.seed([3F4643D681D4B09D:3288A8F240C1B04]:0)
at org.apache.solr.client.solrj.impl.HttpSolrClient.executeMethod(HttpSolrClient.java:692)
at org.apache.solr.client.solrj.impl.HttpSolrClient.request(HttpSolrClient.java:266)
at org.apache.solr.client.solrj.impl.HttpSolrClient.request(HttpSolrClient.java:248)
at org.apache.solr.client.solrj.impl.LBSolrClient.doRequest(LBSolrClient.java:369)
at org.apache.solr.client.solrj.impl.LBSolrClient.request(LBSolrClient.java:297)
at org.apache.solr.client.solrj.impl.BaseCloudSolrClient.sendRequest(BaseCloudSolrClient.java:1188)
at org.apache.solr.client.solrj.impl.BaseCloudSolrClient.requestWithRetryOnStaleState(BaseCloudSolrClient.java:934)
at org.apache.solr.client.solrj.impl.BaseCloudSolrClient.request(BaseCloudSolrClient.java:866)
at org.apache.solr.client.solrj.SolrRequest.process(SolrRequest.java:225)
at org.apache.solr.client.solrj.SolrRequest.process(SolrRequest.java:242)
at org.apache.solr.cloud.api.collections.ShardSplitTest.doSplitMixedReplicaTypes(ShardSplitTest.java:365)
at org.apache.solr.cloud.api.collections.ShardSplitTest.testSplitMixedReplicaTypesLink(ShardSplitTest.java:356)
at sun.reflect.NativeMethodAccessorImpl.invoke0(Native Method)
at sun.reflect.NativeMethodAccessorImpl.invoke(NativeMethodAccessorImpl.java:62)
at sun.reflect.DelegatingMethodAccessorImpl.invoke(DelegatingMethodAccessorImpl.java:43)
at java.lang.reflect.Method.invoke(Method.java:498)
at com.carrotsearch.randomizedtesting.RandomizedRunner.invoke(RandomizedRunner.java:1758)
at com.carrotsearch.randomizedtesting.RandomizedRunner$8.evaluate(RandomizedRunner.java:946)
at com.carrotsearch.randomizedtesting.RandomizedRunner$9.evaluate(RandomizedRunner.java:982)
at com.carrotsearch.randomizedtesting.RandomizedRunner$10.evaluate(RandomizedRunner.java:996)
at org.apache.solr.BaseDistributedSearchTestCase$ShardsRepeatRule$ShardsFixedStatement.callStatement(BaseDistributedSearchTestCase.java:1084)
at org.apache.solr.BaseDistributedSearchTestCase$ShardsRepeatRule$ShardsStatement.evaluate(BaseDistributedSearchTestCase.java:1055)
at com.carrotsearch.randomizedtesting.rules.SystemPropertiesRestoreRule$1.evaluate(SystemPropertiesRestoreRule.java:80)
at org.junit.rules.RunRules.evaluate(RunRules.java:20)
at org.apache.lucene.util.TestRuleSetupTeardownChained$1.evaluate(TestRuleSetupTeardownChained.java:49)
at org.apache.lucene.util.AbstractBeforeAfterRule$1.evaluate(AbstractBeforeAfterRule.java:45)
at org.apache.lucene.util.TestRuleThreadAndTestName$1.evaluate(TestRuleThreadAndTestName.java:48)
at org.apache.lucene.util.TestRuleIgnoreAfterMaxFailures$1.evaluate(TestRuleIgnoreAfterMaxFailures.java:64)
at org.apache.lucene.util.TestRuleMarkFailure$1.evaluate(TestRuleMarkFailure.java:47)
at org.junit.rules.RunRules.evaluate(RunRules.java:20)
at com.carrotsearch.randomizedtesting.rules.StatementAdapter.evaluate(StatementAdapter.java:36)
at com.carrotsearch.randomizedtesting.ThreadLeakControl$StatementRunner.run(ThreadLeakControl.java:390)
at com.carrotsearch.randomizedtesting.ThreadLeakControl.forkTimeoutingTask(ThreadLeakControl.java:843)
at com.carrotsearch.randomizedtesting.ThreadLeakControl$3.evaluate(ThreadLeakControl.java:490)
at com.carrotsearch.randomizedtesting.RandomizedRunner.runSingleTest(RandomizedRunner.java:955)
at com.carrotsearch.randomizedtesting.RandomizedRunner$5.evaluate(RandomizedRunner.java:840)
at com.carrotsearch.randomizedtesting.RandomizedRunner$6.evaluate(RandomizedRunner.java:891)
at com.carrotsearch.randomizedtesting.RandomizedRunner$7.evaluate(RandomizedRunner.java:902)
at com.carrotsearch.randomizedtesting.rules.StatementAdapter.evaluate(StatementAdapter.java:36)
at com.carrotsearch.randomizedtesting.rules.SystemPropertiesRestoreRule$1.evaluate(SystemPropertiesRestoreRule.java:80)
at org.junit.rules.RunRules.evaluate(RunRules.java:20)
at org.apache.lucene.util.AbstractBeforeAfterRule$1.evaluate(AbstractBeforeAfterRule.java:45)
at com.carrotsearch.randomizedtesting.rules.StatementAdapter.evaluate(StatementAdapter.java:36)
at org.apache.lucene.util.TestRuleStoreClassName$1.evaluate(TestRuleStoreClassName.java:41)
at com.carrotsearch.randomizedtesting.rules.NoShadowingOrOverridesOnMethodsRule$1.evaluate(NoShadowingOrOverridesOnMethodsRule.java:40)
at com.carrotsearch.randomizedtesting.rules.NoShadowingOrOverridesOnMethodsRule$1.evaluate(NoShadowingOrOverridesOnMethodsRule.java:40)
at com.carrotsearch.randomizedtesting.rules.StatementAdapter.evaluate(StatementAdapter.java:36)
at com.carrotsearch.randomizedtesting.rules.StatementAdapter.evaluate(StatementAdapter.java:36)
at com.carrotsearch.randomizedtesting.rules.StatementAdapter.evaluate(StatementAdapter.java:36)
at org.apache.lucene.util.TestRuleAssertionsRequired$1.evaluate(TestRuleAssertionsRequired.java:53)
at org.apache.lucene.util.TestRuleMarkFailure$1.evaluate(TestRuleMarkFailure.java:47)
at org.apache.lucene.util.TestRuleIgnoreAfterMaxFailures$1.evaluate(TestRuleIgnoreAfterMaxFailures.java:64)
at org.apache.lucene.util.TestRuleIgnoreTestSuites$1.evaluate(TestRuleIgnoreTestSuites.java:54)
at org.junit.rules.RunRules.evaluate(RunRules.java:20)
at com.carrotsearch.randomizedtesting.rules.StatementAdapter.evaluate(StatementAdapter.java:36)
at com.carrotsearch.randomizedtesting.ThreadLeakControl$StatementRunner.run(ThreadLeakControl.java:390)
at com.carrotsearch.randomizedtesting.ThreadLeakControl.lambda$forkTimeoutingTask$0(ThreadLeakControl.java:850)
at java.lang.Thread.run(Thread.java:750)
Caused by: java.net.SocketTimeoutException: Read timed out
at java.net.SocketInputStream.socketRead0(Native Method)
at java.net.SocketInputStream.socketRead(SocketInputStream.java:116)
at java.net.SocketInputStream.read(SocketInputStream.java:171)
at java.net.SocketInputStream.read(SocketInputStream.java:141)
at org.apache.http.impl.io.SessionInputBufferImpl.streamRead(SessionInputBufferImpl.java:137)
at org.apache.http.impl.io.SessionInputBufferImpl.fillBuffer(SessionInputBufferImpl.java:153)
at org.apache.http.impl.io.SessionInputBufferImpl.readLine(SessionInputBufferImpl.java:280)
at org.apache.http.impl.conn.DefaultHttpResponseParser.parseHead(DefaultHttpResponseParser.java:138)
at org.apache.http.impl.conn.DefaultHttpResponseParser.parseHead(DefaultHttpResponseParser.java:56)
at org.apache.http.impl.io.AbstractMessageParser.parse(AbstractMessageParser.java:259)
at org.apache.http.impl.DefaultBHttpClientConnection.receiveResponseHeader(DefaultBHttpClientConnection.java:163)
at org.apache.http.impl.conn.CPoolProxy.receiveResponseHeader(CPoolProxy.java:157)
at org.apache.http.protocol.HttpRequestExecutor.doReceiveResponse(HttpRequestExecutor.java:273)
at org.apache.http.protocol.HttpRequestExecutor.execute(HttpRequestExecutor.java:125)
at org.apache.http.impl.execchain.MainClientExec.execute(MainClientExec.java:272)
at org.apache.http.impl.execchain.ProtocolExec.execute(ProtocolExec.java:186)
at org.apache.http.impl.execchain.RetryExec.execute(RetryExec.java:89)
at org.apache.http.impl.execchain.RedirectExec.execute(RedirectExec.java:110)
at org.apache.http.impl.client.InternalHttpClient.doExecute(InternalHttpClient.java:185)
at org.apache.http.impl.client.CloseableHttpClient.execute(CloseableHttpClient.java:83)
at org.apache.http.impl.client.CloseableHttpClient.execute(CloseableHttpClient.java:56)
at org.apache.solr.client.solrj.impl.HttpSolrClient.executeMethod(HttpSolrClient.java:571)
... 57 more
FAILED: org.apache.solr.cloud.api.collections.ShardSplitTest.testSplitMixedReplicaTypes
Error Message:
Timeout occurred while waiting response from server at: http://127.0.0.1:33223
Stack Trace:
org.apache.solr.client.solrj.SolrServerException: Timeout occurred while waiting response from server at: http://127.0.0.1:33223
at __randomizedtesting.SeedInfo.seed([3F4643D681D4B09D:878517767D0F65E8]:0)
at org.apache.solr.client.solrj.impl.HttpSolrClient.executeMethod(HttpSolrClient.java:692)
at org.apache.solr.client.solrj.impl.HttpSolrClient.request(HttpSolrClient.java:266)
at org.apache.solr.client.solrj.impl.HttpSolrClient.request(HttpSolrClient.java:248)
at org.apache.solr.client.solrj.impl.LBSolrClient.doRequest(LBSolrClient.java:369)
at org.apache.solr.client.solrj.impl.LBSolrClient.request(LBSolrClient.java:297)
at org.apache.solr.client.solrj.impl.BaseCloudSolrClient.sendRequest(BaseCloudSolrClient.java:1188)
at org.apache.solr.client.solrj.impl.BaseCloudSolrClient.requestWithRetryOnStaleState(BaseCloudSolrClient.java:934)
at org.apache.solr.client.solrj.impl.BaseCloudSolrClient.request(BaseCloudSolrClient.java:866)
at org.apache.solr.client.solrj.SolrRequest.process(SolrRequest.java:225)
at org.apache.solr.client.solrj.SolrRequest.process(SolrRequest.java:242)
at org.apache.solr.cloud.api.collections.ShardSplitTest.doSplitMixedReplicaTypes(ShardSplitTest.java:365)
at org.apache.solr.cloud.api.collections.ShardSplitTest.testSplitMixedReplicaTypes(ShardSplitTest.java:350)
at sun.reflect.NativeMethodAccessorImpl.invoke0(Native Method)
at sun.reflect.NativeMethodAccessorImpl.invoke(NativeMethodAccessorImpl.java:62)
at sun.reflect.DelegatingMethodAccessorImpl.invoke(DelegatingMethodAccessorImpl.java:43)
at java.lang.reflect.Method.invoke(Method.java:498)
at com.carrotsearch.randomizedtesting.RandomizedRunner.invoke(RandomizedRunner.java:1758)
at com.carrotsearch.randomizedtesting.RandomizedRunner$8.evaluate(RandomizedRunner.java:946)
at com.carrotsearch.randomizedtesting.RandomizedRunner$9.evaluate(RandomizedRunner.java:982)
at com.carrotsearch.randomizedtesting.RandomizedRunner$10.evaluate(RandomizedRunner.java:996)
at org.apache.solr.BaseDistributedSearchTestCase$ShardsRepeatRule$ShardsFixedStatement.callStatement(BaseDistributedSearchTestCase.java:1084)
at org.apache.solr.BaseDistributedSearchTestCase$ShardsRepeatRule$ShardsStatement.evaluate(BaseDistributedSearchTestCase.java:1055)
at com.carrotsearch.randomizedtesting.rules.SystemPropertiesRestoreRule$1.evaluate(SystemPropertiesRestoreRule.java:80)
at org.junit.rules.RunRules.evaluate(RunRules.java:20)
at org.apache.lucene.util.TestRuleSetupTeardownChained$1.evaluate(TestRuleSetupTeardownChained.java:49)
at org.apache.lucene.util.AbstractBeforeAfterRule$1.evaluate(AbstractBeforeAfterRule.java:45)
at org.apache.lucene.util.TestRuleThreadAndTestName$1.evaluate(TestRuleThreadAndTestName.java:48)
at org.apache.lucene.util.TestRuleIgnoreAfterMaxFailures$1.evaluate(TestRuleIgnoreAfterMaxFailures.java:64)
at org.apache.lucene.util.TestRuleMarkFailure$1.evaluate(TestRuleMarkFailure.java:47)
at org.junit.rules.RunRules.evaluate(RunRules.java:20)
at com.carrotsearch.randomizedtesting.rules.StatementAdapter.evaluate(StatementAdapter.java:36)
at com.carrotsearch.randomizedtesting.ThreadLeakControl$StatementRunner.run(ThreadLeakControl.java:390)
at com.carrotsearch.randomizedtesting.ThreadLeakControl.forkTimeoutingTask(ThreadLeakControl.java:843)
at com.carrotsearch.randomizedtesting.ThreadLeakControl$3.evaluate(ThreadLeakControl.java:490)
at com.carrotsearch.randomizedtesting.RandomizedRunner.runSingleTest(RandomizedRunner.java:955)
at com.carrotsearch.randomizedtesting.RandomizedRunner$5.evaluate(RandomizedRunner.java:840)
at com.carrotsearch.randomizedtesting.RandomizedRunner$6.evaluate(RandomizedRunner.java:891)
at com.carrotsearch.randomizedtesting.RandomizedRunner$7.evaluate(RandomizedRunner.java:902)
at com.carrotsearch.randomizedtesting.rules.StatementAdapter.evaluate(StatementAdapter.java:36)
at com.carrotsearch.randomizedtesting.rules.SystemPropertiesRestoreRule$1.evaluate(SystemPropertiesRestoreRule.java:80)
at org.junit.rules.RunRules.evaluate(RunRules.java:20)
at org.apache.lucene.util.AbstractBeforeAfterRule$1.evaluate(AbstractBeforeAfterRule.java:45)
at com.carrotsearch.randomizedtesting.rules.StatementAdapter.evaluate(StatementAdapter.java:36)
at org.apache.lucene.util.TestRuleStoreClassName$1.evaluate(TestRuleStoreClassName.java:41)
at com.carrotsearch.randomizedtesting.rules.NoShadowingOrOverridesOnMethodsRule$1.evaluate(NoShadowingOrOverridesOnMethodsRule.java:40)
at com.carrotsearch.randomizedtesting.rules.NoShadowingOrOverridesOnMethodsRule$1.evaluate(NoShadowingOrOverridesOnMethodsRule.java:40)
at com.carrotsearch.randomizedtesting.rules.StatementAdapter.evaluate(StatementAdapter.java:36)
at com.carrotsearch.randomizedtesting.rules.StatementAdapter.evaluate(StatementAdapter.java:36)
at com.carrotsearch.randomizedtesting.rules.StatementAdapter.evaluate(StatementAdapter.java:36)
at org.apache.lucene.util.TestRuleAssertionsRequired$1.evaluate(TestRuleAssertionsRequired.java:53)
at org.apache.lucene.util.TestRuleMarkFailure$1.evaluate(TestRuleMarkFailure.java:47)
at org.apache.lucene.util.TestRuleIgnoreAfterMaxFailures$1.evaluate(TestRuleIgnoreAfterMaxFailures.java:64)
at org.apache.lucene.util.TestRuleIgnoreTestSuites$1.evaluate(TestRuleIgnoreTestSuites.java:54)
at org.junit.rules.RunRules.evaluate(RunRules.java:20)
at com.carrotsearch.randomizedtesting.rules.StatementAdapter.evaluate(StatementAdapter.java:36)
at com.carrotsearch.randomizedtesting.ThreadLeakControl$StatementRunner.run(ThreadLeakControl.java:390)
at com.carrotsearch.randomizedtesting.ThreadLeakControl.lambda$forkTimeoutingTask$0(ThreadLeakControl.java:850)
at java.lang.Thread.run(Thread.java:750)
Caused by: java.net.SocketTimeoutException: Read timed out
at java.net.SocketInputStream.socketRead0(Native Method)
at java.net.SocketInputStream.socketRead(SocketInputStream.java:116)
at java.net.SocketInputStream.read(SocketInputStream.java:171)
at java.net.SocketInputStream.read(SocketInputStream.java:141)
at org.apache.http.impl.io.SessionInputBufferImpl.streamRead(SessionInputBufferImpl.java:137)
at org.apache.http.impl.io.SessionInputBufferImpl.fillBuffer(SessionInputBufferImpl.java:153)
at org.apache.http.impl.io.SessionInputBufferImpl.readLine(SessionInputBufferImpl.java:280)
at org.apache.http.impl.conn.DefaultHttpResponseParser.parseHead(DefaultHttpResponseParser.java:138)
at org.apache.http.impl.conn.DefaultHttpResponseParser.parseHead(DefaultHttpResponseParser.java:56)
at org.apache.http.impl.io.AbstractMessageParser.parse(AbstractMessageParser.java:259)
at org.apache.http.impl.DefaultBHttpClientConnection.receiveResponseHeader(DefaultBHttpClientConnection.java:163)
at org.apache.http.impl.conn.CPoolProxy.receiveResponseHeader(CPoolProxy.java:157)
at org.apache.http.protocol.HttpRequestExecutor.doReceiveResponse(HttpRequestExecutor.java:273)
at org.apache.http.protocol.HttpRequestExecutor.execute(HttpRequestExecutor.java:125)
at org.apache.http.impl.execchain.MainClientExec.execute(MainClientExec.java:272)
at org.apache.http.impl.execchain.ProtocolExec.execute(ProtocolExec.java:186)
at org.apache.http.impl.execchain.RetryExec.execute(RetryExec.java:89)
at org.apache.http.impl.execchain.RedirectExec.execute(RedirectExec.java:110)
at org.apache.http.impl.client.InternalHttpClient.doExecute(InternalHttpClient.java:185)
at org.apache.http.impl.client.CloseableHttpClient.execute(CloseableHttpClient.java:83)
at org.apache.http.impl.client.CloseableHttpClient.execute(CloseableHttpClient.java:56)
at org.apache.solr.client.solrj.impl.HttpSolrClient.executeMethod(HttpSolrClient.java:571)
... 57 more
FAILED: junit.framework.TestSuite.org.apache.solr.update.TestHdfsUpdateLog
Error Message:
1 thread leaked from SUITE scope at org.apache.solr.update.TestHdfsUpdateLog: 1) Thread[id=34716, name=Command processor, state=WAITING, group=TGRP-TestHdfsUpdateLog] at sun.misc.Unsafe.park(Native Method) at java.util.concurrent.locks.LockSupport.park(LockSupport.java:175) at java.util.concurrent.locks.AbstractQueuedSynchronizer$ConditionObject.await(AbstractQueuedSynchronizer.java:2039) at java.util.concurrent.LinkedBlockingQueue.take(LinkedBlockingQueue.java:442) at org.apache.hadoop.hdfs.server.datanode.BPServiceActor$CommandProcessingThread.processQueue(BPServiceActor.java:1291) at org.apache.hadoop.hdfs.server.datanode.BPServiceActor$CommandProcessingThread.run(BPServiceActor.java:1275)
Stack Trace:
com.carrotsearch.randomizedtesting.ThreadLeakError: 1 thread leaked from SUITE scope at org.apache.solr.update.TestHdfsUpdateLog:
1) Thread[id=34716, name=Command processor, state=WAITING, group=TGRP-TestHdfsUpdateLog]
at sun.misc.Unsafe.park(Native Method)
at java.util.concurrent.locks.LockSupport.park(LockSupport.java:175)
at java.util.concurrent.locks.AbstractQueuedSynchronizer$ConditionObject.await(AbstractQueuedSynchronizer.java:2039)
at java.util.concurrent.LinkedBlockingQueue.take(LinkedBlockingQueue.java:442)
at org.apache.hadoop.hdfs.server.datanode.BPServiceActor$CommandProcessingThread.processQueue(BPServiceActor.java:1291)
at org.apache.hadoop.hdfs.server.datanode.BPServiceActor$CommandProcessingThread.run(BPServiceActor.java:1275)
at __randomizedtesting.SeedInfo.seed([3F4643D681D4B09D]:0)
Build Log:
[...truncated 15794 lines...]
[junit4] Suite: org.apache.solr.cloud.api.collections.ShardSplitTest
[junit4] 2> 1725419 INFO (SUITE-ShardSplitTest-seed#[3F4643D681D4B09D]-worker) [ ] o.a.s.SolrTestCase Setting 'solr.default.confdir' system property to test-framework derived value of '/home/jenkins/jenkins-slave/workspace/Lucene/Lucene-Solr-Tests-8.11/solr/server/solr/configsets/_default/conf'
[junit4] 2> 1725419 INFO (SUITE-ShardSplitTest-seed#[3F4643D681D4B09D]-worker) [ ] o.a.s.SolrTestCaseJ4 SecureRandom sanity checks: test.solr.allowed.securerandom=null & java.security.egd=file:/dev/./urandom
[junit4] 2> 1725421 INFO (SUITE-ShardSplitTest-seed#[3F4643D681D4B09D]-worker) [ ] o.a.s.u.ErrorLogMuter Closing ErrorLogMuter-regex-709 after mutting 0 log messages
[junit4] 2> 1725421 INFO (SUITE-ShardSplitTest-seed#[3F4643D681D4B09D]-worker) [ ] o.a.s.u.ErrorLogMuter Creating ErrorLogMuter-regex-710 for ERROR logs matching regex: ignore_exception
[junit4] 2> 1725422 INFO (SUITE-ShardSplitTest-seed#[3F4643D681D4B09D]-worker) [ ] o.a.s.SolrTestCaseJ4 Created dataDir: /home/jenkins/jenkins-slave/workspace/Lucene/Lucene-Solr-Tests-8.11/solr/build/solr-core/test/J0/temp/solr.cloud.api.collections.ShardSplitTest_3F4643D681D4B09D-001/data-dir-126-001
[junit4] 2> 1725422 WARN (SUITE-ShardSplitTest-seed#[3F4643D681D4B09D]-worker) [ ] o.a.s.SolrTestCaseJ4 startTrackingSearchers: numOpens=1 numCloses=1
[junit4] 2> 1725422 INFO (SUITE-ShardSplitTest-seed#[3F4643D681D4B09D]-worker) [ ] o.a.s.SolrTestCaseJ4 Using TrieFields (NUMERIC_POINTS_SYSPROP=false) w/NUMERIC_DOCVALUES_SYSPROP=false
[junit4] 2> 1725424 INFO (SUITE-ShardSplitTest-seed#[3F4643D681D4B09D]-worker) [ ] o.a.s.SolrTestCaseJ4 Randomized ssl (false) and clientAuth (false) via: @org.apache.solr.SolrTestCaseJ4$SuppressSSL(bugUrl=https://issues.apache.org/jira/browse/SOLR-5776)
[junit4] 2> 1725424 INFO (SUITE-ShardSplitTest-seed#[3F4643D681D4B09D]-worker) [ ] o.a.s.BaseDistributedSearchTestCase Setting hostContext system property: /
[junit4] 2> 1725429 INFO (TEST-ShardSplitTest.testSplitMixedReplicaTypesLink-seed#[3F4643D681D4B09D]) [ ] o.a.s.u.ErrorLogMuter Closing ErrorLogMuter-regex-710 after mutting 0 log messages
[junit4] 2> 1725429 INFO (TEST-ShardSplitTest.testSplitMixedReplicaTypesLink-seed#[3F4643D681D4B09D]) [ ] o.a.s.u.ErrorLogMuter Creating ErrorLogMuter-regex-711 for ERROR logs matching regex: ignore_exception
[junit4] 2> 1725430 INFO (TEST-ShardSplitTest.testSplitMixedReplicaTypesLink-seed#[3F4643D681D4B09D]) [ ] o.a.s.c.ZkTestServer STARTING ZK TEST SERVER
[junit4] 2> 1725430 INFO (ZkTestServer Run Thread) [ ] o.a.s.c.ZkTestServer client port: 0.0.0.0/0.0.0.0:0
[junit4] 2> 1725430 INFO (ZkTestServer Run Thread) [ ] o.a.s.c.ZkTestServer Starting server
[junit4] 2> 1725431 WARN (ZkTestServer Run Thread) [ ] o.a.z.s.ServerCnxnFactory maxCnxns is not configured, using default value 0.
[junit4] 2> 1725530 INFO (TEST-ShardSplitTest.testSplitMixedReplicaTypesLink-seed#[3F4643D681D4B09D]) [ ] o.a.s.c.ZkTestServer start zk server on port: 37365
[junit4] 2> 1725530 INFO (TEST-ShardSplitTest.testSplitMixedReplicaTypesLink-seed#[3F4643D681D4B09D]) [ ] o.a.s.c.ZkTestServer waitForServerUp: 127.0.0.1:37365
[junit4] 2> 1725530 INFO (TEST-ShardSplitTest.testSplitMixedReplicaTypesLink-seed#[3F4643D681D4B09D]) [ ] o.a.s.c.ZkTestServer parse host and port list: 127.0.0.1:37365
[junit4] 2> 1725530 INFO (TEST-ShardSplitTest.testSplitMixedReplicaTypesLink-seed#[3F4643D681D4B09D]) [ ] o.a.s.c.ZkTestServer connecting to 127.0.0.1 37365
[junit4] 2> 1725532 DEBUG (TEST-ShardSplitTest.testSplitMixedReplicaTypesLink-seed#[3F4643D681D4B09D]) [ ] o.a.s.c.c.SolrZkClient Using default ZkCredentialsProvider
[junit4] 2> 1725532 INFO (TEST-ShardSplitTest.testSplitMixedReplicaTypesLink-seed#[3F4643D681D4B09D]) [ ] o.a.s.c.c.ConnectionManager Waiting for client to connect to ZooKeeper
[junit4] 2> 1725534 DEBUG (TEST-ShardSplitTest.testSplitMixedReplicaTypesLink-seed#[3F4643D681D4B09D]-EventThread) [ ] o.a.s.c.c.SolrZkClient Submitting job to respond to event WatchedEvent state:SyncConnected type:None path:null
[junit4] 2> 1725535 DEBUG (zkConnectionManagerCallback-15276-thread-1) [ ] o.a.s.c.c.ConnectionManager Watcher org.apache.solr.common.cloud.ConnectionManager@1b679057 name: ZooKeeperConnection Watcher:127.0.0.1:37365 got event WatchedEvent state:SyncConnected type:None path:null path: null type: None
[junit4] 2> 1725535 INFO (zkConnectionManagerCallback-15276-thread-1) [ ] o.a.s.c.c.ConnectionManager zkClient has connected
[junit4] 2> 1725535 INFO (TEST-ShardSplitTest.testSplitMixedReplicaTypesLink-seed#[3F4643D681D4B09D]) [ ] o.a.s.c.c.ConnectionManager Client is connected to ZooKeeper
[junit4] 2> 1725535 DEBUG (TEST-ShardSplitTest.testSplitMixedReplicaTypesLink-seed#[3F4643D681D4B09D]) [ ] o.a.s.c.c.SolrZkClient Using default ZkACLProvider
[junit4] 2> 1725535 DEBUG (TEST-ShardSplitTest.testSplitMixedReplicaTypesLink-seed#[3F4643D681D4B09D]) [ ] o.a.s.c.c.SolrZkClient makePath: /solr
[junit4] 2> 1725537 DEBUG (TEST-ShardSplitTest.testSplitMixedReplicaTypesLink-seed#[3F4643D681D4B09D]) [ ] o.a.s.c.c.SolrZkClient Using default ZkCredentialsProvider
[junit4] 2> 1725537 INFO (TEST-ShardSplitTest.testSplitMixedReplicaTypesLink-seed#[3F4643D681D4B09D]) [ ] o.a.s.c.c.ConnectionManager Waiting for client to connect to ZooKeeper
[junit4] 2> 1725538 DEBUG (TEST-ShardSplitTest.testSplitMixedReplicaTypesLink-seed#[3F4643D681D4B09D]-EventThread) [ ] o.a.s.c.c.SolrZkClient Submitting job to respond to event WatchedEvent state:SyncConnected type:None path:null
[junit4] 2> 1725538 DEBUG (zkConnectionManagerCallback-15278-thread-1) [ ] o.a.s.c.c.ConnectionManager Watcher org.apache.solr.common.cloud.ConnectionManager@43612b29 name: ZooKeeperConnection Watcher:127.0.0.1:37365/solr got event WatchedEvent state:SyncConnected type:None path:null path: null type: None
[junit4] 2> 1725538 INFO (zkConnectionManagerCallback-15278-thread-1) [ ] o.a.s.c.c.ConnectionManager zkClient has connected
[junit4] 2> 1725538 INFO (TEST-ShardSplitTest.testSplitMixedReplicaTypesLink-seed#[3F4643D681D4B09D]) [ ] o.a.s.c.c.ConnectionManager Client is connected to ZooKeeper
[junit4] 2> 1725539 DEBUG (TEST-ShardSplitTest.testSplitMixedReplicaTypesLink-seed#[3F4643D681D4B09D]) [ ] o.a.s.c.c.SolrZkClient Using default ZkACLProvider
[junit4] 2> 1725539 DEBUG (TEST-ShardSplitTest.testSplitMixedReplicaTypesLink-seed#[3F4643D681D4B09D]) [ ] o.a.s.c.c.SolrZkClient makePath: /clusterprops.json
[junit4] 2> 1725540 INFO (TEST-ShardSplitTest.testSplitMixedReplicaTypesLink-seed#[3F4643D681D4B09D]) [ ] o.a.s.c.ZkTestServer put /home/jenkins/jenkins-slave/workspace/Lucene/Lucene-Solr-Tests-8.11/solr/core/src/test-files/solr/collection1/conf/solrconfig-tlog.xml to /configs/conf1/solrconfig.xml
[junit4] 2> 1725540 DEBUG (TEST-ShardSplitTest.testSplitMixedReplicaTypesLink-seed#[3F4643D681D4B09D]) [ ] o.a.s.c.c.SolrZkClient makePath: /configs/conf1/solrconfig.xml
[junit4] 2> 1725541 INFO (TEST-ShardSplitTest.testSplitMixedReplicaTypesLink-seed#[3F4643D681D4B09D]) [ ] o.a.s.c.ZkTestServer put /home/jenkins/jenkins-slave/workspace/Lucene/Lucene-Solr-Tests-8.11/solr/core/src/test-files/solr/collection1/conf/schema15.xml to /configs/conf1/schema.xml
[junit4] 2> 1725541 DEBUG (TEST-ShardSplitTest.testSplitMixedReplicaTypesLink-seed#[3F4643D681D4B09D]) [ ] o.a.s.c.c.SolrZkClient makePath: /configs/conf1/schema.xml
[junit4] 2> 1725542 INFO (TEST-ShardSplitTest.testSplitMixedReplicaTypesLink-seed#[3F4643D681D4B09D]) [ ] o.a.s.c.ZkTestServer put /home/jenkins/jenkins-slave/workspace/Lucene/Lucene-Solr-Tests-8.11/solr/core/src/test-files/solr/collection1/conf/solrconfig.snippet.randomindexconfig.xml to /configs/conf1/solrconfig.snippet.randomindexconfig.xml
[junit4] 2> 1725542 DEBUG (TEST-ShardSplitTest.testSplitMixedReplicaTypesLink-seed#[3F4643D681D4B09D]) [ ] o.a.s.c.c.SolrZkClient makePath: /configs/conf1/solrconfig.snippet.randomindexconfig.xml
[junit4] 2> 1725543 INFO (TEST-ShardSplitTest.testSplitMixedReplicaTypesLink-seed#[3F4643D681D4B09D]) [ ] o.a.s.c.ZkTestServer put /home/jenkins/jenkins-slave/workspace/Lucene/Lucene-Solr-Tests-8.11/solr/core/src/test-files/solr/collection1/conf/stopwords.txt to /configs/conf1/stopwords.txt
[junit4] 2> 1725543 DEBUG (TEST-ShardSplitTest.testSplitMixedReplicaTypesLink-seed#[3F4643D681D4B09D]) [ ] o.a.s.c.c.SolrZkClient makePath: /configs/conf1/stopwords.txt
[junit4] 2> 1725544 INFO (TEST-ShardSplitTest.testSplitMixedReplicaTypesLink-seed#[3F4643D681D4B09D]) [ ] o.a.s.c.ZkTestServer put /home/jenkins/jenkins-slave/workspace/Lucene/Lucene-Solr-Tests-8.11/solr/core/src/test-files/solr/collection1/conf/protwords.txt to /configs/conf1/protwords.txt
[junit4] 2> 1725544 DEBUG (TEST-ShardSplitTest.testSplitMixedReplicaTypesLink-seed#[3F4643D681D4B09D]) [ ] o.a.s.c.c.SolrZkClient makePath: /configs/conf1/protwords.txt
[junit4] 2> 1725545 INFO (TEST-ShardSplitTest.testSplitMixedReplicaTypesLink-seed#[3F4643D681D4B09D]) [ ] o.a.s.c.ZkTestServer put /home/jenkins/jenkins-slave/workspace/Lucene/Lucene-Solr-Tests-8.11/solr/core/src/test-files/solr/collection1/conf/currency.xml to /configs/conf1/currency.xml
[junit4] 2> 1725545 DEBUG (TEST-ShardSplitTest.testSplitMixedReplicaTypesLink-seed#[3F4643D681D4B09D]) [ ] o.a.s.c.c.SolrZkClient makePath: /configs/conf1/currency.xml
[junit4] 2> 1725546 INFO (TEST-ShardSplitTest.testSplitMixedReplicaTypesLink-seed#[3F4643D681D4B09D]) [ ] o.a.s.c.ZkTestServer put /home/jenkins/jenkins-slave/workspace/Lucene/Lucene-Solr-Tests-8.11/solr/core/src/test-files/solr/collection1/conf/enumsConfig.xml to /configs/conf1/enumsConfig.xml
[junit4] 2> 1725546 DEBUG (TEST-ShardSplitTest.testSplitMixedReplicaTypesLink-seed#[3F4643D681D4B09D]) [ ] o.a.s.c.c.SolrZkClient makePath: /configs/conf1/enumsConfig.xml
[junit4] 2> 1725547 INFO (TEST-ShardSplitTest.testSplitMixedReplicaTypesLink-seed#[3F4643D681D4B09D]) [ ] o.a.s.c.ZkTestServer put /home/jenkins/jenkins-slave/workspace/Lucene/Lucene-Solr-Tests-8.11/solr/core/src/test-files/solr/collection1/conf/open-exchange-rates.json to /configs/conf1/open-exchange-rates.json
[junit4] 2> 1725547 DEBUG (TEST-ShardSplitTest.testSplitMixedReplicaTypesLink-seed#[3F4643D681D4B09D]) [ ] o.a.s.c.c.SolrZkClient makePath: /configs/conf1/open-exchange-rates.json
[junit4] 2> 1725548 INFO (TEST-ShardSplitTest.testSplitMixedReplicaTypesLink-seed#[3F4643D681D4B09D]) [ ] o.a.s.c.ZkTestServer put /home/jenkins/jenkins-slave/workspace/Lucene/Lucene-Solr-Tests-8.11/solr/core/src/test-files/solr/collection1/conf/mapping-ISOLatin1Accent.txt to /configs/conf1/mapping-ISOLatin1Accent.txt
[junit4] 2> 1725548 DEBUG (TEST-ShardSplitTest.testSplitMixedReplicaTypesLink-seed#[3F4643D681D4B09D]) [ ] o.a.s.c.c.SolrZkClient makePath: /configs/conf1/mapping-ISOLatin1Accent.txt
[junit4] 2> 1725549 INFO (TEST-ShardSplitTest.testSplitMixedReplicaTypesLink-seed#[3F4643D681D4B09D]) [ ] o.a.s.c.ZkTestServer put /home/jenkins/jenkins-slave/workspace/Lucene/Lucene-Solr-Tests-8.11/solr/core/src/test-files/solr/collection1/conf/old_synonyms.txt to /configs/conf1/old_synonyms.txt
[junit4] 2> 1725549 DEBUG (TEST-ShardSplitTest.testSplitMixedReplicaTypesLink-seed#[3F4643D681D4B09D]) [ ] o.a.s.c.c.SolrZkClient makePath: /configs/conf1/old_synonyms.txt
[junit4] 2> 1725551 INFO (TEST-ShardSplitTest.testSplitMixedReplicaTypesLink-seed#[3F4643D681D4B09D]) [ ] o.a.s.c.ZkTestServer put /home/jenkins/jenkins-slave/workspace/Lucene/Lucene-Solr-Tests-8.11/solr/core/src/test-files/solr/collection1/conf/synonyms.txt to /configs/conf1/synonyms.txt
[junit4] 2> 1725551 DEBUG (TEST-ShardSplitTest.testSplitMixedReplicaTypesLink-seed#[3F4643D681D4B09D]) [ ] o.a.s.c.c.SolrZkClient makePath: /configs/conf1/synonyms.txt
[junit4] 2> 1725553 INFO (TEST-ShardSplitTest.testSplitMixedReplicaTypesLink-seed#[3F4643D681D4B09D]) [ ] o.a.s.c.AbstractFullDistribZkTestBase Will use NRT replicas unless explicitly asked otherwise
[junit4] 2> 1725703 INFO (TEST-ShardSplitTest.testSplitMixedReplicaTypesLink-seed#[3F4643D681D4B09D]) [ ] o.a.s.c.s.e.JettySolrRunner Start Jetty (configured port=0, binding port=0)
[junit4] 2> 1725703 INFO (TEST-ShardSplitTest.testSplitMixedReplicaTypesLink-seed#[3F4643D681D4B09D]) [ ] o.a.s.c.s.e.JettySolrRunner Trying to start Jetty on port 0 try number 2 ...
[junit4] 2> 1725703 INFO (TEST-ShardSplitTest.testSplitMixedReplicaTypesLink-seed#[3F4643D681D4B09D]) [ ] o.e.j.s.Server jetty-9.4.53.v20231009; built: 2023-10-09T12:29:09.265Z; git: 27bde00a0b95a1d5bbee0eae7984f891d2d0f8c9; jvm 1.8.0_362-b09
[junit4] 2> 1725704 INFO (TEST-ShardSplitTest.testSplitMixedReplicaTypesLink-seed#[3F4643D681D4B09D]) [ ] o.e.j.s.session DefaultSessionIdManager workerName=node0
[junit4] 2> 1725704 INFO (TEST-ShardSplitTest.testSplitMixedReplicaTypesLink-seed#[3F4643D681D4B09D]) [ ] o.e.j.s.session No SessionScavenger set, using defaults
[junit4] 2> 1725705 INFO (TEST-ShardSplitTest.testSplitMixedReplicaTypesLink-seed#[3F4643D681D4B09D]) [ ] o.e.j.s.session node0 Scavenging every 600000ms
[junit4] 2> 1725705 INFO (TEST-ShardSplitTest.testSplitMixedReplicaTypesLink-seed#[3F4643D681D4B09D]) [ ] o.e.j.s.h.ContextHandler Started o.e.j.s.ServletContextHandler@3b02aa0f{/,null,AVAILABLE}
[junit4] 2> 1725706 INFO (TEST-ShardSplitTest.testSplitMixedReplicaTypesLink-seed#[3F4643D681D4B09D]) [ ] o.e.j.s.AbstractConnector Started ServerConnector@717b0cf2{HTTP/1.1, (http/1.1, h2c)}{127.0.0.1:40373}
[junit4] 2> 1725706 INFO (TEST-ShardSplitTest.testSplitMixedReplicaTypesLink-seed#[3F4643D681D4B09D]) [ ] o.e.j.s.Server Started @1725744ms
[junit4] 2> 1725706 INFO (TEST-ShardSplitTest.testSplitMixedReplicaTypesLink-seed#[3F4643D681D4B09D]) [ ] o.a.s.c.s.e.JettySolrRunner Jetty properties: {solr.data.dir=/home/jenkins/jenkins-slave/workspace/Lucene/Lucene-Solr-Tests-8.11/solr/build/solr-core/test/J0/temp/solr.cloud.api.collections.ShardSplitTest_3F4643D681D4B09D-001/tempDir-001/control/data, replicaType=NRT, hostContext=/, hostPort=40373, coreRootDirectory=/home/jenkins/jenkins-slave/workspace/Lucene/Lucene-Solr-Tests-8.11/solr/build/solr-core/test/J0/temp/solr.cloud.api.collections.ShardSplitTest_3F4643D681D4B09D-001/control-001/cores}
[junit4] 2> 1725706 ERROR (TEST-ShardSplitTest.testSplitMixedReplicaTypesLink-seed#[3F4643D681D4B09D]) [ ] o.a.s.u.StartupLoggingUtils Missing Java Option solr.log.dir. Logging may be missing or incomplete.
[junit4] 2> 1725706 INFO (TEST-ShardSplitTest.testSplitMixedReplicaTypesLink-seed#[3F4643D681D4B09D]) [ ] o.a.s.s.SolrDispatchFilter Using logger factory org.apache.logging.slf4j.Log4jLoggerFactory
[junit4] 2> 1725706 INFO (TEST-ShardSplitTest.testSplitMixedReplicaTypesLink-seed#[3F4643D681D4B09D]) [ ] o.a.s.s.SolrDispatchFilter ___ _ Welcome to Apache Solr™ version 8.11.3
[junit4] 2> 1725706 INFO (TEST-ShardSplitTest.testSplitMixedReplicaTypesLink-seed#[3F4643D681D4B09D]) [ ] o.a.s.s.SolrDispatchFilter / __| ___| |_ _ Starting in cloud mode on port null
[junit4] 2> 1725706 INFO (TEST-ShardSplitTest.testSplitMixedReplicaTypesLink-seed#[3F4643D681D4B09D]) [ ] o.a.s.s.SolrDispatchFilter \__ \/ _ \ | '_| Install dir: /home/jenkins/jenkins-slave/workspace/Lucene/Lucene-Solr-Tests-8.11/solr
[junit4] 2> 1725706 INFO (TEST-ShardSplitTest.testSplitMixedReplicaTypesLink-seed#[3F4643D681D4B09D]) [ ] o.a.s.s.SolrDispatchFilter |___/\___/_|_| Start time: 2024-01-30T12:00:25.371Z
[junit4] 2> 1725706 DEBUG (TEST-ShardSplitTest.testSplitMixedReplicaTypesLink-seed#[3F4643D681D4B09D]) [ ] o.a.s.c.c.SolrZkClient Using default ZkCredentialsProvider
[junit4] 2> 1725706 INFO (TEST-ShardSplitTest.testSplitMixedReplicaTypesLink-seed#[3F4643D681D4B09D]) [ ] o.a.s.c.c.ConnectionManager Waiting for client to connect to ZooKeeper
[junit4] 2> 1725708 DEBUG (TEST-ShardSplitTest.testSplitMixedReplicaTypesLink-seed#[3F4643D681D4B09D]-EventThread) [ ] o.a.s.c.c.SolrZkClient Submitting job to respond to event WatchedEvent state:SyncConnected type:None path:null
[junit4] 2> 1725708 DEBUG (zkConnectionManagerCallback-15280-thread-1) [ ] o.a.s.c.c.ConnectionManager Watcher org.apache.solr.common.cloud.ConnectionManager@1efa1f94 name: ZooKeeperConnection Watcher:127.0.0.1:37365/solr got event WatchedEvent state:SyncConnected type:None path:null path: null type: None
[junit4] 2> 1725708 INFO (zkConnectionManagerCallback-15280-thread-1) [ ] o.a.s.c.c.ConnectionManager zkClient has connected
[junit4] 2> 1725708 INFO (TEST-ShardSplitTest.testSplitMixedReplicaTypesLink-seed#[3F4643D681D4B09D]) [ ] o.a.s.c.c.ConnectionManager Client is connected to ZooKeeper
[junit4] 2> 1725708 DEBUG (TEST-ShardSplitTest.testSplitMixedReplicaTypesLink-seed#[3F4643D681D4B09D]) [ ] o.a.s.c.c.SolrZkClient Using default ZkACLProvider
[junit4] 2> 1725810 DEBUG (TEST-ShardSplitTest.testSplitMixedReplicaTypesLink-seed#[3F4643D681D4B09D]-EventThread) [ ] o.a.s.c.c.SolrZkClient Submitting job to respond to event WatchedEvent state:Closed type:None path:null
[junit4] 2> 1725810 INFO (TEST-ShardSplitTest.testSplitMixedReplicaTypesLink-seed#[3F4643D681D4B09D]) [ ] o.a.s.s.SolrDispatchFilter Loading solr.xml from SolrHome (not found in ZooKeeper)
[junit4] 2> 1725810 INFO (TEST-ShardSplitTest.testSplitMixedReplicaTypesLink-seed#[3F4643D681D4B09D]) [ ] o.a.s.c.SolrXmlConfig Loading container configuration from /home/jenkins/jenkins-slave/workspace/Lucene/Lucene-Solr-Tests-8.11/solr/build/solr-core/test/J0/temp/solr.cloud.api.collections.ShardSplitTest_3F4643D681D4B09D-001/control-001/solr.xml
[junit4] 2> 1725814 INFO (TEST-ShardSplitTest.testSplitMixedReplicaTypesLink-seed#[3F4643D681D4B09D]) [ ] o.a.s.c.SolrXmlConfig Configuration parameter autoReplicaFailoverWorkLoopDelay is ignored
[junit4] 2> 1725814 INFO (TEST-ShardSplitTest.testSplitMixedReplicaTypesLink-seed#[3F4643D681D4B09D]) [ ] o.a.s.c.SolrXmlConfig Configuration parameter autoReplicaFailoverBadNodeExpiration is ignored
[junit4] 2> 1725839 INFO (TEST-ShardSplitTest.testSplitMixedReplicaTypesLink-seed#[3F4643D681D4B09D]) [ ] o.a.s.c.SolrXmlConfig MBean server found: com.sun.jmx.mbeanserver.JmxMBeanServer@337c6fa1, but no JMX reporters were configured - adding default JMX reporter.
[junit4] 2> 1726045 INFO (TEST-ShardSplitTest.testSplitMixedReplicaTypesLink-seed#[3F4643D681D4B09D]) [ ] o.a.s.h.c.HttpShardHandlerFactory Host whitelist initialized: WhitelistHostChecker [whitelistHosts=null, whitelistHostCheckingEnabled=false]
[junit4] 2> 1726046 WARN (TEST-ShardSplitTest.testSplitMixedReplicaTypesLink-seed#[3F4643D681D4B09D]) [ ] o.e.j.u.s.S.config Trusting all certificates configured for Client@232eda14[provider=null,keyStore=null,trustStore=null]
[junit4] 2> 1726046 WARN (TEST-ShardSplitTest.testSplitMixedReplicaTypesLink-seed#[3F4643D681D4B09D]) [ ] o.e.j.u.s.S.config No Client EndPointIdentificationAlgorithm configured for Client@232eda14[provider=null,keyStore=null,trustStore=null]
[junit4] 2> 1726049 WARN (TEST-ShardSplitTest.testSplitMixedReplicaTypesLink-seed#[3F4643D681D4B09D]) [ ] o.e.j.u.s.S.config Trusting all certificates configured for Client@247e8bd4[provider=null,keyStore=null,trustStore=null]
[junit4] 2> 1726049 WARN (TEST-ShardSplitTest.testSplitMixedReplicaTypesLink-seed#[3F4643D681D4B09D]) [ ] o.e.j.u.s.S.config No Client EndPointIdentificationAlgorithm configured for Client@247e8bd4[provider=null,keyStore=null,trustStore=null]
[junit4] 2> 1726051 INFO (TEST-ShardSplitTest.testSplitMixedReplicaTypesLink-seed#[3F4643D681D4B09D]) [ ] o.a.s.c.ZkContainer Zookeeper client=127.0.0.1:37365/solr
[junit4] 2> 1726051 DEBUG (TEST-ShardSplitTest.testSplitMixedReplicaTypesLink-seed#[3F4643D681D4B09D]) [ ] o.a.s.c.c.SolrZkClient Using default ZkCredentialsProvider
[junit4] 2> 1726051 INFO (TEST-ShardSplitTest.testSplitMixedReplicaTypesLink-seed#[3F4643D681D4B09D]) [ ] o.a.s.c.c.ConnectionManager Waiting for client to connect to ZooKeeper
[junit4] 2> 1726052 DEBUG (TEST-ShardSplitTest.testSplitMixedReplicaTypesLink-seed#[3F4643D681D4B09D]-EventThread) [ ] o.a.s.c.c.SolrZkClient Submitting job to respond to event WatchedEvent state:SyncConnected type:None path:null
[junit4] 2> 1726052 DEBUG (zkConnectionManagerCallback-15291-thread-1) [ ] o.a.s.c.c.ConnectionManager Watcher org.apache.solr.common.cloud.ConnectionManager@54bf8a3d name: ZooKeeperConnection Watcher:127.0.0.1:37365 got event WatchedEvent state:SyncConnected type:None path:null path: null type: None
[junit4] 2> 1726053 INFO (zkConnectionManagerCallback-15291-thread-1) [ ] o.a.s.c.c.ConnectionManager zkClient has connected
[junit4] 2> 1726053 INFO (TEST-ShardSplitTest.testSplitMixedReplicaTypesLink-seed#[3F4643D681D4B09D]) [ ] o.a.s.c.c.ConnectionManager Client is connected to ZooKeeper
[junit4] 2> 1726053 DEBUG (TEST-ShardSplitTest.testSplitMixedReplicaTypesLink-seed#[3F4643D681D4B09D]) [ ] o.a.s.c.c.SolrZkClient Using default ZkACLProvider
[junit4] 2> 1726154 DEBUG (TEST-ShardSplitTest.testSplitMixedReplicaTypesLink-seed#[3F4643D681D4B09D]-EventThread) [ ] o.a.s.c.c.SolrZkClient Submitting job to respond to event WatchedEvent state:Closed type:None path:null
[junit4] 2> 1726155 INFO (TEST-ShardSplitTest.testSplitMixedReplicaTypesLink-seed#[3F4643D681D4B09D]) [n:127.0.0.1:40373_ ] o.a.s.c.c.ConnectionManager Waiting for client to connect to ZooKeeper
[junit4] 2> 1726155 DEBUG (TEST-ShardSplitTest.testSplitMixedReplicaTypesLink-seed#[3F4643D681D4B09D]-EventThread) [ ] o.a.s.c.c.SolrZkClient Submitting job to respond to event WatchedEvent state:SyncConnected type:None path:null
[junit4] 2> 1726155 DEBUG (zkConnectionManagerCallback-15293-thread-1) [ ] o.a.s.c.c.ConnectionManager Watcher org.apache.solr.common.cloud.ConnectionManager@49f19f97 name: ZooKeeperConnection Watcher:127.0.0.1:37365/solr got event WatchedEvent state:SyncConnected type:None path:null path: null type: None
[junit4] 2> 1726155 INFO (zkConnectionManagerCallback-15293-thread-1) [ ] o.a.s.c.c.ConnectionManager zkClient has connected
[junit4] 2> 1726156 INFO (TEST-ShardSplitTest.testSplitMixedReplicaTypesLink-seed#[3F4643D681D4B09D]) [n:127.0.0.1:40373_ ] o.a.s.c.c.ConnectionManager Client is connected to ZooKeeper
[junit4] 2> 1726156 DEBUG (TEST-ShardSplitTest.testSplitMixedReplicaTypesLink-seed#[3F4643D681D4B09D]) [n:127.0.0.1:40373_ ] o.a.s.c.c.SolrZkClient makePath: /overseer/collection-map-running
[junit4] 2> 1726157 DEBUG (TEST-ShardSplitTest.testSplitMixedReplicaTypesLink-seed#[3F4643D681D4B09D]) [n:127.0.0.1:40373_ ] o.a.s.c.c.SolrZkClient makePath: /overseer/collection-map-completed
[junit4] 2> 1726158 DEBUG (TEST-ShardSplitTest.testSplitMixedReplicaTypesLink-seed#[3F4643D681D4B09D]) [n:127.0.0.1:40373_ ] o.a.s.c.c.SolrZkClient makePath: /overseer/collection-map-failure
[junit4] 2> 1726159 DEBUG (TEST-ShardSplitTest.testSplitMixedReplicaTypesLink-seed#[3F4643D681D4B09D]) [n:127.0.0.1:40373_ ] o.a.s.c.c.SolrZkClient makePath: /overseer/async_ids
[junit4] 2> 1726160 DEBUG (TEST-ShardSplitTest.testSplitMixedReplicaTypesLink-seed#[3F4643D681D4B09D]) [n:127.0.0.1:40373_ ] o.a.s.c.c.SolrZkClient makePath: /live_nodes
[junit4] 2> 1726160 DEBUG (TEST-ShardSplitTest.testSplitMixedReplicaTypesLink-seed#[3F4643D681D4B09D]) [n:127.0.0.1:40373_ ] o.a.s.c.c.SolrZkClient makePath: /node_roles
[junit4] 2> 1726161 DEBUG (TEST-ShardSplitTest.testSplitMixedReplicaTypesLink-seed#[3F4643D681D4B09D]) [n:127.0.0.1:40373_ ] o.a.s.c.c.SolrZkClient makePath: /node_roles/data
[junit4] 2> 1726161 DEBUG (TEST-ShardSplitTest.testSplitMixedReplicaTypesLink-seed#[3F4643D681D4B09D]) [n:127.0.0.1:40373_ ] o.a.s.c.c.SolrZkClient makePath: /node_roles/data/on
[junit4] 2> 1726162 DEBUG (TEST-ShardSplitTest.testSplitMixedReplicaTypesLink-seed#[3F4643D681D4B09D]) [n:127.0.0.1:40373_ ] o.a.s.c.c.SolrZkClient makePath: /node_roles/data/off
[junit4] 2> 1726163 DEBUG (TEST-ShardSplitTest.testSplitMixedReplicaTypesLink-seed#[3F4643D681D4B09D]) [n:127.0.0.1:40373_ ] o.a.s.c.c.SolrZkClient makePath: /node_roles/overseer
[junit4] 2> 1726164 DEBUG (TEST-ShardSplitTest.testSplitMixedReplicaTypesLink-seed#[3F4643D681D4B09D]) [n:127.0.0.1:40373_ ] o.a.s.c.c.SolrZkClient makePath: /node_roles/overseer/allowed
[junit4] 2> 1726165 DEBUG (TEST-ShardSplitTest.testSplitMixedReplicaTypesLink-seed#[3F4643D681D4B09D]) [n:127.0.0.1:40373_ ] o.a.s.c.c.SolrZkClient makePath: /node_roles/overseer/preferred
[junit4] 2> 1726166 DEBUG (TEST-ShardSplitTest.testSplitMixedReplicaTypesLink-seed#[3F4643D681D4B09D]) [n:127.0.0.1:40373_ ] o.a.s.c.c.SolrZkClient makePath: /node_roles/overseer/disallowed
[junit4] 2> 1726167 DEBUG (TEST-ShardSplitTest.testSplitMixedReplicaTypesLink-seed#[3F4643D681D4B09D]) [n:127.0.0.1:40373_ ] o.a.s.c.c.SolrZkClient makePath: /node_roles/coordinator
[junit4] 2> 1726168 DEBUG (TEST-ShardSplitTest.testSplitMixedReplicaTypesLink-seed#[3F4643D681D4B09D]) [n:127.0.0.1:40373_ ] o.a.s.c.c.SolrZkClient makePath: /node_roles/coordinator/on
[junit4] 2> 1726169 DEBUG (TEST-ShardSplitTest.testSplitMixedReplicaTypesLink-seed#[3F4643D681D4B09D]) [n:127.0.0.1:40373_ ] o.a.s.c.c.SolrZkClient makePath: /node_roles/coordinator/off
[junit4] 2> 1726170 DEBUG (TEST-ShardSplitTest.testSplitMixedReplicaTypesLink-seed#[3F4643D681D4B09D]) [n:127.0.0.1:40373_ ] o.a.s.c.c.SolrZkClient makePath: /aliases.json
[junit4] 2> 1726171 DEBUG (TEST-ShardSplitTest.testSplitMixedReplicaTypesLink-seed#[3F4643D681D4B09D]) [n:127.0.0.1:40373_ ] o.a.s.c.c.SolrZkClient makePath: /autoscaling/events
[junit4] 2> 1726172 DEBUG (TEST-ShardSplitTest.testSplitMixedReplicaTypesLink-seed#[3F4643D681D4B09D]) [n:127.0.0.1:40373_ ] o.a.s.c.c.SolrZkClient makePath: /autoscaling/triggerState
[junit4] 2> 1726172 DEBUG (TEST-ShardSplitTest.testSplitMixedReplicaTypesLink-seed#[3F4643D681D4B09D]) [n:127.0.0.1:40373_ ] o.a.s.c.c.SolrZkClient makePath: /autoscaling/nodeAdded
[junit4] 2> 1726173 DEBUG (TEST-ShardSplitTest.testSplitMixedReplicaTypesLink-seed#[3F4643D681D4B09D]) [n:127.0.0.1:40373_ ] o.a.s.c.c.SolrZkClient makePath: /autoscaling/nodeLost
[junit4] 2> 1726174 DEBUG (TEST-ShardSplitTest.testSplitMixedReplicaTypesLink-seed#[3F4643D681D4B09D]) [n:127.0.0.1:40373_ ] o.a.s.c.c.SolrZkClient makePath: /clusterstate.json
[junit4] 2> 1726174 DEBUG (TEST-ShardSplitTest.testSplitMixedReplicaTypesLink-seed#[3F4643D681D4B09D]) [n:127.0.0.1:40373_ ] o.a.s.c.c.SolrZkClient makePath: /autoscaling.json
[junit4] 2> 1726175 DEBUG (TEST-ShardSplitTest.testSplitMixedReplicaTypesLink-seed#[3F4643D681D4B09D]) [n:127.0.0.1:40373_ ] o.a.s.c.c.SolrZkClient makePath: /security.json
[junit4] 2> 1726176 DEBUG (TEST-ShardSplitTest.testSplitMixedReplicaTypesLink-seed#[3F4643D681D4B09D]) [n:127.0.0.1:40373_ ] o.a.s.c.c.SolrZkClient makePath: /configs/_default/protwords.txt
[junit4] 2> 1726177 DEBUG (TEST-ShardSplitTest.testSplitMixedReplicaTypesLink-seed#[3F4643D681D4B09D]) [n:127.0.0.1:40373_ ] o.a.s.c.c.SolrZkClient makePath: /configs/_default/solrconfig.xml
[junit4] 2> 1726178 DEBUG (TEST-ShardSplitTest.testSplitMixedReplicaTypesLink-seed#[3F4643D681D4B09D]) [n:127.0.0.1:40373_ ] o.a.s.c.c.SolrZkClient makePath: /configs/_default/synonyms.txt
[junit4] 2> 1726179 DEBUG (TEST-ShardSplitTest.testSplitMixedReplicaTypesLink-seed#[3F4643D681D4B09D]) [n:127.0.0.1:40373_ ] o.a.s.c.c.SolrZkClient makePath: /configs/_default/managed-schema
[junit4] 2> 1726180 DEBUG (TEST-ShardSplitTest.testSplitMixedReplicaTypesLink-seed#[3F4643D681D4B09D]) [n:127.0.0.1:40373_ ] o.a.s.c.c.SolrZkClient makePath: /configs/_default/lang/stopwords_hi.txt
[junit4] 2> 1726181 DEBUG (TEST-ShardSplitTest.testSplitMixedReplicaTypesLink-seed#[3F4643D681D4B09D]) [n:127.0.0.1:40373_ ] o.a.s.c.c.SolrZkClient makePath: /configs/_default/lang/stopwords_fa.txt
[junit4] 2> 1726183 DEBUG (TEST-ShardSplitTest.testSplitMixedReplicaTypesLink-seed#[3F4643D681D4B09D]) [n:127.0.0.1:40373_ ] o.a.s.c.c.SolrZkClient makePath: /configs/_default/lang/stopwords_es.txt
[junit4] 2> 1726184 DEBUG (TEST-ShardSplitTest.testSplitMixedReplicaTypesLink-seed#[3F4643D681D4B09D]) [n:127.0.0.1:40373_ ] o.a.s.c.c.SolrZkClient makePath: /configs/_default/lang/stopwords_sv.txt
[junit4] 2> 1726185 DEBUG (TEST-ShardSplitTest.testSplitMixedReplicaTypesLink-seed#[3F4643D681D4B09D]) [n:127.0.0.1:40373_ ] o.a.s.c.c.SolrZkClient makePath: /configs/_default/lang/contractions_ca.txt
[junit4] 2> 1726186 DEBUG (TEST-ShardSplitTest.testSplitMixedReplicaTypesLink-seed#[3F4643D681D4B09D]) [n:127.0.0.1:40373_ ] o.a.s.c.c.SolrZkClient makePath: /configs/_default/lang/stopwords_it.txt
[junit4] 2> 1726187 DEBUG (TEST-ShardSplitTest.testSplitMixedReplicaTypesLink-seed#[3F4643D681D4B09D]) [n:127.0.0.1:40373_ ] o.a.s.c.c.SolrZkClient makePath: /configs/_default/lang/stopwords_eu.txt
[junit4] 2> 1726188 DEBUG (TEST-ShardSplitTest.testSplitMixedReplicaTypesLink-seed#[3F4643D681D4B09D]) [n:127.0.0.1:40373_ ] o.a.s.c.c.SolrZkClient makePath: /configs/_default/lang/stopwords_no.txt
[junit4] 2> 1726190 DEBUG (TEST-ShardSplitTest.testSplitMixedReplicaTypesLink-seed#[3F4643D681D4B09D]) [n:127.0.0.1:40373_ ] o.a.s.c.c.SolrZkClient makePath: /configs/_default/lang/stopwords_en.txt
[junit4] 2> 1726191 DEBUG (TEST-ShardSplitTest.testSplitMixedReplicaTypesLink-seed#[3F4643D681D4B09D]) [n:127.0.0.1:40373_ ] o.a.s.c.c.SolrZkClient makePath: /configs/_default/lang/stopwords_et.txt
[junit4] 2> 1726192 DEBUG (TEST-ShardSplitTest.testSplitMixedReplicaTypesLink-seed#[3F4643D681D4B09D]) [n:127.0.0.1:40373_ ] o.a.s.c.c.SolrZkClient makePath: /configs/_default/lang/stopwords_ar.txt
[junit4] 2> 1726193 DEBUG (TEST-ShardSplitTest.testSplitMixedReplicaTypesLink-seed#[3F4643D681D4B09D]) [n:127.0.0.1:40373_ ] o.a.s.c.c.SolrZkClient makePath: /configs/_default/lang/stopwords_fi.txt
[junit4] 2> 1726194 DEBUG (TEST-ShardSplitTest.testSplitMixedReplicaTypesLink-seed#[3F4643D681D4B09D]) [n:127.0.0.1:40373_ ] o.a.s.c.c.SolrZkClient makePath: /configs/_default/lang/stopwords_hu.txt
[junit4] 2> 1726195 DEBUG (TEST-ShardSplitTest.testSplitMixedReplicaTypesLink-seed#[3F4643D681D4B09D]) [n:127.0.0.1:40373_ ] o.a.s.c.c.SolrZkClient makePath: /configs/_default/lang/hyphenations_ga.txt
[junit4] 2> 1726197 DEBUG (TEST-ShardSplitTest.testSplitMixedReplicaTypesLink-seed#[3F4643D681D4B09D]) [n:127.0.0.1:40373_ ] o.a.s.c.c.SolrZkClient makePath: /configs/_default/lang/stopwords_nl.txt
[junit4] 2> 1726198 DEBUG (TEST-ShardSplitTest.testSplitMixedReplicaTypesLink-seed#[3F4643D681D4B09D]) [n:127.0.0.1:40373_ ] o.a.s.c.c.SolrZkClient makePath: /configs/_default/lang/stopwords_de.txt
[junit4] 2> 1726199 DEBUG (TEST-ShardSplitTest.testSplitMixedReplicaTypesLink-seed#[3F4643D681D4B09D]) [n:127.0.0.1:40373_ ] o.a.s.c.c.SolrZkClient makePath: /configs/_default/lang/stopwords_th.txt
[junit4] 2> 1726200 DEBUG (TEST-ShardSplitTest.testSplitMixedReplicaTypesLink-seed#[3F4643D681D4B09D]) [n:127.0.0.1:40373_ ] o.a.s.c.c.SolrZkClient makePath: /configs/_default/lang/stemdict_nl.txt
[junit4] 2> 1726202 DEBUG (TEST-ShardSplitTest.testSplitMixedReplicaTypesLink-seed#[3F4643D681D4B09D]) [n:127.0.0.1:40373_ ] o.a.s.c.c.SolrZkClient makePath: /configs/_default/lang/stopwords_ca.txt
[junit4] 2> 1726203 DEBUG (TEST-ShardSplitTest.testSplitMixedReplicaTypesLink-seed#[3F4643D681D4B09D]) [n:127.0.0.1:40373_ ] o.a.s.c.c.SolrZkClient makePath: /configs/_default/lang/stopwords_bg.txt
[junit4] 2> 1726204 DEBUG (TEST-ShardSplitTest.testSplitMixedReplicaTypesLink-seed#[3F4643D681D4B09D]) [n:127.0.0.1:40373_ ] o.a.s.c.c.SolrZkClient makePath: /configs/_default/lang/stopwords_gl.txt
[junit4] 2> 1726205 DEBUG (TEST-ShardSplitTest.testSplitMixedReplicaTypesLink-seed#[3F4643D681D4B09D]) [n:127.0.0.1:40373_ ] o.a.s.c.c.SolrZkClient makePath: /configs/_default/lang/stopwords_da.txt
[junit4] 2> 1726206 DEBUG (TEST-ShardSplitTest.testSplitMixedReplicaTypesLink-seed#[3F4643D681D4B09D]) [n:127.0.0.1:40373_ ] o.a.s.c.c.SolrZkClient makePath: /configs/_default/lang/stopwords_tr.txt
[junit4] 2> 1726208 DEBUG (TEST-ShardSplitTest.testSplitMixedReplicaTypesLink-seed#[3F4643D681D4B09D]) [n:127.0.0.1:40373_ ] o.a.s.c.c.SolrZkClient makePath: /configs/_default/lang/contractions_fr.txt
[junit4] 2> 1726209 DEBUG (TEST-ShardSplitTest.testSplitMixedReplicaTypesLink-seed#[3F4643D681D4B09D]) [n:127.0.0.1:40373_ ] o.a.s.c.c.SolrZkClient makePath: /configs/_default/lang/stopwords_ja.txt
[junit4] 2> 1726210 DEBUG (TEST-ShardSplitTest.testSplitMixedReplicaTypesLink-seed#[3F4643D681D4B09D]) [n:127.0.0.1:40373_ ] o.a.s.c.c.SolrZkClient makePath: /configs/_default/lang/stopwords_hy.txt
[junit4] 2> 1726211 DEBUG (TEST-ShardSplitTest.testSplitMixedReplicaTypesLink-seed#[3F4643D681D4B09D]) [n:127.0.0.1:40373_ ] o.a.s.c.c.SolrZkClient makePath: /configs/_default/lang/stoptags_ja.txt
[junit4] 2> 1726212 DEBUG (TEST-ShardSplitTest.testSplitMixedReplicaTypesLink-seed#[3F4643D681D4B09D]) [n:127.0.0.1:40373_ ] o.a.s.c.c.SolrZkClient makePath: /configs/_default/lang/contractions_it.txt
[junit4] 2> 1726214 DEBUG (TEST-ShardSplitTest.testSplitMixedReplicaTypesLink-seed#[3F4643D681D4B09D]) [n:127.0.0.1:40373_ ] o.a.s.c.c.SolrZkClient makePath: /configs/_default/lang/stopwords_cz.txt
[junit4] 2> 1726215 DEBUG (TEST-ShardSplitTest.testSplitMixedReplicaTypesLink-seed#[3F4643D681D4B09D]) [n:127.0.0.1:40373_ ] o.a.s.c.c.SolrZkClient makePath: /configs/_default/lang/stopwords_id.txt
[junit4] 2> 1726216 DEBUG (TEST-ShardSplitTest.testSplitMixedReplicaTypesLink-seed#[3F4643D681D4B09D]) [n:127.0.0.1:40373_ ] o.a.s.c.c.SolrZkClient makePath: /configs/_default/lang/stopwords_ro.txt
[junit4] 2> 1726217 DEBUG (TEST-ShardSplitTest.testSplitMixedReplicaTypesLink-seed#[3F4643D681D4B09D]) [n:127.0.0.1:40373_ ] o.a.s.c.c.SolrZkClient makePath: /configs/_default/lang/userdict_ja.txt
[junit4] 2> 1726218 DEBUG (TEST-ShardSplitTest.testSplitMixedReplicaTypesLink-seed#[3F4643D681D4B09D]) [n:127.0.0.1:40373_ ] o.a.s.c.c.SolrZkClient makePath: /configs/_default/lang/stopwords_el.txt
[junit4] 2> 1726219 DEBUG (TEST-ShardSplitTest.testSplitMixedReplicaTypesLink-seed#[3F4643D681D4B09D]) [n:127.0.0.1:40373_ ] o.a.s.c.c.SolrZkClient makePath: /configs/_default/lang/stopwords_ga.txt
[junit4] 2> 1726221 DEBUG (TEST-ShardSplitTest.testSplitMixedReplicaTypesLink-seed#[3F4643D681D4B09D]) [n:127.0.0.1:40373_ ] o.a.s.c.c.SolrZkClient makePath: /configs/_default/lang/stopwords_fr.txt
[junit4] 2> 1726222 DEBUG (TEST-ShardSplitTest.testSplitMixedReplicaTypesLink-seed#[3F4643D681D4B09D]) [n:127.0.0.1:40373_ ] o.a.s.c.c.SolrZkClient makePath: /configs/_default/lang/contractions_ga.txt
[junit4] 2> 1726223 DEBUG (TEST-ShardSplitTest.testSplitMixedReplicaTypesLink-seed#[3F4643D681D4B09D]) [n:127.0.0.1:40373_ ] o.a.s.c.c.SolrZkClient makePath: /configs/_default/lang/stopwords_lv.txt
[junit4] 2> 1726224 DEBUG (TEST-ShardSplitTest.testSplitMixedReplicaTypesLink-seed#[3F4643D681D4B09D]) [n:127.0.0.1:40373_ ] o.a.s.c.c.SolrZkClient makePath: /configs/_default/lang/stopwords_ru.txt
[junit4] 2> 1726225 DEBUG (TEST-ShardSplitTest.testSplitMixedReplicaTypesLink-seed#[3F4643D681D4B09D]) [n:127.0.0.1:40373_ ] o.a.s.c.c.SolrZkClient makePath: /configs/_default/lang/stopwords_pt.txt
[junit4] 2> 1726232 DEBUG (TEST-ShardSplitTest.testSplitMixedReplicaTypesLink-seed#[3F4643D681D4B09D]) [n:127.0.0.1:40373_ ] o.a.s.c.c.SolrZkClient makePath: /configs/_default/stopwords.txt
[junit4] 2> 1726235 WARN (TEST-ShardSplitTest.testSplitMixedReplicaTypesLink-seed#[3F4643D681D4B09D]) [n:127.0.0.1:40373_ ] o.a.s.c.ZkController Contents of zookeeper /security.json are world-readable; consider setting up ACLs as described in https://solr.apache.org/guide/zookeeper-access-control.html
[junit4] 2> 1726235 DEBUG (TEST-ShardSplitTest.testSplitMixedReplicaTypesLink-seed#[3F4643D681D4B09D]) [n:127.0.0.1:40373_ ] o.a.s.c.c.ZkStateReader Updating cluster state from ZooKeeper...
[junit4] 2> 1726235 DEBUG (TEST-ShardSplitTest.testSplitMixedReplicaTypesLink-seed#[3F4643D681D4B09D]) [n:127.0.0.1:40373_ ] o.a.s.c.c.ZkStateReader Loaded cluster properties: {legacyCloud=true}
[junit4] 2> 1726236 DEBUG (TEST-ShardSplitTest.testSplitMixedReplicaTypesLink-seed#[3F4643D681D4B09D]) [n:127.0.0.1:40373_ ] o.a.s.c.c.ZkStateReader Updated live nodes from ZooKeeper... [] -> []
[junit4] 2> 1726236 DEBUG (TEST-ShardSplitTest.testSplitMixedReplicaTypesLink-seed#[3F4643D681D4B09D]) [n:127.0.0.1:40373_ ] o.a.s.c.c.ZkStateReader clusterStateSet: legacy [0] interesting [0] watched [0] lazy [2] total [2]
[junit4] 2> 1726236 DEBUG (TEST-ShardSplitTest.testSplitMixedReplicaTypesLink-seed#[3F4643D681D4B09D]) [n:127.0.0.1:40373_ ] o.a.s.c.c.ZkStateReader$AliasesManager Checking ZK for most up to date Aliases /aliases.json
[junit4] 2> 1726237 DEBUG (TEST-ShardSplitTest.testSplitMixedReplicaTypesLink-seed#[3F4643D681D4B09D]) [n:127.0.0.1:40373_ ] o.a.s.c.c.ZkStateReader$AliasesManager Aliases: cmp=-1, new definition is: Aliases{collectionAliases={}, collectionAliasProperties={}, zNodeVersion=0}
[junit4] 2> 1726238 DEBUG (TEST-ShardSplitTest.testSplitMixedReplicaTypesLink-seed#[3F4643D681D4B09D]) [n:127.0.0.1:40373_ ] o.a.s.c.c.SolrZkClient makePath: /overseer_elect
[junit4] 2> 1726238 DEBUG (TEST-ShardSplitTest.testSplitMixedReplicaTypesLink-seed#[3F4643D681D4B09D]) [n:127.0.0.1:40373_ ] o.a.s.c.c.SolrZkClient makePath: /overseer_elect/election
[junit4] 2> 1726239 INFO (TEST-ShardSplitTest.testSplitMixedReplicaTypesLink-seed#[3F4643D681D4B09D]) [n:127.0.0.1:40373_ ] o.a.s.c.OverseerElectionContext I am going to be the leader 127.0.0.1:40373_
[junit4] 2> 1726239 DEBUG (TEST-ShardSplitTest.testSplitMixedReplicaTypesLink-seed#[3F4643D681D4B09D]) [n:127.0.0.1:40373_ ] o.a.s.c.c.SolrZkClient makePath: /overseer_elect/leader
[junit4] 2> 1726240 INFO (TEST-ShardSplitTest.testSplitMixedReplicaTypesLink-seed#[3F4643D681D4B09D]) [n:127.0.0.1:40373_ ] o.a.s.c.Overseer Overseer (id=72087103957958660-127.0.0.1:40373_-n_0000000000) starting
[junit4] 2> 1726240 DEBUG (TEST-ShardSplitTest.testSplitMixedReplicaTypesLink-seed#[3F4643D681D4B09D]) [n:127.0.0.1:40373_ ] o.a.s.c.c.SolrZkClient makePath: /overseer/queue
[junit4] 2> 1726246 DEBUG (TEST-ShardSplitTest.testSplitMixedReplicaTypesLink-seed#[3F4643D681D4B09D]) [n:127.0.0.1:40373_ ] o.a.s.c.c.SolrZkClient makePath: /overseer/queue-work
[junit4] 2> 1726251 DEBUG (TEST-ShardSplitTest.testSplitMixedReplicaTypesLink-seed#[3F4643D681D4B09D]) [n:127.0.0.1:40373_ ] o.a.s.c.c.SolrZkClient makePath: /overseer/collection-queue-work
[junit4] 2> 1726254 DEBUG (OverseerCollectionConfigSetProcessor-72087103957958660-127.0.0.1:40373_-n_0000000000) [n:127.0.0.1:40373_ ] o.a.s.c.OverseerTaskProcessor Process current queue of overseer operations
[junit4] 2> 1726256 INFO (OverseerStateUpdate-72087103957958660-127.0.0.1:40373_-n_0000000000) [n:127.0.0.1:40373_ ] o.a.s.c.Overseer Starting to work on the main queue : 127.0.0.1:40373_
[junit4] 2> 1726257 INFO (TEST-ShardSplitTest.testSplitMixedReplicaTypesLink-seed#[3F4643D681D4B09D]) [n:127.0.0.1:40373_ ] o.a.s.c.ZkController Register node as live in ZooKeeper:/live_nodes/127.0.0.1:40373_
[junit4] 2> 1726259 DEBUG (TEST-ShardSplitTest.testSplitMixedReplicaTypesLink-seed#[3F4643D681D4B09D]-EventThread) [ ] o.a.s.c.c.SolrZkClient Submitting job to respond to event WatchedEvent state:SyncConnected type:NodeChildrenChanged path:/live_nodes
[junit4] 2> 1726260 INFO (OverseerStateUpdate-72087103957958660-127.0.0.1:40373_-n_0000000000) [n:127.0.0.1:40373_ ] o.a.s.c.c.ZkStateReader Updated live nodes from ZooKeeper... (0) -> (1)
[junit4] 2> 1726260 DEBUG (zkCallback-15292-thread-1) [ ] o.a.s.c.c.ZkStateReader A live node change: [WatchedEvent state:SyncConnected type:NodeChildrenChanged path:/live_nodes], has occurred - updating... (live nodes size: [1])
[junit4] 2> 1726260 DEBUG (OverseerStateUpdate-72087103957958660-127.0.0.1:40373_-n_0000000000) [n:127.0.0.1:40373_ ] o.a.s.c.c.ZkStateReader Updated live nodes from ZooKeeper... [] -> [127.0.0.1:40373_]
[junit4] 2> 1726260 DEBUG (OverseerCollectionConfigSetProcessor-72087103957958660-127.0.0.1:40373_-n_0000000000) [n:127.0.0.1:40373_ ] o.a.s.c.OverseerTaskProcessor Cleaning up work-queue. #Running tasks: 0 #Completed tasks: 0
[junit4] 2> 1726260 DEBUG (OverseerCollectionConfigSetProcessor-72087103957958660-127.0.0.1:40373_-n_0000000000) [n:127.0.0.1:40373_ ] o.a.s.c.OverseerTaskProcessor RunningTasks: []
[junit4] 2> 1726260 DEBUG (OverseerCollectionConfigSetProcessor-72087103957958660-127.0.0.1:40373_-n_0000000000) [n:127.0.0.1:40373_ ] o.a.s.c.OverseerTaskProcessor BlockedTasks: []
[junit4] 2> 1726260 DEBUG (OverseerCollectionConfigSetProcessor-72087103957958660-127.0.0.1:40373_-n_0000000000) [n:127.0.0.1:40373_ ] o.a.s.c.OverseerTaskProcessor CompletedTasks: []
[junit4] 2> 1726260 INFO (OverseerCollectionConfigSetProcessor-72087103957958660-127.0.0.1:40373_-n_0000000000) [n:127.0.0.1:40373_ ] o.a.s.c.OverseerTaskProcessor RunningZKTasks: []
[junit4] 2> 1726260 DEBUG (OverseerAutoScalingTriggerThread-72087103957958660-127.0.0.1:40373_-n_0000000000) [ ] o.a.s.c.c.SolrZkClient makePath: /autoscaling/events/.scheduled_maintenance
[junit4] 2> 1726262 DEBUG (OverseerStateUpdate-72087103957958660-127.0.0.1:40373_-n_0000000000) [n:127.0.0.1:40373_ ] o.a.s.c.c.ZkStateReader clusterStateSet: legacy [0] interesting [0] watched [0] lazy [2] total [2]
[junit4] 2> 1726262 DEBUG (zkCallback-15292-thread-1) [ ] o.a.s.c.c.ZkStateReader Updated live nodes from ZooKeeper... [127.0.0.1:40373_] -> [127.0.0.1:40373_]
[junit4] 2> 1726265 INFO (TEST-ShardSplitTest.testSplitMixedReplicaTypesLink-seed#[3F4643D681D4B09D]) [n:127.0.0.1:40373_ ] o.a.s.c.ZkController non-data nodes now []
[junit4] 2> 1726265 DEBUG (OverseerAutoScalingTriggerThread-72087103957958660-127.0.0.1:40373_-n_0000000000) [ ] o.a.s.c.c.SolrZkClient makePath: /autoscaling/events/.auto_add_replicas
[junit4] 2> 1726267 INFO (TEST-ShardSplitTest.testSplitMixedReplicaTypesLink-seed#[3F4643D681D4B09D]) [n:127.0.0.1:40373_ ] o.a.s.p.PackageLoader /packages.json updated to version -1
[junit4] 2> 1726268 WARN (TEST-ShardSplitTest.testSplitMixedReplicaTypesLink-seed#[3F4643D681D4B09D]) [n:127.0.0.1:40373_ ] o.a.s.c.CoreContainer Not all security plugins configured! authentication=disabled authorization=disabled. Solr is only as secure as you make it. Consider configuring authentication/authorization before exposing Solr to users internal or external. See https://s.apache.org/solrsecurity for more info
[junit4] 2> 1726294 INFO (TEST-ShardSplitTest.testSplitMixedReplicaTypesLink-seed#[3F4643D681D4B09D]) [n:127.0.0.1:40373_ ] o.a.s.h.a.MetricsHistoryHandler No .system collection, keeping metrics history in memory.
[junit4] 2> 1726329 INFO (TEST-ShardSplitTest.testSplitMixedReplicaTypesLink-seed#[3F4643D681D4B09D]) [n:127.0.0.1:40373_ ] o.a.s.m.r.SolrJmxReporter JMX monitoring for 'solr.node' (registry 'solr.node') enabled at server: com.sun.jmx.mbeanserver.JmxMBeanServer@337c6fa1
[junit4] 2> 1726338 INFO (TEST-ShardSplitTest.testSplitMixedReplicaTypesLink-seed#[3F4643D681D4B09D]) [n:127.0.0.1:40373_ ] o.a.s.m.r.SolrJmxReporter JMX monitoring for 'solr.jvm' (registry 'solr.jvm') enabled at server: com.sun.jmx.mbeanserver.JmxMBeanServer@337c6fa1
[junit4] 2> 1726339 INFO (TEST-ShardSplitTest.testSplitMixedReplicaTypesLink-seed#[3F4643D681D4B09D]) [n:127.0.0.1:40373_ ] o.a.s.m.r.SolrJmxReporter JMX monitoring for 'solr.jetty' (registry 'solr.jetty') enabled at server: com.sun.jmx.mbeanserver.JmxMBeanServer@337c6fa1
[junit4] 2> 1726340 INFO (TEST-ShardSplitTest.testSplitMixedReplicaTypesLink-seed#[3F4643D681D4B09D]) [n:127.0.0.1:40373_ ] o.a.s.c.CorePropertiesLocator Found 0 core definitions underneath /home/jenkins/jenkins-slave/workspace/Lucene/Lucene-Solr-Tests-8.11/solr/build/solr-core/test/J0/temp/solr.cloud.api.collections.ShardSplitTest_3F4643D681D4B09D-001/control-001/cores
[junit4] 2> 1726354 DEBUG (TEST-ShardSplitTest.testSplitMixedReplicaTypesLink-seed#[3F4643D681D4B09D]) [ ] o.a.s.c.c.SolrZkClient Using default ZkCredentialsProvider
[junit4] 2> 1726359 INFO (TEST-ShardSplitTest.testSplitMixedReplicaTypesLink-seed#[3F4643D681D4B09D]) [ ] o.a.s.c.c.ConnectionManager Waiting for client to connect to ZooKeeper
[junit4] 2> 1726359 DEBUG (TEST-ShardSplitTest.testSplitMixedReplicaTypesLink-seed#[3F4643D681D4B09D]-EventThread) [ ] o.a.s.c.c.SolrZkClient Submitting job to respond to event WatchedEvent state:SyncConnected type:None path:null
[junit4] 2> 1726360 DEBUG (zkConnectionManagerCallback-15310-thread-1) [ ] o.a.s.c.c.ConnectionManager Watcher org.apache.solr.common.cloud.ConnectionManager@4f6cba2d name: ZooKeeperConnection Watcher:127.0.0.1:37365/solr got event WatchedEvent state:SyncConnected type:None path:null path: null type: None
[junit4] 2> 1726360 INFO (zkConnectionManagerCallback-15310-thread-1) [ ] o.a.s.c.c.ConnectionManager zkClient has connected
[junit4] 2> 1726360 INFO (TEST-ShardSplitTest.testSplitMixedReplicaTypesLink-seed#[3F4643D681D4B09D]) [ ] o.a.s.c.c.ConnectionManager Client is connected to ZooKeeper
[junit4] 2> 1726360 DEBUG (TEST-ShardSplitTest.testSplitMixedReplicaTypesLink-seed#[3F4643D681D4B09D]) [ ] o.a.s.c.c.SolrZkClient Using default ZkACLProvider
[junit4] 2> 1726360 DEBUG (TEST-ShardSplitTest.testSplitMixedReplicaTypesLink-seed#[3F4643D681D4B09D]) [ ] o.a.s.c.c.ZkStateReader Updating cluster state from ZooKeeper...
[junit4] 2> 1726361 DEBUG (TEST-ShardSplitTest.testSplitMixedReplicaTypesLink-seed#[3F4643D681D4B09D]) [ ] o.a.s.c.c.ZkStateReader Loaded cluster properties: {legacyCloud=true}
[junit4] 2> 1726361 INFO (TEST-ShardSplitTest.testSplitMixedReplicaTypesLink-seed#[3F4643D681D4B09D]) [ ] o.a.s.c.c.ZkStateReader Updated live nodes from ZooKeeper... (0) -> (1)
[junit4] 2> 1726361 DEBUG (TEST-ShardSplitTest.testSplitMixedReplicaTypesLink-seed#[3F4643D681D4B09D]) [ ] o.a.s.c.c.ZkStateReader Updated live nodes from ZooKeeper... [] -> [127.0.0.1:40373_]
[junit4] 2> 1726361 DEBUG (TEST-ShardSplitTest.testSplitMixedReplicaTypesLink-seed#[3F4643D681D4B09D]) [ ] o.a.s.c.c.ZkStateReader clusterStateSet: legacy [0] interesting [0] watched [0] lazy [2] total [2]
[junit4] 2> 1726362 DEBUG (TEST-ShardSplitTest.testSplitMixedReplicaTypesLink-seed#[3F4643D681D4B09D]) [ ] o.a.s.c.c.ZkStateReader$AliasesManager Checking ZK for most up to date Aliases /aliases.json
[junit4] 2> 1726362 DEBUG (TEST-ShardSplitTest.testSplitMixedReplicaTypesLink-seed#[3F4643D681D4B09D]) [ ] o.a.s.c.c.ZkStateReader$AliasesManager Aliases: cmp=-1, new definition is: Aliases{collectionAliases={}, collectionAliasProperties={}, zNodeVersion=0}
[junit4] 2> 1726362 INFO (TEST-ShardSplitTest.testSplitMixedReplicaTypesLink-seed#[3F4643D681D4B09D]) [ ] o.a.s.c.s.i.ZkClientClusterStateProvider Cluster at 127.0.0.1:37365/solr ready
[junit4] 2> 1726363 INFO (qtp660177323-27574) [n:127.0.0.1:40373_ ] o.a.s.s.HttpSolrCall HttpSolrCall.init(http://127.0.0.1:40373/admin/collections?action=CREATE&name=control_collection&collection.configName=conf1&createNodeSet=127.0.0.1%3A40373_&numShards=1&nrtReplicas=1&wt=javabin&version=2)
[junit4] 2> 1726365 DEBUG (TEST-ShardSplitTest.testSplitMixedReplicaTypesLink-seed#[3F4643D681D4B09D]-EventThread) [ ] o.a.s.c.c.SolrZkClient Submitting job to respond to event WatchedEvent state:SyncConnected type:NodeChildrenChanged path:/overseer/collection-queue-work
[junit4] 2> 1726365 DEBUG (TEST-ShardSplitTest.testSplitMixedReplicaTypesLink-seed#[3F4643D681D4B09D]-EventThread) [ ] o.a.s.c.c.SolrZkClient Submitting job to respond to event WatchedEvent state:SyncConnected type:NodeChildrenChanged path:/overseer/collection-queue-work
[junit4] 2> 1726366 DEBUG (OverseerCollectionConfigSetProcessor-72087103957958660-127.0.0.1:40373_-n_0000000000) [n:127.0.0.1:40373_ ] o.a.s.c.OverseerTaskProcessor Got 1 tasks from work-queue : [[org.apache.solr.cloud.OverseerTaskQueue$QueueEvent@2e684ecf]]
[junit4] 2> 1726366 DEBUG (OverseerCollectionConfigSetProcessor-72087103957958660-127.0.0.1:40373_-n_0000000000) [n:127.0.0.1:40373_ ] o.a.s.c.OverseerTaskProcessor Marked task [/overseer/collection-queue-work/qn-0000000000] as running
[junit4] 2> 1726366 DEBUG (OverseerCollectionConfigSetProcessor-72087103957958660-127.0.0.1:40373_-n_0000000000) [n:127.0.0.1:40373_ ] o.a.s.c.OverseerTaskProcessor Overseer Collection Message Handler: Get the message id: /overseer/collection-queue-work/qn-0000000000 message: {
[junit4] 2> "name":"control_collection",
[junit4] 2> "fromApi":"true",
[junit4] 2> "collection.configName":"conf1",
[junit4] 2> "numShards":"1",
[junit4] 2> "createNodeSet":"127.0.0.1:40373_",
[junit4] 2> "nrtReplicas":"1",
[junit4] 2> "stateFormat":"2",
[junit4] 2> "replicationFactor":"1",
[junit4] 2> "operation":"create"}
[junit4] 2> 1726367 DEBUG (OverseerThreadFactory-15300-thread-1-processing-n:127.0.0.1:40373_) [n:127.0.0.1:40373_ ] o.a.s.c.OverseerTaskProcessor Runner processing /overseer/collection-queue-work/qn-0000000000
[junit4] 2> 1726367 DEBUG (OverseerThreadFactory-15300-thread-1-processing-n:127.0.0.1:40373_) [n:127.0.0.1:40373_ ] o.a.s.c.a.c.OverseerCollectionMessageHandler OverseerCollectionMessageHandler.processMessage : create , {
[junit4] 2> "name":"control_collection",
[junit4] 2> "fromApi":"true",
[junit4] 2> "collection.configName":"conf1",
[junit4] 2> "numShards":"1",
[junit4] 2> "createNodeSet":"127.0.0.1:40373_",
[junit4] 2> "nrtReplicas":"1",
[junit4] 2> "stateFormat":"2",
[junit4] 2> "replicationFactor":"1",
[junit4] 2> "operation":"create"}
[junit4] 2> 1726367 DEBUG (OverseerThreadFactory-15300-thread-1-processing-n:127.0.0.1:40373_) [n:127.0.0.1:40373_ ] o.a.s.c.c.ZkStateReader$AliasesManager Checking ZK for most up to date Aliases /aliases.json
[junit4] 2> 1726367 DEBUG (OverseerCollectionConfigSetProcessor-72087103957958660-127.0.0.1:40373_-n_0000000000) [n:127.0.0.1:40373_ ] o.a.s.c.OverseerTaskProcessor Cleaning up work-queue. #Running tasks: 1 #Completed tasks: 0
[junit4] 2> 1726367 DEBUG (OverseerCollectionConfigSetProcessor-72087103957958660-127.0.0.1:40373_-n_0000000000) [n:127.0.0.1:40373_ ] o.a.s.c.OverseerTaskProcessor RunningTasks: [/overseer/collection-queue-work/qn-0000000000]
[junit4] 2> 1726367 DEBUG (OverseerCollectionConfigSetProcessor-72087103957958660-127.0.0.1:40373_-n_0000000000) [n:127.0.0.1:40373_ ] o.a.s.c.OverseerTaskProcessor BlockedTasks: []
[junit4] 2> 1726367 DEBUG (OverseerCollectionConfigSetProcessor-72087103957958660-127.0.0.1:40373_-n_0000000000) [n:127.0.0.1:40373_ ] o.a.s.c.OverseerTaskProcessor CompletedTasks: []
[junit4] 2> 1726367 INFO (OverseerCollectionConfigSetProcessor-72087103957958660-127.0.0.1:40373_-n_0000000000) [n:127.0.0.1:40373_ ] o.a.s.c.OverseerTaskProcessor RunningZKTasks: [/overseer/collection-queue-work/qn-0000000000]
[junit4] 2> 1726368 DEBUG (OverseerThreadFactory-15300-thread-1-processing-n:127.0.0.1:40373_) [n:127.0.0.1:40373_ ] o.a.s.c.c.ZkStateReader$AliasesManager Aliases: cmp=0, not overwriting ZK version.
[junit4] 2> 1726368 INFO (OverseerThreadFactory-15300-thread-1-processing-n:127.0.0.1:40373_) [n:127.0.0.1:40373_ ] o.a.s.c.a.c.CreateCollectionCmd Create collection control_collection
[junit4] 2> 1726368 DEBUG (OverseerThreadFactory-15300-thread-1-processing-n:127.0.0.1:40373_) [n:127.0.0.1:40373_ ] o.a.s.c.a.c.OverseerCollectionMessageHandler creating collections conf node /collections/control_collection
[junit4] 2> 1726369 DEBUG (OverseerThreadFactory-15300-thread-1-processing-n:127.0.0.1:40373_) [n:127.0.0.1:40373_ ] o.a.s.c.a.c.CreateCollectionCmd Check for collection zkNode: control_collection
[junit4] 2> 1726370 DEBUG (OverseerThreadFactory-15300-thread-1-processing-n:127.0.0.1:40373_) [n:127.0.0.1:40373_ ] o.a.s.c.a.c.CreateCollectionCmd Collection zkNode exists
[junit4] 2> 1726371 DEBUG (TEST-ShardSplitTest.testSplitMixedReplicaTypesLink-seed#[3F4643D681D4B09D]-EventThread) [ ] o.a.s.c.c.SolrZkClient Submitting job to respond to event WatchedEvent state:SyncConnected type:NodeChildrenChanged path:/overseer/queue
[junit4] 2> 1726371 DEBUG (OverseerStateUpdate-72087103957958660-127.0.0.1:40373_-n_0000000000) [n:127.0.0.1:40373_ ] o.a.s.c.Overseer processMessage: queueSize: 1, message = {
[junit4] 2> "name":"control_collection",
[junit4] 2> "fromApi":"true",
[junit4] 2> "collection.configName":"conf1",
[junit4] 2> "numShards":"1",
[junit4] 2> "createNodeSet":"127.0.0.1:40373_",
[junit4] 2> "nrtReplicas":"1",
[junit4] 2> "stateFormat":"2",
[junit4] 2> "replicationFactor":"1",
[junit4] 2> "operation":"create"} current state version: 0
[junit4] 2> 1726371 DEBUG (OverseerStateUpdate-72087103957958660-127.0.0.1:40373_-n_0000000000) [n:127.0.0.1:40373_ ] o.a.s.c.o.ClusterStateMutator building a new cName: control_collection
[junit4] 2> 1726373 DEBUG (OverseerStateUpdate-72087103957958660-127.0.0.1:40373_-n_0000000000) [n:127.0.0.1:40373_ ] o.a.s.c.o.ZkStateWriter going to create_collection /collections/control_collection/state.json
[junit4] 2> 1726373 DEBUG (TEST-ShardSplitTest.testSplitMixedReplicaTypesLink-seed#[3F4643D681D4B09D]-EventThread) [ ] o.a.s.c.c.SolrZkClient Submitting job to respond to event WatchedEvent state:SyncConnected type:NodeChildrenChanged path:/overseer/queue
[junit4] 2> 1726473 DEBUG (OverseerThreadFactory-15300-thread-1-processing-n:127.0.0.1:40373_) [n:127.0.0.1:40373_ ] o.a.s.c.a.c.CreateCollectionCmd Creating SolrCores for new collection control_collection, shardNames [shard1] , message : {
[junit4] 2> "name":"control_collection",
[junit4] 2> "fromApi":"true",
[junit4] 2> "collection.configName":"conf1",
[junit4] 2> "numShards":"1",
[junit4] 2> "createNodeSet":"127.0.0.1:40373_",
[junit4] 2> "nrtReplicas":"1",
[junit4] 2> "stateFormat":"2",
[junit4] 2> "replicationFactor":"1",
[junit4] 2> "operation":"create"}
[junit4] 2> 1726479 DEBUG (OverseerThreadFactory-15300-thread-1-processing-n:127.0.0.1:40373_) [n:127.0.0.1:40373_ ] o.a.s.c.a.c.CreateCollectionCmd Creating core control_collection_shard1_replica_n1 as part of shard shard1 of collection control_collection on 127.0.0.1:40373_
[junit4] 2> 1726480 INFO (qtp660177323-27579) [n:127.0.0.1:40373_ ] o.a.s.s.HttpSolrCall HttpSolrCall.init(http://127.0.0.1:40373/admin/cores?null)
[junit4] 2> 1726481 INFO (qtp660177323-27579) [n:127.0.0.1:40373_ x:control_collection_shard1_replica_n1 ] o.a.s.h.a.CoreAdminOperation core create command qt=/admin/cores&collection.configName=conf1&newCollection=true&name=control_collection_shard1_replica_n1&action=CREATE&numShards=1&collection=control_collection&shard=shard1&wt=javabin&version=2&replicaType=NRT
[junit4] 2> 1726481 INFO (qtp660177323-27579) [n:127.0.0.1:40373_ x:control_collection_shard1_replica_n1 ] o.a.s.c.TransientSolrCoreCacheDefault Allocating transient core cache for max 4 cores with initial capacity of 4
[junit4] 2> 1726483 DEBUG (TEST-ShardSplitTest.testSplitMixedReplicaTypesLink-seed#[3F4643D681D4B09D]-EventThread) [ ] o.a.s.c.c.SolrZkClient Submitting job to respond to event WatchedEvent state:SyncConnected type:NodeChildrenChanged path:/overseer/queue
[junit4] 2> 1726484 DEBUG (OverseerStateUpdate-72087103957958660-127.0.0.1:40373_-n_0000000000) [n:127.0.0.1:40373_ ] o.a.s.c.Overseer processMessage: queueSize: 1, message = {
[junit4] 2> "core":"control_collection_shard1_replica_n1",
[junit4] 2> "roles":null,
[junit4] 2> "node_name":"127.0.0.1:40373_",
[junit4] 2> "base_url":"http://127.0.0.1:40373",
[junit4] 2> "numShards":"1",
[junit4] 2> "state":"down",
[junit4] 2> "shard":"shard1",
[junit4] 2> "collection":"control_collection",
[junit4] 2> "type":"NRT",
[junit4] 2> "operation":"state"} current state version: 0
[junit4] 2> 1726484 DEBUG (OverseerStateUpdate-72087103957958660-127.0.0.1:40373_-n_0000000000) [n:127.0.0.1:40373_ ] o.a.s.c.o.ReplicaMutator Update state numShards=1 message={
[junit4] 2> "core":"control_collection_shard1_replica_n1",
[junit4] 2> "roles":null,
[junit4] 2> "node_name":"127.0.0.1:40373_",
[junit4] 2> "base_url":"http://127.0.0.1:40373",
[junit4] 2> "numShards":"1",
[junit4] 2> "state":"down",
[junit4] 2> "shard":"shard1",
[junit4] 2> "collection":"control_collection",
[junit4] 2> "type":"NRT",
[junit4] 2> "operation":"state"}
[junit4] 2> 1726485 DEBUG (OverseerStateUpdate-72087103957958660-127.0.0.1:40373_-n_0000000000) [n:127.0.0.1:40373_ ] o.a.s.c.o.ReplicaMutator Will update state for replica: core_node2:{
[junit4] 2> "core":"control_collection_shard1_replica_n1",
[junit4] 2> "node_name":"127.0.0.1:40373_",
[junit4] 2> "base_url":"http://127.0.0.1:40373",
[junit4] 2> "state":"down",
[junit4] 2> "type":"NRT"}
[junit4] 2> 1726485 DEBUG (OverseerStateUpdate-72087103957958660-127.0.0.1:40373_-n_0000000000) [n:127.0.0.1:40373_ ] o.a.s.c.o.ReplicaMutator Collection is now: DocCollection(control_collection//collections/control_collection/state.json/0 )={
[junit4] 2> "pullReplicas":"0",
[junit4] 2> "replicationFactor":"1",
[junit4] 2> "router":{"name":"compositeId"},
[junit4] 2> "maxShardsPerNode":"1",
[junit4] 2> "autoAddReplicas":"false",
[junit4] 2> "nrtReplicas":"1",
[junit4] 2> "tlogReplicas":"0",
[junit4] 2> "shards":{"shard1":{
[junit4] 2> "range":"80000000-7fffffff",
[junit4] 2> "state":"active",
[junit4] 2> "replicas":{"core_node2":{
[junit4] 2> "core":"control_collection_shard1_replica_n1",
[junit4] 2> "node_name":"127.0.0.1:40373_",
[junit4] 2> "base_url":"http://127.0.0.1:40373",
[junit4] 2> "state":"down",
[junit4] 2> "type":"NRT"}}}}}
[junit4] 2> 1726586 DEBUG (OverseerStateUpdate-72087103957958660-127.0.0.1:40373_-n_0000000000) [n:127.0.0.1:40373_ ] o.a.s.c.o.ZkStateWriter going to update_collection /collections/control_collection/state.json version: 0
[junit4] 2> 1726587 DEBUG (TEST-ShardSplitTest.testSplitMixedReplicaTypesLink-seed#[3F4643D681D4B09D]-EventThread) [ ] o.a.s.c.c.SolrZkClient Submitting job to respond to event WatchedEvent state:SyncConnected type:NodeChildrenChanged path:/overseer/queue
[junit4] 2> 1727486 DEBUG (qtp660177323-27579) [n:127.0.0.1:40373_ c:control_collection s:shard1 x:control_collection_shard1_replica_n1 ] o.a.s.c.c.ZkStateReader Loading collection config from: [/collections/control_collection]
[junit4] 2> 1727493 INFO (qtp660177323-27579) [n:127.0.0.1:40373_ c:control_collection s:shard1 x:control_collection_shard1_replica_n1 ] o.a.s.c.SolrConfig Using Lucene MatchVersion: 8.11.3
[junit4] 2> 1727493 WARN (qtp660177323-27579) [n:127.0.0.1:40373_ c:control_collection s:shard1 x:control_collection_shard1_replica_n1 ] o.a.s.c.SolrConfig solrconfig.xml: <jmx> is no longer supported, use solr.xml:/metrics/reporter section instead
[junit4] 2> 1727496 INFO (qtp660177323-27579) [n:127.0.0.1:40373_ c:control_collection s:shard1 x:control_collection_shard1_replica_n1 ] o.a.s.s.IndexSchema Schema name=test
[junit4] 2> 1727500 INFO (qtp660177323-27579) [n:127.0.0.1:40373_ c:control_collection s:shard1 x:control_collection_shard1_replica_n1 ] o.a.s.s.IndexSchema Loaded schema test/1.6 with uniqueid field id
[junit4] 2> 1727516 INFO (qtp660177323-27579) [n:127.0.0.1:40373_ c:control_collection s:shard1 x:control_collection_shard1_replica_n1 ] o.a.s.c.CoreContainer Creating SolrCore 'control_collection_shard1_replica_n1' using configuration from configset conf1, trusted=true
[junit4] 2> 1727517 INFO (qtp660177323-27579) [n:127.0.0.1:40373_ c:control_collection s:shard1 x:control_collection_shard1_replica_n1 ] o.a.s.m.r.SolrJmxReporter JMX monitoring for 'solr.core.control_collection.shard1.replica_n1' (registry 'solr.core.control_collection.shard1.replica_n1') enabled at server: com.sun.jmx.mbeanserver.JmxMBeanServer@337c6fa1
[junit4] 2> 1727517 INFO (qtp660177323-27579) [n:127.0.0.1:40373_ c:control_collection s:shard1 x:control_collection_shard1_replica_n1 ] o.a.s.c.SolrCore [[control_collection_shard1_replica_n1] ] Opening new SolrCore at [/home/jenkins/jenkins-slave/workspace/Lucene/Lucene-Solr-Tests-8.11/solr/build/solr-core/test/J0/temp/solr.cloud.api.collections.ShardSplitTest_3F4643D681D4B09D-001/control-001/cores/control_collection_shard1_replica_n1], dataDir=[/home/jenkins/jenkins-slave/workspace/Lucene/Lucene-Solr-Tests-8.11/solr/build/solr-core/test/J0/temp/solr.cloud.api.collections.ShardSplitTest_3F4643D681D4B09D-001/control-001/cores/control_collection_shard1_replica_n1/data/]
[junit4] 2> 1727519 INFO (qtp660177323-27579) [n:127.0.0.1:40373_ c:control_collection s:shard1 x:control_collection_shard1_replica_n1 ] o.a.s.u.RandomMergePolicy RandomMergePolicy wrapping class org.apache.lucene.index.TieredMergePolicy: [TieredMergePolicy: maxMergeAtOnce=25, maxMergeAtOnceExplicit=32, maxMergedSegmentMB=109.3388671875, floorSegmentMB=0.6748046875, forceMergeDeletesPctAllowed=3.3652937833032737, segmentsPerTier=48.0, maxCFSSegmentSizeMB=8.796093022207999E12, noCFSRatio=0.0, deletesPctAllowed=38.97082278970578
[junit4] 2> 1727564 WARN (qtp660177323-27579) [n:127.0.0.1:40373_ c:control_collection s:shard1 x:control_collection_shard1_replica_n1 ] o.a.s.c.RequestHandlers INVALID paramSet a in requestHandler {type = requestHandler,name = /dump,class = DumpRequestHandler,attributes = {initParams=a, name=/dump, class=DumpRequestHandler},args = {defaults={a=A,b=B}}}
[junit4] 2> 1727607 INFO (qtp660177323-27579) [n:127.0.0.1:40373_ c:control_collection s:shard1 x:control_collection_shard1_replica_n1 ] o.a.s.u.UpdateHandler Using UpdateLog implementation: org.apache.solr.update.UpdateLog
[junit4] 2> 1727608 INFO (qtp660177323-27579) [n:127.0.0.1:40373_ c:control_collection s:shard1 x:control_collection_shard1_replica_n1 ] o.a.s.u.UpdateLog Initializing UpdateLog: dataDir= defaultSyncLevel=FLUSH numRecordsToKeep=100 maxNumLogsToKeep=10 numVersionBuckets=65536
[junit4] 2> 1727609 INFO (qtp660177323-27579) [n:127.0.0.1:40373_ c:control_collection s:shard1 x:control_collection_shard1_replica_n1 ] o.a.s.u.CommitTracker Hard AutoCommit: disabled
[junit4] 2> 1727609 INFO (qtp660177323-27579) [n:127.0.0.1:40373_ c:control_collection s:shard1 x:control_collection_shard1_replica_n1 ] o.a.s.u.CommitTracker Soft AutoCommit: disabled
[junit4] 2> 1727609 INFO (qtp660177323-27579) [n:127.0.0.1:40373_ c:control_collection s:shard1 x:control_collection_shard1_replica_n1 ] o.a.s.u.RandomMergePolicy RandomMergePolicy wrapping class org.apache.lucene.index.TieredMergePolicy: [TieredMergePolicy: maxMergeAtOnce=35, maxMergeAtOnceExplicit=43, maxMergedSegmentMB=57.3056640625, floorSegmentMB=2.03515625, forceMergeDeletesPctAllowed=22.75440921003852, segmentsPerTier=32.0, maxCFSSegmentSizeMB=8.796093022207999E12, noCFSRatio=0.7188314062583672, deletesPctAllowed=47.65945912188225
[junit4] 2> 1727612 DEBUG (qtp660177323-27579) [n:127.0.0.1:40373_ c:control_collection s:shard1 x:control_collection_shard1_replica_n1 ] o.a.s.c.c.ZkStateReader Loading collection config from: [/collections/control_collection]
[junit4] 2> 1727612 INFO (qtp660177323-27579) [n:127.0.0.1:40373_ c:control_collection s:shard1 x:control_collection_shard1_replica_n1 ] o.a.s.r.ManagedResourceStorage Configured ZooKeeperStorageIO with znodeBase: /configs/conf1
[junit4] 2> 1727613 INFO (qtp660177323-27579) [n:127.0.0.1:40373_ c:control_collection s:shard1 x:control_collection_shard1_replica_n1 ] o.a.s.r.ManagedResourceStorage Loaded null at path _rest_managed.json using ZooKeeperStorageIO:path=/configs/conf1
[junit4] 2> 1727613 INFO (qtp660177323-27579) [n:127.0.0.1:40373_ c:control_collection s:shard1 x:control_collection_shard1_replica_n1 ] o.a.s.h.ReplicationHandler Commits will be reserved for 10000 ms
[junit4] 2> 1727613 INFO (qtp660177323-27579) [n:127.0.0.1:40373_ c:control_collection s:shard1 x:control_collection_shard1_replica_n1 ] o.a.s.u.UpdateLog Could not find max version in index or recent updates, using new clock 1789516607419056128
[junit4] 2> 1727615 DEBUG (qtp660177323-27579) [n:127.0.0.1:40373_ c:control_collection s:shard1 x:control_collection_shard1_replica_n1 ] o.a.s.c.c.ZkStateReader Waiting up to 60000ms for state org.apache.solr.cloud.ZkController$$Lambda$630/2057115066@5adaa4fb
[junit4] 2> 1727615 DEBUG (qtp660177323-27579) [n:127.0.0.1:40373_ c:control_collection s:shard1 x:control_collection_shard1_replica_n1 ] o.a.s.c.c.ZkStateReader Found org.apache.solr.cloud.ZkController$$Lambda$630/2057115066@5adaa4fb directly in clusterState
[junit4] 2> 1727616 DEBUG (qtp660177323-27579) [n:127.0.0.1:40373_ c:control_collection s:shard1 x:control_collection_shard1_replica_n1 ] o.a.s.c.c.SolrZkClient makePath: /collections/control_collection/terms/shard1
[junit4] 2> 1727616 INFO (searcherExecutor-15312-thread-1-processing-n:127.0.0.1:40373_ x:control_collection_shard1_replica_n1 c:control_collection s:shard1) [n:127.0.0.1:40373_ c:control_collection s:shard1 x:control_collection_shard1_replica_n1 ] o.a.s.c.SolrCore [control_collection_shard1_replica_n1] Registered new searcher autowarm time: 0 ms
[junit4] 2> 1727618 DEBUG (TEST-ShardSplitTest.testSplitMixedReplicaTypesLink-seed#[3F4643D681D4B09D]-EventThread) [ ] o.a.s.c.c.SolrZkClient Submitting job to respond to event WatchedEvent state:SyncConnected type:NodeDataChanged path:/collections/control_collection/terms/shard1
[junit4] 2> 1727618 INFO (qtp660177323-27579) [n:127.0.0.1:40373_ c:control_collection s:shard1 x:control_collection_shard1_replica_n1 ] o.a.s.c.ZkShardTerms Successful update of terms at /collections/control_collection/terms/shard1 to Terms{values={core_node2=0}, version=0}
[junit4] 2> 1727618 INFO (qtp660177323-27579) [n:127.0.0.1:40373_ c:control_collection s:shard1 x:control_collection_shard1_replica_n1 ] o.a.s.c.ShardLeaderElectionContextBase make sure parent is created /collections/control_collection/leaders/shard1
[junit4] 2> 1727618 DEBUG (qtp660177323-27579) [n:127.0.0.1:40373_ c:control_collection s:shard1 x:control_collection_shard1_replica_n1 ] o.a.s.c.c.SolrZkClient makePath: /collections/control_collection/leaders/shard1
[junit4] 2> 1727619 DEBUG (qtp660177323-27579) [n:127.0.0.1:40373_ c:control_collection s:shard1 x:control_collection_shard1_replica_n1 ] o.a.s.c.c.SolrZkClient makePath: /collections/control_collection/leader_elect/shard1/election
[junit4] 2> 1727621 INFO (qtp660177323-27579) [n:127.0.0.1:40373_ c:control_collection s:shard1 x:control_collection_shard1_replica_n1 ] o.a.s.c.ShardLeaderElectionContext Enough replicas found to continue.
[junit4] 2> 1727621 INFO (qtp660177323-27579) [n:127.0.0.1:40373_ c:control_collection s:shard1 x:control_collection_shard1_replica_n1 ] o.a.s.c.ShardLeaderElectionContext I may be the new leader - try and sync
[junit4] 2> 1727621 INFO (qtp660177323-27579) [n:127.0.0.1:40373_ c:control_collection s:shard1 x:control_collection_shard1_replica_n1 ] o.a.s.c.SyncStrategy Sync replicas to http://127.0.0.1:40373/control_collection_shard1_replica_n1/
[junit4] 2> 1727622 INFO (qtp660177323-27579) [n:127.0.0.1:40373_ c:control_collection s:shard1 x:control_collection_shard1_replica_n1 ] o.a.s.c.SyncStrategy Sync Success - now sync replicas to me
[junit4] 2> 1727622 INFO (qtp660177323-27579) [n:127.0.0.1:40373_ c:control_collection s:shard1 x:control_collection_shard1_replica_n1 ] o.a.s.c.SyncStrategy http://127.0.0.1:40373/control_collection_shard1_replica_n1/ has no replicas
[junit4] 2> 1727622 INFO (qtp660177323-27579) [n:127.0.0.1:40373_ c:control_collection s:shard1 x:control_collection_shard1_replica_n1 ] o.a.s.c.ShardLeaderElectionContextBase Creating leader registration node /collections/control_collection/leaders/shard1/leader after winning as /collections/control_collection/leader_elect/shard1/election/72087103957958660-core_node2-n_0000000000
[junit4] 2> 1727624 DEBUG (TEST-ShardSplitTest.testSplitMixedReplicaTypesLink-seed#[3F4643D681D4B09D]-EventThread) [ ] o.a.s.c.c.SolrZkClient Submitting job to respond to event WatchedEvent state:SyncConnected type:NodeChildrenChanged path:/overseer/queue
[junit4] 2> 1727624 INFO (qtp660177323-27579) [n:127.0.0.1:40373_ c:control_collection s:shard1 x:control_collection_shard1_replica_n1 ] o.a.s.c.ShardLeaderElectionContext I am the new leader: http://127.0.0.1:40373/control_collection_shard1_replica_n1/ shard1
[junit4] 2> 1727624 DEBUG (qtp660177323-27579) [n:127.0.0.1:40373_ c:control_collection s:shard1 x:control_collection_shard1_replica_n1 ] o.a.s.c.c.ZkStateReader already watching , added to stateWatchers
[junit4] 2> 1727624 DEBUG (OverseerStateUpdate-72087103957958660-127.0.0.1:40373_-n_0000000000) [n:127.0.0.1:40373_ ] o.a.s.c.Overseer processMessage: queueSize: 1, message = {
[junit4] 2> "operation":"leader",
[junit4] 2> "shard":"shard1",
[junit4] 2> "collection":"control_collection",
[junit4] 2> "node_name":"127.0.0.1:40373_",
[junit4] 2> "base_url":"http://127.0.0.1:40373",
[junit4] 2> "core":"control_collection_shard1_replica_n1",
[junit4] 2> "state":"active"} current state version: 0
[junit4] 2> 1727625 DEBUG (qtp660177323-27579) [n:127.0.0.1:40373_ c:control_collection s:shard1 x:control_collection_shard1_replica_n1 ] o.a.s.c.c.ZkStateReader Add data for [control_collection] ver [1]
[junit4] 2> 1727625 DEBUG (qtp660177323-27579) [n:127.0.0.1:40373_ c:control_collection s:shard1 x:control_collection_shard1_replica_n1 ] o.a.s.c.c.ZkStateReader clusterStateSet: legacy [0] interesting [1] watched [1] lazy [2] total [2]
[junit4] 2> 1727625 DEBUG (qtp660177323-27579) [n:127.0.0.1:40373_ c:control_collection s:shard1 x:control_collection_shard1_replica_n1 ] o.a.s.c.c.ZkStateReader updated per-replica states changed for: control_collection, ver: 0 , new vals:
[...truncated too long message...]
ic,STOPPED}
[junit4] 2> 2531257 INFO (Listener at localhost/37275) [ ] o.e.j.s.h.ContextHandler Stopped o.e.j.w.WebAppContext@20c74127{hdfs,/,null,STOPPED}{jar:file:/home/jenkins/.ivy2/cache/org.apache.hadoop/hadoop-hdfs/tests/hadoop-hdfs-3.2.4-tests.jar!/webapps/hdfs}
[junit4] 2> 2531257 INFO (Listener at localhost/37275) [ ] o.e.j.s.AbstractConnector Stopped ServerConnector@36188f61{HTTP/1.1, (http/1.1)}{localhost:0}
[junit4] 2> 2531257 INFO (Listener at localhost/37275) [ ] o.e.j.s.session node0 Stopped scavenging
[junit4] 2> 2531257 INFO (Listener at localhost/37275) [ ] o.e.j.s.h.ContextHandler Stopped o.e.j.s.ServletContextHandler@156c9360{static,/static,jar:file:/home/jenkins/.ivy2/cache/org.apache.hadoop/hadoop-hdfs/tests/hadoop-hdfs-3.2.4-tests.jar!/webapps/static,STOPPED}
[junit4] 2> 2531281 INFO (Listener at localhost/37275) [ ] o.a.s.u.ErrorLogMuter Closing ErrorLogMuter-regex-1354 after mutting 0 log messages
[junit4] 2> 2531281 INFO (Listener at localhost/37275) [ ] o.a.s.u.ErrorLogMuter Creating ErrorLogMuter-regex-1355 for ERROR logs matching regex: ignore_exception
[junit4] 2> 2531281 INFO (Listener at localhost/37275) [ ] o.a.s.SolrTestCaseJ4 ------------------------------------------------------- Done waiting for tracked resources to be released
[junit4] 2> Jan 30, 2024 12:13:50 PM com.carrotsearch.randomizedtesting.ThreadLeakControl checkThreadLeaks
[junit4] 2> WARNING: Will linger awaiting termination of 17 leaked thread(s).
[junit4] 2> Jan 30, 2024 12:14:00 PM com.carrotsearch.randomizedtesting.ThreadLeakControl checkThreadLeaks
[junit4] 2> SEVERE: 1 thread leaked from SUITE scope at org.apache.solr.update.TestHdfsUpdateLog:
[junit4] 2> 1) Thread[id=34716, name=Command processor, state=WAITING, group=TGRP-TestHdfsUpdateLog]
[junit4] 2> at sun.misc.Unsafe.park(Native Method)
[junit4] 2> at java.util.concurrent.locks.LockSupport.park(LockSupport.java:175)
[junit4] 2> at java.util.concurrent.locks.AbstractQueuedSynchronizer$ConditionObject.await(AbstractQueuedSynchronizer.java:2039)
[junit4] 2> at java.util.concurrent.LinkedBlockingQueue.take(LinkedBlockingQueue.java:442)
[junit4] 2> at org.apache.hadoop.hdfs.server.datanode.BPServiceActor$CommandProcessingThread.processQueue(BPServiceActor.java:1291)
[junit4] 2> at org.apache.hadoop.hdfs.server.datanode.BPServiceActor$CommandProcessingThread.run(BPServiceActor.java:1275)
[junit4] 2> Jan 30, 2024 12:14:00 PM com.carrotsearch.randomizedtesting.ThreadLeakControl tryToInterruptAll
[junit4] 2> INFO: Starting to interrupt leaked threads:
[junit4] 2> 1) Thread[id=34716, name=Command processor, state=WAITING, group=TGRP-TestHdfsUpdateLog]
[junit4] 2> 2541325 ERROR (Command processor) [ ] o.a.h.h.s.d.DataNode Command processor encountered interrupt and exit.
[junit4] 2> 2541326 WARN (Command processor) [ ] o.a.h.h.s.d.DataNode Ending command processor service for: Thread[Command processor,5,TGRP-TestHdfsUpdateLog]
[junit4] 2> Jan 30, 2024 12:14:00 PM com.carrotsearch.randomizedtesting.ThreadLeakControl tryToInterruptAll
[junit4] 2> INFO: All leaked threads terminated.
[junit4] 2> NOTE: test params are: codec=Asserting(Lucene87): {_root_=PostingsFormat(name=MockRandom), id=PostingsFormat(name=LuceneVarGapFixedInterval)}, docValues:{_version_=DocValuesFormat(name=Direct)}, maxPointsInLeafNode=1976, maxMBSortInHeap=6.4172673996176, sim=Asserting(RandomSimilarity(queryNorm=false): {}), locale=es-GT, timezone=Africa/Accra
[junit4] 2> NOTE: Linux 5.4.0-170-generic amd64/Temurin 1.8.0_362 (64-bit)/cpus=4,threads=3,free=375196488,total=514326528
[junit4] 2> NOTE: All tests run in this JVM: [TestInPlaceUpdateWithRouteField, TestComplexPhraseQParserPlugin, TestCloudSearcherWarming, TestPHPSerializedResponseWriter, LeaderFailureAfterFreshStartTest, BasicAuthIntegrationTest, OverseerSolrResponseTest, TestExclusionRuleCollectionAccess, DocumentBuilderTest, TermsComponentTest, MaxScoreCollectorTest, DistanceUnitsTest, CoreMergeIndexesAdminHandlerTest, PrimUtilsTest, SuggesterWFSTTest, ScriptEngineTest, TestUnInvertedFieldException, CacheHeaderTest, SplitShardTest, SolrIndexSplitterTest, TestExternalRoleRuleBasedAuthorizationPlugin, OverriddenZkACLAndCredentialsProvidersTest, BlockJoinFacetDistribTest, MultiThreadedOCPTest, TestRestoreCore, DistributedFacetSimpleRefinementLongTailTest, TestHdfsCloudBackupRestore, TestSnapshotCoreBackup, TestConfigSetImmutable, DistributedSpellCheckComponentTest, DeleteNodeTest, NotRequiredUniqueKeyTest, HdfsBackupRepositoryIntegrationTest, MetricsHandlerTest, ZookeeperReadAPITest, RAMDirectoryFactoryTest, GraphQueryTest, RankQParserPluginTest, PeerSyncWithIndexFingerprintCachingTest, HLLSerializationTest, TriggerSetPropertiesIntegrationTest, TestUniqueKeyFieldResource, DocValuesMissingTest, HdfsRestartWhileUpdatingTest, TestFileDictionaryLookup, HdfsUnloadDistributedZkTest, TestSolrDeletionPolicy1, TestTrieFacet, TestSolrJ, TestDocSet, TestConfigSetsAPIShareSchema, BadCopyFieldTest, TestFieldResource, TestPartialUpdateDeduplication, TestQueryTypes, TestMinimalConfig, TestCloudConsistency, IndexSizeTriggerSizeEstimationTest, ConcurrentCreateCollectionTest, TestLegacyNumericUtils, TestObjectReleaseTracker, SimpleFacetsTest, TestLRUStatsCache, TestRecoveryHdfs, AtomicUpdateProcessorFactoryTest, ShardRoutingCustomTest, FastVectorHighlighterTest, TestInitParams, TestHalfAndHalfDocValues, AuthToolTest, RuleEngineTest, TestOrdValues, TestFieldSortValues, BaseCdcrDistributedZkTest, TestIntervalFaceting, TestDistribDocBasedVersion, TestCustomDocTransformer, TestCoreDiscovery, TestLuceneIndexBackCompat, TestStressThreadBackup, TestUseDocValuesAsStored2, CreateCollectionCleanupTest, BasicZkTest, UpdateLogTest, SearchHandlerTest, CloudReplicaSourceTest, DistributedFacetPivotLongTailTest, ClassificationUpdateProcessorIntegrationTest, TestBlockCollapse, TestSchemalessBufferedUpdates, RouteFieldTest, LeaderElectionContextKeyTest, FullSolrCloudDistribCmdsTest, StatsReloadRaceTest, HdfsCollectionsAPIDistributedZkTest, ConfigureRecoveryStrategyTest, ChaosMonkeySafeLeaderWithPullReplicasTest, ResponseHeaderTest, SimpleCollectionCreateDeleteTest, TestLMDirichletSimilarityFactory, TestRetrieveFieldsOptimizer, XmlUpdateRequestHandlerTest, TestSlowCompositeReaderWrapper, TestStressLucene, TestConfigsApi, TestSchemaResource, MoveReplicaHDFSFailoverTest, TestRandomFlRTGCloud, TestFieldCacheVsDocValues, CoreAdminCreateDiscoverTest, CdcrReplicationHandlerTest, MetricUtilsTest, TestDynamicLoadingUrl, NodeAddedTriggerIntegrationTest, TestFieldCache, UUIDUpdateProcessorFallbackTest, CurrencyRangeFacetCloudTest, TestJsonFacets, DistribJoinFromCollectionTest, DocValuesNotIndexedTest, ForceLeaderTest, HttpPartitionWithTlogReplicasTest, MetricsHistoryIntegrationTest, MultiSolrCloudTestCaseTest, OutOfBoxZkACLAndCredentialsProvidersTest, OverseerTaskQueueTest, PeerSyncReplicationTest, SolrXmlInZkTest, TestCloudPivotFacet, TestCloudRecovery2, TestPullReplica, TestSolrCloudWithKerberosAlt, TestStressInPlaceUpdates, TestTolerantUpdateProcessorRandomCloud, TestWaitForStateWithJettyShutdowns, TlogReplayBufferedWhileIndexingTest, TriLevelCompositeIdRoutingTest, UnloadDistributedZkTest, VMParamsZkACLAndCredentialsProvidersTest, ZkFailoverTest, ZkSolrClientTest, ShardSplitTest, TestPivotHelperCode, TestTrackingShardHandlerFactory, TestSchemaDesignerAPI, SolrCloudReportersTest, TestCSVResponseWriter, TestSubQueryTransformer, TestSubQueryTransformerDistrib, CopyFieldTest, DateFieldTest, ExternalFileFieldSortTest, IndexSchemaTest, PrimitiveFieldTypeTest, RankFieldTest, SchemaApiFailureTest, TestCloudManagedSchema, TestCollationField, TestCollationFieldDocValues, TestOmitPositions, TestPointFields, TestReRankQParserPlugin, TestRealTimeGet, TestSearchPerf, TestSearcherReuse, TestSimpleQParserPlugin, TestSmileRequest, TestSolr4Spatial, TestSurroundQueryParser, TestTermQParserPlugin, TestCloudJSONFacetSKGEquiv, BJQParserTest, TestScoreJoinQPNoScore, SimpleMLTQParserTest, TestClassicSimilarityFactory, TestDFRSimilarityFactory, TestPerFieldSimilarity, TestPerFieldSimilarityWithDefaultOverride, TestSweetSpotSimilarityFactory, TestDefaultStatsCache, TestExactStatsCache, TestRuleBasedAuthorizationWithKerberos, SpellCheckCollatorTest, BlockDirectoryTest, DeleteByIdWithRouterFieldTest, SolrIndexConfigTest, TestHdfsUpdateLog]
[junit4] 2> NOTE: reproduce with: ant test -Dtestcase=TestHdfsUpdateLog -Dtests.seed=3F4643D681D4B09D -Dtests.multiplier=2 -Dtests.slow=true -Dtests.locale=es-GT -Dtests.timezone=Africa/Accra -Dtests.asserts=true -Dtests.file.encoding=UTF-8
[junit4] ERROR 0.00s J0 | TestHdfsUpdateLog (suite) <<<
[junit4] > Throwable #1: com.carrotsearch.randomizedtesting.ThreadLeakError: 1 thread leaked from SUITE scope at org.apache.solr.update.TestHdfsUpdateLog:
[junit4] > 1) Thread[id=34716, name=Command processor, state=WAITING, group=TGRP-TestHdfsUpdateLog]
[junit4] > at sun.misc.Unsafe.park(Native Method)
[junit4] > at java.util.concurrent.locks.LockSupport.park(LockSupport.java:175)
[junit4] > at java.util.concurrent.locks.AbstractQueuedSynchronizer$ConditionObject.await(AbstractQueuedSynchronizer.java:2039)
[junit4] > at java.util.concurrent.LinkedBlockingQueue.take(LinkedBlockingQueue.java:442)
[junit4] > at org.apache.hadoop.hdfs.server.datanode.BPServiceActor$CommandProcessingThread.processQueue(BPServiceActor.java:1291)
[junit4] > at org.apache.hadoop.hdfs.server.datanode.BPServiceActor$CommandProcessingThread.run(BPServiceActor.java:1275)
[junit4] > at __randomizedtesting.SeedInfo.seed([3F4643D681D4B09D]:0)
[junit4] Completed [912/959 (2!)] on J0 in 19.95s, 1 test, 1 error <<< FAILURES!
[...truncated 54509 lines...]
[JENKINS] Lucene » Lucene-Solr-Tests-8.11 - Build # 491 - Still Unstable!
Posted by Apache Jenkins Server <je...@builds.apache.org>.
Build: https://ci-builds.apache.org/job/Lucene/job/Lucene-Solr-Tests-8.11/491/
1 tests failed.
FAILED: junit.framework.TestSuite.org.apache.solr.cloud.api.collections.TestHdfsCloudBackupRestore
Error Message:
ObjectTracker found 5 object(s) that were not released!!! [InternalHttpClient, MMapDirectory, SolrCore, InternalHttpClient, MMapDirectory] org.apache.solr.common.util.ObjectReleaseTracker$ObjectTrackerException: org.apache.http.impl.client.InternalHttpClient at org.apache.solr.common.util.ObjectReleaseTracker.track(ObjectReleaseTracker.java:42) at org.apache.solr.client.solrj.impl.HttpClientUtil.createClient(HttpClientUtil.java:341) at org.apache.solr.client.solrj.impl.HttpClientUtil.createClient(HttpClientUtil.java:350) at org.apache.solr.handler.IndexFetcher.createHttpClient(IndexFetcher.java:233) at org.apache.solr.handler.IndexFetcher.<init>(IndexFetcher.java:275) at org.apache.solr.handler.ReplicationHandler.inform(ReplicationHandler.java:1289) at org.apache.solr.cloud.ReplicateFromLeader.startReplication(ReplicateFromLeader.java:134) at org.apache.solr.cloud.ZkController.startReplicationFromLeader(ZkController.java:1404) at org.apache.solr.cloud.RecoveryStrategy.doSyncOrReplicateRecovery(RecoveryStrategy.java:714) at org.apache.solr.cloud.RecoveryStrategy.doRecovery(RecoveryStrategy.java:339) at org.apache.solr.cloud.RecoveryStrategy.run(RecoveryStrategy.java:318) at com.codahale.metrics.InstrumentedExecutorService$InstrumentedRunnable.run(InstrumentedExecutorService.java:180) at java.util.concurrent.Executors$RunnableAdapter.call(Executors.java:511) at java.util.concurrent.FutureTask.run(FutureTask.java:266) at org.apache.solr.common.util.ExecutorUtil$MDCAwareThreadPoolExecutor.lambda$execute$0(ExecutorUtil.java:218) at java.util.concurrent.ThreadPoolExecutor.runWorker(ThreadPoolExecutor.java:1149) at java.util.concurrent.ThreadPoolExecutor$Worker.run(ThreadPoolExecutor.java:624) at java.lang.Thread.run(Thread.java:750) org.apache.solr.common.util.ObjectReleaseTracker$ObjectTrackerException: org.apache.lucene.store.MMapDirectory at org.apache.solr.common.util.ObjectReleaseTracker.track(ObjectReleaseTracker.java:42) at org.apache.solr.core.CachingDirectoryFactory.get(CachingDirectoryFactory.java:362) at org.apache.solr.core.SolrCore.initSnapshotMetaDataManager(SolrCore.java:553) at org.apache.solr.core.SolrCore.<init>(SolrCore.java:995) at org.apache.solr.core.SolrCore.<init>(SolrCore.java:921) at org.apache.solr.core.CoreContainer.createFromDescriptor(CoreContainer.java:1463) at org.apache.solr.core.CoreContainer.create(CoreContainer.java:1344) at org.apache.solr.handler.admin.CoreAdminOperation.lambda$static$0(CoreAdminOperation.java:95) at org.apache.solr.handler.admin.CoreAdminOperation.execute(CoreAdminOperation.java:367) at org.apache.solr.handler.admin.CoreAdminHandler$CallInfo.call(CoreAdminHandler.java:397) at org.apache.solr.handler.admin.CoreAdminHandler.lambda$handleRequestBody$0(CoreAdminHandler.java:189) at com.codahale.metrics.InstrumentedExecutorService$InstrumentedRunnable.run(InstrumentedExecutorService.java:180) at org.apache.solr.common.util.ExecutorUtil$MDCAwareThreadPoolExecutor.lambda$execute$0(ExecutorUtil.java:218) at java.util.concurrent.ThreadPoolExecutor.runWorker(ThreadPoolExecutor.java:1149) at java.util.concurrent.ThreadPoolExecutor$Worker.run(ThreadPoolExecutor.java:624) at java.lang.Thread.run(Thread.java:750) org.apache.solr.common.util.ObjectReleaseTracker$ObjectTrackerException: org.apache.solr.core.SolrCore at org.apache.solr.common.util.ObjectReleaseTracker.track(ObjectReleaseTracker.java:42) at org.apache.solr.core.SolrCore.<init>(SolrCore.java:1092) at org.apache.solr.core.SolrCore.<init>(SolrCore.java:921) at org.apache.solr.core.CoreContainer.createFromDescriptor(CoreContainer.java:1463) at org.apache.solr.core.CoreContainer.create(CoreContainer.java:1344) at org.apache.solr.handler.admin.CoreAdminOperation.lambda$static$0(CoreAdminOperation.java:95) at org.apache.solr.handler.admin.CoreAdminOperation.execute(CoreAdminOperation.java:367) at org.apache.solr.handler.admin.CoreAdminHandler$CallInfo.call(CoreAdminHandler.java:397) at org.apache.solr.handler.admin.CoreAdminHandler.lambda$handleRequestBody$0(CoreAdminHandler.java:189) at com.codahale.metrics.InstrumentedExecutorService$InstrumentedRunnable.run(InstrumentedExecutorService.java:180) at org.apache.solr.common.util.ExecutorUtil$MDCAwareThreadPoolExecutor.lambda$execute$0(ExecutorUtil.java:218) at java.util.concurrent.ThreadPoolExecutor.runWorker(ThreadPoolExecutor.java:1149) at java.util.concurrent.ThreadPoolExecutor$Worker.run(ThreadPoolExecutor.java:624) at java.lang.Thread.run(Thread.java:750) org.apache.solr.common.util.ObjectReleaseTracker$ObjectTrackerException: org.apache.http.impl.client.InternalHttpClient at org.apache.solr.common.util.ObjectReleaseTracker.track(ObjectReleaseTracker.java:42) at org.apache.solr.client.solrj.impl.HttpClientUtil.createClient(HttpClientUtil.java:341) at org.apache.solr.client.solrj.impl.HttpClientUtil.createClient(HttpClientUtil.java:350) at org.apache.solr.handler.IndexFetcher.createHttpClient(IndexFetcher.java:233) at org.apache.solr.handler.IndexFetcher.<init>(IndexFetcher.java:275) at org.apache.solr.handler.ReplicationHandler.doFetch(ReplicationHandler.java:454) at org.apache.solr.cloud.RecoveryStrategy.replicate(RecoveryStrategy.java:252) at org.apache.solr.cloud.RecoveryStrategy.doSyncOrReplicateRecovery(RecoveryStrategy.java:683) at org.apache.solr.cloud.RecoveryStrategy.doRecovery(RecoveryStrategy.java:339) at org.apache.solr.cloud.RecoveryStrategy.run(RecoveryStrategy.java:318) at com.codahale.metrics.InstrumentedExecutorService$InstrumentedRunnable.run(InstrumentedExecutorService.java:180) at java.util.concurrent.Executors$RunnableAdapter.call(Executors.java:511) at java.util.concurrent.FutureTask.run(FutureTask.java:266) at org.apache.solr.common.util.ExecutorUtil$MDCAwareThreadPoolExecutor.lambda$execute$0(ExecutorUtil.java:218) at java.util.concurrent.ThreadPoolExecutor.runWorker(ThreadPoolExecutor.java:1149) at java.util.concurrent.ThreadPoolExecutor$Worker.run(ThreadPoolExecutor.java:624) at java.lang.Thread.run(Thread.java:750) org.apache.solr.common.util.ObjectReleaseTracker$ObjectTrackerException: org.apache.lucene.store.MMapDirectory at org.apache.solr.common.util.ObjectReleaseTracker.track(ObjectReleaseTracker.java:42) at org.apache.solr.core.CachingDirectoryFactory.get(CachingDirectoryFactory.java:362) at org.apache.solr.update.SolrIndexWriter.create(SolrIndexWriter.java:98) at org.apache.solr.core.SolrCore.initIndex(SolrCore.java:813) at org.apache.solr.core.SolrCore.<init>(SolrCore.java:1003) at org.apache.solr.core.SolrCore.<init>(SolrCore.java:921) at org.apache.solr.core.CoreContainer.createFromDescriptor(CoreContainer.java:1463) at org.apache.solr.core.CoreContainer.create(CoreContainer.java:1344) at org.apache.solr.handler.admin.CoreAdminOperation.lambda$static$0(CoreAdminOperation.java:95) at org.apache.solr.handler.admin.CoreAdminOperation.execute(CoreAdminOperation.java:367) at org.apache.solr.handler.admin.CoreAdminHandler$CallInfo.call(CoreAdminHandler.java:397) at org.apache.solr.handler.admin.CoreAdminHandler.lambda$handleRequestBody$0(CoreAdminHandler.java:189) at com.codahale.metrics.InstrumentedExecutorService$InstrumentedRunnable.run(InstrumentedExecutorService.java:180) at org.apache.solr.common.util.ExecutorUtil$MDCAwareThreadPoolExecutor.lambda$execute$0(ExecutorUtil.java:218) at java.util.concurrent.ThreadPoolExecutor.runWorker(ThreadPoolExecutor.java:1149) at java.util.concurrent.ThreadPoolExecutor$Worker.run(ThreadPoolExecutor.java:624) at java.lang.Thread.run(Thread.java:750) expected null, but was:<ObjectTracker found 5 object(s) that were not released!!! [InternalHttpClient, MMapDirectory, SolrCore, InternalHttpClient, MMapDirectory] org.apache.solr.common.util.ObjectReleaseTracker$ObjectTrackerException: org.apache.http.impl.client.InternalHttpClient at org.apache.solr.common.util.ObjectReleaseTracker.track(ObjectReleaseTracker.java:42) at org.apache.solr.client.solrj.impl.HttpClientUtil.createClient(HttpClientUtil.java:341) at org.apache.solr.client.solrj.impl.HttpClientUtil.createClient(HttpClientUtil.java:350) at org.apache.solr.handler.IndexFetcher.createHttpClient(IndexFetcher.java:233) at org.apache.solr.handler.IndexFetcher.<init>(IndexFetcher.java:275) at org.apache.solr.handler.ReplicationHandler.inform(ReplicationHandler.java:1289) at org.apache.solr.cloud.ReplicateFromLeader.startReplication(ReplicateFromLeader.java:134) at org.apache.solr.cloud.ZkController.startReplicationFromLeader(ZkController.java:1404) at org.apache.solr.cloud.RecoveryStrategy.doSyncOrReplicateRecovery(RecoveryStrategy.java:714) at org.apache.solr.cloud.RecoveryStrategy.doRecovery(RecoveryStrategy.java:339) at org.apache.solr.cloud.RecoveryStrategy.run(RecoveryStrategy.java:318) at com.codahale.metrics.InstrumentedExecutorService$InstrumentedRunnable.run(InstrumentedExecutorService.java:180) at java.util.concurrent.Executors$RunnableAdapter.call(Executors.java:511) at java.util.concurrent.FutureTask.run(FutureTask.java:266) at org.apache.solr.common.util.ExecutorUtil$MDCAwareThreadPoolExecutor.lambda$execute$0(ExecutorUtil.java:218) at java.util.concurrent.ThreadPoolExecutor.runWorker(ThreadPoolExecutor.java:1149) at java.util.concurrent.ThreadPoolExecutor$Worker.run(ThreadPoolExecutor.java:624) at java.lang.Thread.run(Thread.java:750) org.apache.solr.common.util.ObjectReleaseTracker$ObjectTrackerException: org.apache.lucene.store.MMapDirectory at org.apache.solr.common.util.ObjectReleaseTracker.track(ObjectReleaseTracker.java:42) at org.apache.solr.core.CachingDirectoryFactory.get(CachingDirectoryFactory.java:362) at org.apache.solr.core.SolrCore.initSnapshotMetaDataManager(SolrCore.java:553) at org.apache.solr.core.SolrCore.<init>(SolrCore.java:995) at org.apache.solr.core.SolrCore.<init>(SolrCore.java:921) at org.apache.solr.core.CoreContainer.createFromDescriptor(CoreContainer.java:1463) at org.apache.solr.core.CoreContainer.create(CoreContainer.java:1344) at org.apache.solr.handler.admin.CoreAdminOperation.lambda$static$0(CoreAdminOperation.java:95) at org.apache.solr.handler.admin.CoreAdminOperation.execute(CoreAdminOperation.java:367) at org.apache.solr.handler.admin.CoreAdminHandler$CallInfo.call(CoreAdminHandler.java:397) at org.apache.solr.handler.admin.CoreAdminHandler.lambda$handleRequestBody$0(CoreAdminHandler.java:189) at com.codahale.metrics.InstrumentedExecutorService$InstrumentedRunnable.run(InstrumentedExecutorService.java:180) at org.apache.solr.common.util.ExecutorUtil$MDCAwareThreadPoolExecutor.lambda$execute$0(ExecutorUtil.java:218) at java.util.concurrent.ThreadPoolExecutor.runWorker(ThreadPoolExecutor.java:1149) at java.util.concurrent.ThreadPoolExecutor$Worker.run(ThreadPoolExecutor.java:624) at java.lang.Thread.run(Thread.java:750) org.apache.solr.common.util.ObjectReleaseTracker$ObjectTrackerException: org.apache.solr.core.SolrCore at org.apache.solr.common.util.ObjectReleaseTracker.track(ObjectReleaseTracker.java:42) at org.apache.solr.core.SolrCore.<init>(SolrCore.java:1092) at org.apache.solr.core.SolrCore.<init>(SolrCore.java:921) at org.apache.solr.core.CoreContainer.createFromDescriptor(CoreContainer.java:1463) at org.apache.solr.core.CoreContainer.create(CoreContainer.java:1344) at org.apache.solr.handler.admin.CoreAdminOperation.lambda$static$0(CoreAdminOperation.java:95) at org.apache.solr.handler.admin.CoreAdminOperation.execute(CoreAdminOperation.java:367) at org.apache.solr.handler.admin.CoreAdminHandler$CallInfo.call(CoreAdminHandler.java:397) at org.apache.solr.handler.admin.CoreAdminHandler.lambda$handleRequestBody$0(CoreAdminHandler.java:189) at com.codahale.metrics.InstrumentedExecutorService$InstrumentedRunnable.run(InstrumentedExecutorService.java:180) at org.apache.solr.common.util.ExecutorUtil$MDCAwareThreadPoolExecutor.lambda$execute$0(ExecutorUtil.java:218) at java.util.concurrent.ThreadPoolExecutor.runWorker(ThreadPoolExecutor.java:1149) at java.util.concurrent.ThreadPoolExecutor$Worker.run(ThreadPoolExecutor.java:624) at java.lang.Thread.run(Thread.java:750) org.apache.solr.common.util.ObjectReleaseTracker$ObjectTrackerException: org.apache.http.impl.client.InternalHttpClient at org.apache.solr.common.util.ObjectReleaseTracker.track(ObjectReleaseTracker.java:42) at org.apache.solr.client.solrj.impl.HttpClientUtil.createClient(HttpClientUtil.java:341) at org.apache.solr.client.solrj.impl.HttpClientUtil.createClient(HttpClientUtil.java:350) at org.apache.solr.handler.IndexFetcher.createHttpClient(IndexFetcher.java:233) at org.apache.solr.handler.IndexFetcher.<init>(IndexFetcher.java:275) at org.apache.solr.handler.ReplicationHandler.doFetch(ReplicationHandler.java:454) at org.apache.solr.cloud.RecoveryStrategy.replicate(RecoveryStrategy.java:252) at org.apache.solr.cloud.RecoveryStrategy.doSyncOrReplicateRecovery(RecoveryStrategy.java:683) at org.apache.solr.cloud.RecoveryStrategy.doRecovery(RecoveryStrategy.java:339) at org.apache.solr.cloud.RecoveryStrategy.run(RecoveryStrategy.java:318) at com.codahale.metrics.InstrumentedExecutorService$InstrumentedRunnable.run(InstrumentedExecutorService.java:180) at java.util.concurrent.Executors$RunnableAdapter.call(Executors.java:511) at java.util.concurrent.FutureTask.run(FutureTask.java:266) at org.apache.solr.common.util.ExecutorUtil$MDCAwareThreadPoolExecutor.lambda$execute$0(ExecutorUtil.java:218) at java.util.concurrent.ThreadPoolExecutor.runWorker(ThreadPoolExecutor.java:1149) at java.util.concurrent.ThreadPoolExecutor$Worker.run(ThreadPoolExecutor.java:624) at java.lang.Thread.run(Thread.java:750) org.apache.solr.common.util.ObjectReleaseTracker$ObjectTrackerException: org.apache.lucene.store.MMapDirectory at org.apache.solr.common.util.ObjectReleaseTracker.track(ObjectReleaseTracker.java:42) at org.apache.solr.core.CachingDirectoryFactory.get(CachingDirectoryFactory.java:362) at org.apache.solr.update.SolrIndexWriter.create(SolrIndexWriter.java:98) at org.apache.solr.core.SolrCore.initIndex(SolrCore.java:813) at org.apache.solr.core.SolrCore.<init>(SolrCore.java:1003) at org.apache.solr.core.SolrCore.<init>(SolrCore.java:921) at org.apache.solr.core.CoreContainer.createFromDescriptor(CoreContainer.java:1463) at org.apache.solr.core.CoreContainer.create(CoreContainer.java:1344) at org.apache.solr.handler.admin.CoreAdminOperation.lambda$static$0(CoreAdminOperation.java:95) at org.apache.solr.handler.admin.CoreAdminOperation.execute(CoreAdminOperation.java:367) at org.apache.solr.handler.admin.CoreAdminHandler$CallInfo.call(CoreAdminHandler.java:397) at org.apache.solr.handler.admin.CoreAdminHandler.lambda$handleRequestBody$0(CoreAdminHandler.java:189) at com.codahale.metrics.InstrumentedExecutorService$InstrumentedRunnable.run(InstrumentedExecutorService.java:180) at org.apache.solr.common.util.ExecutorUtil$MDCAwareThreadPoolExecutor.lambda$execute$0(ExecutorUtil.java:218) at java.util.concurrent.ThreadPoolExecutor.runWorker(ThreadPoolExecutor.java:1149) at java.util.concurrent.ThreadPoolExecutor$Worker.run(ThreadPoolExecutor.java:624) at java.lang.Thread.run(Thread.java:750) >
Stack Trace:
java.lang.AssertionError: ObjectTracker found 5 object(s) that were not released!!! [InternalHttpClient, MMapDirectory, SolrCore, InternalHttpClient, MMapDirectory]
org.apache.solr.common.util.ObjectReleaseTracker$ObjectTrackerException: org.apache.http.impl.client.InternalHttpClient
at org.apache.solr.common.util.ObjectReleaseTracker.track(ObjectReleaseTracker.java:42)
at org.apache.solr.client.solrj.impl.HttpClientUtil.createClient(HttpClientUtil.java:341)
at org.apache.solr.client.solrj.impl.HttpClientUtil.createClient(HttpClientUtil.java:350)
at org.apache.solr.handler.IndexFetcher.createHttpClient(IndexFetcher.java:233)
at org.apache.solr.handler.IndexFetcher.<init>(IndexFetcher.java:275)
at org.apache.solr.handler.ReplicationHandler.inform(ReplicationHandler.java:1289)
at org.apache.solr.cloud.ReplicateFromLeader.startReplication(ReplicateFromLeader.java:134)
at org.apache.solr.cloud.ZkController.startReplicationFromLeader(ZkController.java:1404)
at org.apache.solr.cloud.RecoveryStrategy.doSyncOrReplicateRecovery(RecoveryStrategy.java:714)
at org.apache.solr.cloud.RecoveryStrategy.doRecovery(RecoveryStrategy.java:339)
at org.apache.solr.cloud.RecoveryStrategy.run(RecoveryStrategy.java:318)
at com.codahale.metrics.InstrumentedExecutorService$InstrumentedRunnable.run(InstrumentedExecutorService.java:180)
at java.util.concurrent.Executors$RunnableAdapter.call(Executors.java:511)
at java.util.concurrent.FutureTask.run(FutureTask.java:266)
at org.apache.solr.common.util.ExecutorUtil$MDCAwareThreadPoolExecutor.lambda$execute$0(ExecutorUtil.java:218)
at java.util.concurrent.ThreadPoolExecutor.runWorker(ThreadPoolExecutor.java:1149)
at java.util.concurrent.ThreadPoolExecutor$Worker.run(ThreadPoolExecutor.java:624)
at java.lang.Thread.run(Thread.java:750)
org.apache.solr.common.util.ObjectReleaseTracker$ObjectTrackerException: org.apache.lucene.store.MMapDirectory
at org.apache.solr.common.util.ObjectReleaseTracker.track(ObjectReleaseTracker.java:42)
at org.apache.solr.core.CachingDirectoryFactory.get(CachingDirectoryFactory.java:362)
at org.apache.solr.core.SolrCore.initSnapshotMetaDataManager(SolrCore.java:553)
at org.apache.solr.core.SolrCore.<init>(SolrCore.java:995)
at org.apache.solr.core.SolrCore.<init>(SolrCore.java:921)
at org.apache.solr.core.CoreContainer.createFromDescriptor(CoreContainer.java:1463)
at org.apache.solr.core.CoreContainer.create(CoreContainer.java:1344)
at org.apache.solr.handler.admin.CoreAdminOperation.lambda$static$0(CoreAdminOperation.java:95)
at org.apache.solr.handler.admin.CoreAdminOperation.execute(CoreAdminOperation.java:367)
at org.apache.solr.handler.admin.CoreAdminHandler$CallInfo.call(CoreAdminHandler.java:397)
at org.apache.solr.handler.admin.CoreAdminHandler.lambda$handleRequestBody$0(CoreAdminHandler.java:189)
at com.codahale.metrics.InstrumentedExecutorService$InstrumentedRunnable.run(InstrumentedExecutorService.java:180)
at org.apache.solr.common.util.ExecutorUtil$MDCAwareThreadPoolExecutor.lambda$execute$0(ExecutorUtil.java:218)
at java.util.concurrent.ThreadPoolExecutor.runWorker(ThreadPoolExecutor.java:1149)
at java.util.concurrent.ThreadPoolExecutor$Worker.run(ThreadPoolExecutor.java:624)
at java.lang.Thread.run(Thread.java:750)
org.apache.solr.common.util.ObjectReleaseTracker$ObjectTrackerException: org.apache.solr.core.SolrCore
at org.apache.solr.common.util.ObjectReleaseTracker.track(ObjectReleaseTracker.java:42)
at org.apache.solr.core.SolrCore.<init>(SolrCore.java:1092)
at org.apache.solr.core.SolrCore.<init>(SolrCore.java:921)
at org.apache.solr.core.CoreContainer.createFromDescriptor(CoreContainer.java:1463)
at org.apache.solr.core.CoreContainer.create(CoreContainer.java:1344)
at org.apache.solr.handler.admin.CoreAdminOperation.lambda$static$0(CoreAdminOperation.java:95)
at org.apache.solr.handler.admin.CoreAdminOperation.execute(CoreAdminOperation.java:367)
at org.apache.solr.handler.admin.CoreAdminHandler$CallInfo.call(CoreAdminHandler.java:397)
at org.apache.solr.handler.admin.CoreAdminHandler.lambda$handleRequestBody$0(CoreAdminHandler.java:189)
at com.codahale.metrics.InstrumentedExecutorService$InstrumentedRunnable.run(InstrumentedExecutorService.java:180)
at org.apache.solr.common.util.ExecutorUtil$MDCAwareThreadPoolExecutor.lambda$execute$0(ExecutorUtil.java:218)
at java.util.concurrent.ThreadPoolExecutor.runWorker(ThreadPoolExecutor.java:1149)
at java.util.concurrent.ThreadPoolExecutor$Worker.run(ThreadPoolExecutor.java:624)
at java.lang.Thread.run(Thread.java:750)
org.apache.solr.common.util.ObjectReleaseTracker$ObjectTrackerException: org.apache.http.impl.client.InternalHttpClient
at org.apache.solr.common.util.ObjectReleaseTracker.track(ObjectReleaseTracker.java:42)
at org.apache.solr.client.solrj.impl.HttpClientUtil.createClient(HttpClientUtil.java:341)
at org.apache.solr.client.solrj.impl.HttpClientUtil.createClient(HttpClientUtil.java:350)
at org.apache.solr.handler.IndexFetcher.createHttpClient(IndexFetcher.java:233)
at org.apache.solr.handler.IndexFetcher.<init>(IndexFetcher.java:275)
at org.apache.solr.handler.ReplicationHandler.doFetch(ReplicationHandler.java:454)
at org.apache.solr.cloud.RecoveryStrategy.replicate(RecoveryStrategy.java:252)
at org.apache.solr.cloud.RecoveryStrategy.doSyncOrReplicateRecovery(RecoveryStrategy.java:683)
at org.apache.solr.cloud.RecoveryStrategy.doRecovery(RecoveryStrategy.java:339)
at org.apache.solr.cloud.RecoveryStrategy.run(RecoveryStrategy.java:318)
at com.codahale.metrics.InstrumentedExecutorService$InstrumentedRunnable.run(InstrumentedExecutorService.java:180)
at java.util.concurrent.Executors$RunnableAdapter.call(Executors.java:511)
at java.util.concurrent.FutureTask.run(FutureTask.java:266)
at org.apache.solr.common.util.ExecutorUtil$MDCAwareThreadPoolExecutor.lambda$execute$0(ExecutorUtil.java:218)
at java.util.concurrent.ThreadPoolExecutor.runWorker(ThreadPoolExecutor.java:1149)
at java.util.concurrent.ThreadPoolExecutor$Worker.run(ThreadPoolExecutor.java:624)
at java.lang.Thread.run(Thread.java:750)
org.apache.solr.common.util.ObjectReleaseTracker$ObjectTrackerException: org.apache.lucene.store.MMapDirectory
at org.apache.solr.common.util.ObjectReleaseTracker.track(ObjectReleaseTracker.java:42)
at org.apache.solr.core.CachingDirectoryFactory.get(CachingDirectoryFactory.java:362)
at org.apache.solr.update.SolrIndexWriter.create(SolrIndexWriter.java:98)
at org.apache.solr.core.SolrCore.initIndex(SolrCore.java:813)
at org.apache.solr.core.SolrCore.<init>(SolrCore.java:1003)
at org.apache.solr.core.SolrCore.<init>(SolrCore.java:921)
at org.apache.solr.core.CoreContainer.createFromDescriptor(CoreContainer.java:1463)
at org.apache.solr.core.CoreContainer.create(CoreContainer.java:1344)
at org.apache.solr.handler.admin.CoreAdminOperation.lambda$static$0(CoreAdminOperation.java:95)
at org.apache.solr.handler.admin.CoreAdminOperation.execute(CoreAdminOperation.java:367)
at org.apache.solr.handler.admin.CoreAdminHandler$CallInfo.call(CoreAdminHandler.java:397)
at org.apache.solr.handler.admin.CoreAdminHandler.lambda$handleRequestBody$0(CoreAdminHandler.java:189)
at com.codahale.metrics.InstrumentedExecutorService$InstrumentedRunnable.run(InstrumentedExecutorService.java:180)
at org.apache.solr.common.util.ExecutorUtil$MDCAwareThreadPoolExecutor.lambda$execute$0(ExecutorUtil.java:218)
at java.util.concurrent.ThreadPoolExecutor.runWorker(ThreadPoolExecutor.java:1149)
at java.util.concurrent.ThreadPoolExecutor$Worker.run(ThreadPoolExecutor.java:624)
at java.lang.Thread.run(Thread.java:750)
expected null, but was:<ObjectTracker found 5 object(s) that were not released!!! [InternalHttpClient, MMapDirectory, SolrCore, InternalHttpClient, MMapDirectory]
org.apache.solr.common.util.ObjectReleaseTracker$ObjectTrackerException: org.apache.http.impl.client.InternalHttpClient
at org.apache.solr.common.util.ObjectReleaseTracker.track(ObjectReleaseTracker.java:42)
at org.apache.solr.client.solrj.impl.HttpClientUtil.createClient(HttpClientUtil.java:341)
at org.apache.solr.client.solrj.impl.HttpClientUtil.createClient(HttpClientUtil.java:350)
at org.apache.solr.handler.IndexFetcher.createHttpClient(IndexFetcher.java:233)
at org.apache.solr.handler.IndexFetcher.<init>(IndexFetcher.java:275)
at org.apache.solr.handler.ReplicationHandler.inform(ReplicationHandler.java:1289)
at org.apache.solr.cloud.ReplicateFromLeader.startReplication(ReplicateFromLeader.java:134)
at org.apache.solr.cloud.ZkController.startReplicationFromLeader(ZkController.java:1404)
at org.apache.solr.cloud.RecoveryStrategy.doSyncOrReplicateRecovery(RecoveryStrategy.java:714)
at org.apache.solr.cloud.RecoveryStrategy.doRecovery(RecoveryStrategy.java:339)
at org.apache.solr.cloud.RecoveryStrategy.run(RecoveryStrategy.java:318)
at com.codahale.metrics.InstrumentedExecutorService$InstrumentedRunnable.run(InstrumentedExecutorService.java:180)
at java.util.concurrent.Executors$RunnableAdapter.call(Executors.java:511)
at java.util.concurrent.FutureTask.run(FutureTask.java:266)
at org.apache.solr.common.util.ExecutorUtil$MDCAwareThreadPoolExecutor.lambda$execute$0(ExecutorUtil.java:218)
at java.util.concurrent.ThreadPoolExecutor.runWorker(ThreadPoolExecutor.java:1149)
at java.util.concurrent.ThreadPoolExecutor$Worker.run(ThreadPoolExecutor.java:624)
at java.lang.Thread.run(Thread.java:750)
org.apache.solr.common.util.ObjectReleaseTracker$ObjectTrackerException: org.apache.lucene.store.MMapDirectory
at org.apache.solr.common.util.ObjectReleaseTracker.track(ObjectReleaseTracker.java:42)
at org.apache.solr.core.CachingDirectoryFactory.get(CachingDirectoryFactory.java:362)
at org.apache.solr.core.SolrCore.initSnapshotMetaDataManager(SolrCore.java:553)
at org.apache.solr.core.SolrCore.<init>(SolrCore.java:995)
at org.apache.solr.core.SolrCore.<init>(SolrCore.java:921)
at org.apache.solr.core.CoreContainer.createFromDescriptor(CoreContainer.java:1463)
at org.apache.solr.core.CoreContainer.create(CoreContainer.java:1344)
at org.apache.solr.handler.admin.CoreAdminOperation.lambda$static$0(CoreAdminOperation.java:95)
at org.apache.solr.handler.admin.CoreAdminOperation.execute(CoreAdminOperation.java:367)
at org.apache.solr.handler.admin.CoreAdminHandler$CallInfo.call(CoreAdminHandler.java:397)
at org.apache.solr.handler.admin.CoreAdminHandler.lambda$handleRequestBody$0(CoreAdminHandler.java:189)
at com.codahale.metrics.InstrumentedExecutorService$InstrumentedRunnable.run(InstrumentedExecutorService.java:180)
at org.apache.solr.common.util.ExecutorUtil$MDCAwareThreadPoolExecutor.lambda$execute$0(ExecutorUtil.java:218)
at java.util.concurrent.ThreadPoolExecutor.runWorker(ThreadPoolExecutor.java:1149)
at java.util.concurrent.ThreadPoolExecutor$Worker.run(ThreadPoolExecutor.java:624)
at java.lang.Thread.run(Thread.java:750)
org.apache.solr.common.util.ObjectReleaseTracker$ObjectTrackerException: org.apache.solr.core.SolrCore
at org.apache.solr.common.util.ObjectReleaseTracker.track(ObjectReleaseTracker.java:42)
at org.apache.solr.core.SolrCore.<init>(SolrCore.java:1092)
at org.apache.solr.core.SolrCore.<init>(SolrCore.java:921)
at org.apache.solr.core.CoreContainer.createFromDescriptor(CoreContainer.java:1463)
at org.apache.solr.core.CoreContainer.create(CoreContainer.java:1344)
at org.apache.solr.handler.admin.CoreAdminOperation.lambda$static$0(CoreAdminOperation.java:95)
at org.apache.solr.handler.admin.CoreAdminOperation.execute(CoreAdminOperation.java:367)
at org.apache.solr.handler.admin.CoreAdminHandler$CallInfo.call(CoreAdminHandler.java:397)
at org.apache.solr.handler.admin.CoreAdminHandler.lambda$handleRequestBody$0(CoreAdminHandler.java:189)
at com.codahale.metrics.InstrumentedExecutorService$InstrumentedRunnable.run(InstrumentedExecutorService.java:180)
at org.apache.solr.common.util.ExecutorUtil$MDCAwareThreadPoolExecutor.lambda$execute$0(ExecutorUtil.java:218)
at java.util.concurrent.ThreadPoolExecutor.runWorker(ThreadPoolExecutor.java:1149)
at java.util.concurrent.ThreadPoolExecutor$Worker.run(ThreadPoolExecutor.java:624)
at java.lang.Thread.run(Thread.java:750)
org.apache.solr.common.util.ObjectReleaseTracker$ObjectTrackerException: org.apache.http.impl.client.InternalHttpClient
at org.apache.solr.common.util.ObjectReleaseTracker.track(ObjectReleaseTracker.java:42)
at org.apache.solr.client.solrj.impl.HttpClientUtil.createClient(HttpClientUtil.java:341)
at org.apache.solr.client.solrj.impl.HttpClientUtil.createClient(HttpClientUtil.java:350)
at org.apache.solr.handler.IndexFetcher.createHttpClient(IndexFetcher.java:233)
at org.apache.solr.handler.IndexFetcher.<init>(IndexFetcher.java:275)
at org.apache.solr.handler.ReplicationHandler.doFetch(ReplicationHandler.java:454)
at org.apache.solr.cloud.RecoveryStrategy.replicate(RecoveryStrategy.java:252)
at org.apache.solr.cloud.RecoveryStrategy.doSyncOrReplicateRecovery(RecoveryStrategy.java:683)
at org.apache.solr.cloud.RecoveryStrategy.doRecovery(RecoveryStrategy.java:339)
at org.apache.solr.cloud.RecoveryStrategy.run(RecoveryStrategy.java:318)
at com.codahale.metrics.InstrumentedExecutorService$InstrumentedRunnable.run(InstrumentedExecutorService.java:180)
at java.util.concurrent.Executors$RunnableAdapter.call(Executors.java:511)
at java.util.concurrent.FutureTask.run(FutureTask.java:266)
at org.apache.solr.common.util.ExecutorUtil$MDCAwareThreadPoolExecutor.lambda$execute$0(ExecutorUtil.java:218)
at java.util.concurrent.ThreadPoolExecutor.runWorker(ThreadPoolExecutor.java:1149)
at java.util.concurrent.ThreadPoolExecutor$Worker.run(ThreadPoolExecutor.java:624)
at java.lang.Thread.run(Thread.java:750)
org.apache.solr.common.util.ObjectReleaseTracker$ObjectTrackerException: org.apache.lucene.store.MMapDirectory
at org.apache.solr.common.util.ObjectReleaseTracker.track(ObjectReleaseTracker.java:42)
at org.apache.solr.core.CachingDirectoryFactory.get(CachingDirectoryFactory.java:362)
at org.apache.solr.update.SolrIndexWriter.create(SolrIndexWriter.java:98)
at org.apache.solr.core.SolrCore.initIndex(SolrCore.java:813)
at org.apache.solr.core.SolrCore.<init>(SolrCore.java:1003)
at org.apache.solr.core.SolrCore.<init>(SolrCore.java:921)
at org.apache.solr.core.CoreContainer.createFromDescriptor(CoreContainer.java:1463)
at org.apache.solr.core.CoreContainer.create(CoreContainer.java:1344)
at org.apache.solr.handler.admin.CoreAdminOperation.lambda$static$0(CoreAdminOperation.java:95)
at org.apache.solr.handler.admin.CoreAdminOperation.execute(CoreAdminOperation.java:367)
at org.apache.solr.handler.admin.CoreAdminHandler$CallInfo.call(CoreAdminHandler.java:397)
at org.apache.solr.handler.admin.CoreAdminHandler.lambda$handleRequestBody$0(CoreAdminHandler.java:189)
at com.codahale.metrics.InstrumentedExecutorService$InstrumentedRunnable.run(InstrumentedExecutorService.java:180)
at org.apache.solr.common.util.ExecutorUtil$MDCAwareThreadPoolExecutor.lambda$execute$0(ExecutorUtil.java:218)
at java.util.concurrent.ThreadPoolExecutor.runWorker(ThreadPoolExecutor.java:1149)
at java.util.concurrent.ThreadPoolExecutor$Worker.run(ThreadPoolExecutor.java:624)
at java.lang.Thread.run(Thread.java:750)
>
at __randomizedtesting.SeedInfo.seed([F57566BC236BEAB5]:0)
at org.junit.Assert.fail(Assert.java:89)
at org.junit.Assert.failNotNull(Assert.java:756)
at org.junit.Assert.assertNull(Assert.java:738)
at org.apache.solr.SolrTestCaseJ4.teardownTestCases(SolrTestCaseJ4.java:345)
at sun.reflect.NativeMethodAccessorImpl.invoke0(Native Method)
at sun.reflect.NativeMethodAccessorImpl.invoke(NativeMethodAccessorImpl.java:62)
at sun.reflect.DelegatingMethodAccessorImpl.invoke(DelegatingMethodAccessorImpl.java:43)
at java.lang.reflect.Method.invoke(Method.java:498)
at com.carrotsearch.randomizedtesting.RandomizedRunner.invoke(RandomizedRunner.java:1758)
at com.carrotsearch.randomizedtesting.RandomizedRunner$7.evaluate(RandomizedRunner.java:909)
at com.carrotsearch.randomizedtesting.rules.StatementAdapter.evaluate(StatementAdapter.java:36)
at com.carrotsearch.randomizedtesting.rules.SystemPropertiesRestoreRule$1.evaluate(SystemPropertiesRestoreRule.java:80)
at org.junit.rules.RunRules.evaluate(RunRules.java:20)
at org.apache.lucene.util.AbstractBeforeAfterRule$1.evaluate(AbstractBeforeAfterRule.java:45)
at com.carrotsearch.randomizedtesting.rules.StatementAdapter.evaluate(StatementAdapter.java:36)
at org.apache.lucene.util.TestRuleStoreClassName$1.evaluate(TestRuleStoreClassName.java:41)
at com.carrotsearch.randomizedtesting.rules.NoShadowingOrOverridesOnMethodsRule$1.evaluate(NoShadowingOrOverridesOnMethodsRule.java:40)
at com.carrotsearch.randomizedtesting.rules.NoShadowingOrOverridesOnMethodsRule$1.evaluate(NoShadowingOrOverridesOnMethodsRule.java:40)
at com.carrotsearch.randomizedtesting.rules.StatementAdapter.evaluate(StatementAdapter.java:36)
at com.carrotsearch.randomizedtesting.rules.StatementAdapter.evaluate(StatementAdapter.java:36)
at com.carrotsearch.randomizedtesting.rules.StatementAdapter.evaluate(StatementAdapter.java:36)
at org.apache.lucene.util.TestRuleAssertionsRequired$1.evaluate(TestRuleAssertionsRequired.java:53)
at org.apache.lucene.util.TestRuleMarkFailure$1.evaluate(TestRuleMarkFailure.java:47)
at org.apache.lucene.util.TestRuleIgnoreAfterMaxFailures$1.evaluate(TestRuleIgnoreAfterMaxFailures.java:64)
at org.apache.lucene.util.TestRuleIgnoreTestSuites$1.evaluate(TestRuleIgnoreTestSuites.java:54)
at org.junit.rules.RunRules.evaluate(RunRules.java:20)
at com.carrotsearch.randomizedtesting.rules.StatementAdapter.evaluate(StatementAdapter.java:36)
at com.carrotsearch.randomizedtesting.ThreadLeakControl$StatementRunner.run(ThreadLeakControl.java:390)
at com.carrotsearch.randomizedtesting.ThreadLeakControl.lambda$forkTimeoutingTask$0(ThreadLeakControl.java:850)
at java.lang.Thread.run(Thread.java:750)
Build Log:
[...truncated 13599 lines...]
[junit4] Suite: org.apache.solr.cloud.api.collections.TestHdfsCloudBackupRestore
[junit4] 2> 50930 INFO (SUITE-TestHdfsCloudBackupRestore-seed#[F57566BC236BEAB5]-worker) [ ] o.a.s.SolrTestCase Setting 'solr.default.confdir' system property to test-framework derived value of '/home/jenkins/jenkins-slave/workspace/Lucene/Lucene-Solr-Tests-8.11/solr/server/solr/configsets/_default/conf'
[junit4] 2> 50931 INFO (SUITE-TestHdfsCloudBackupRestore-seed#[F57566BC236BEAB5]-worker) [ ] o.a.s.u.ErrorLogMuter Closing ErrorLogMuter-regex-10 after mutting 0 log messages
[junit4] 2> 50931 INFO (SUITE-TestHdfsCloudBackupRestore-seed#[F57566BC236BEAB5]-worker) [ ] o.a.s.u.ErrorLogMuter Creating ErrorLogMuter-regex-11 for ERROR logs matching regex: ignore_exception
[junit4] 2> 50934 INFO (SUITE-TestHdfsCloudBackupRestore-seed#[F57566BC236BEAB5]-worker) [ ] o.a.s.SolrTestCaseJ4 Created dataDir: /home/jenkins/jenkins-slave/workspace/Lucene/Lucene-Solr-Tests-8.11/solr/build/solr-core/test/J0/temp/solr.cloud.api.collections.TestHdfsCloudBackupRestore_F57566BC236BEAB5-001/data-dir-5-001
[junit4] 2> 50934 WARN (SUITE-TestHdfsCloudBackupRestore-seed#[F57566BC236BEAB5]-worker) [ ] o.a.s.SolrTestCaseJ4 startTrackingSearchers: numOpens=1 numCloses=1
[junit4] 2> 50934 INFO (SUITE-TestHdfsCloudBackupRestore-seed#[F57566BC236BEAB5]-worker) [ ] o.a.s.SolrTestCaseJ4 Using PointFields (NUMERIC_POINTS_SYSPROP=true) w/NUMERIC_DOCVALUES_SYSPROP=true
[junit4] 2> 50938 INFO (SUITE-TestHdfsCloudBackupRestore-seed#[F57566BC236BEAB5]-worker) [ ] o.a.s.SolrTestCaseJ4 Randomized ssl (false) and clientAuth (true) via: @org.apache.solr.util.RandomizeSSL(reason=, ssl=NaN, value=NaN, clientAuth=NaN)
[junit4] 2> 50938 INFO (SUITE-TestHdfsCloudBackupRestore-seed#[F57566BC236BEAB5]-worker) [ ] o.a.s.SolrTestCaseJ4 SecureRandom sanity checks: test.solr.allowed.securerandom=null & java.security.egd=file:/dev/./urandom
[junit4] 2> 50938 INFO (SUITE-TestHdfsCloudBackupRestore-seed#[F57566BC236BEAB5]-worker) [ ] o.a.s.c.SolrCloudTestCase Using per-replica state
[junit4] 1> Formatting using clusterid: testClusterID
[junit4] 2> 53518 WARN (SUITE-TestHdfsCloudBackupRestore-seed#[F57566BC236BEAB5]-worker) [ ] o.a.h.s.a.s.AuthenticationFilter Unable to initialize FileSignerSecretProvider, falling back to use random secrets. Reason: access denied ("java.io.FilePermission" "/home/jenkins/hadoop-http-auth-signature-secret" "read")
[junit4] 2> 53529 WARN (SUITE-TestHdfsCloudBackupRestore-seed#[F57566BC236BEAB5]-worker) [ ] o.a.h.h.HttpRequestLog Jetty request log can only be enabled using Log4j
[junit4] 2> 53567 INFO (SUITE-TestHdfsCloudBackupRestore-seed#[F57566BC236BEAB5]-worker) [ ] o.e.j.s.Server jetty-9.4.53.v20231009; built: 2023-10-09T12:29:09.265Z; git: 27bde00a0b95a1d5bbee0eae7984f891d2d0f8c9; jvm 1.8.0_362-b09
[junit4] 2> 53570 INFO (SUITE-TestHdfsCloudBackupRestore-seed#[F57566BC236BEAB5]-worker) [ ] o.e.j.s.session DefaultSessionIdManager workerName=node0
[junit4] 2> 53571 INFO (SUITE-TestHdfsCloudBackupRestore-seed#[F57566BC236BEAB5]-worker) [ ] o.e.j.s.session No SessionScavenger set, using defaults
[junit4] 2> 53571 INFO (SUITE-TestHdfsCloudBackupRestore-seed#[F57566BC236BEAB5]-worker) [ ] o.e.j.s.session node0 Scavenging every 600000ms
[junit4] 2> 53574 INFO (SUITE-TestHdfsCloudBackupRestore-seed#[F57566BC236BEAB5]-worker) [ ] o.e.j.s.h.ContextHandler Started o.e.j.s.ServletContextHandler@26e05584{static,/static,jar:file:/home/jenkins/.ivy2/cache/org.apache.hadoop/hadoop-hdfs/tests/hadoop-hdfs-3.2.4-tests.jar!/webapps/static,AVAILABLE}
[junit4] 2> 53926 INFO (SUITE-TestHdfsCloudBackupRestore-seed#[F57566BC236BEAB5]-worker) [ ] o.e.j.s.h.ContextHandler Started o.e.j.w.WebAppContext@8555906{hdfs,/,file:///home/jenkins/jenkins-slave/workspace/Lucene/Lucene-Solr-Tests-8.11/solr/build/solr-core/test/J0/temp/jetty-localhost_localdomain-33273-hadoop-hdfs-3_2_4-tests_jar-_-any-1819515359105095733/webapp/,AVAILABLE}{jar:file:/home/jenkins/.ivy2/cache/org.apache.hadoop/hadoop-hdfs/tests/hadoop-hdfs-3.2.4-tests.jar!/webapps/hdfs}
[junit4] 2> 53927 INFO (SUITE-TestHdfsCloudBackupRestore-seed#[F57566BC236BEAB5]-worker) [ ] o.e.j.s.AbstractConnector Started ServerConnector@30a987f3{HTTP/1.1, (http/1.1)}{localhost.localdomain:33273}
[junit4] 2> 53927 INFO (SUITE-TestHdfsCloudBackupRestore-seed#[F57566BC236BEAB5]-worker) [ ] o.e.j.s.Server Started @53968ms
[junit4] 2> 56322 WARN (StorageLocationChecker thread 0) [ ] o.a.h.u.NativeCodeLoader Unable to load native-hadoop library for your platform... using builtin-java classes where applicable
[junit4] 2> 56512 WARN (Listener at localhost.localdomain/37727) [ ] o.a.h.s.a.s.AuthenticationFilter Unable to initialize FileSignerSecretProvider, falling back to use random secrets. Reason: access denied ("java.io.FilePermission" "/home/jenkins/hadoop-http-auth-signature-secret" "read")
[junit4] 2> 56512 WARN (Listener at localhost.localdomain/37727) [ ] o.a.h.h.HttpRequestLog Jetty request log can only be enabled using Log4j
[junit4] 2> 56518 INFO (Listener at localhost.localdomain/37727) [ ] o.e.j.s.Server jetty-9.4.53.v20231009; built: 2023-10-09T12:29:09.265Z; git: 27bde00a0b95a1d5bbee0eae7984f891d2d0f8c9; jvm 1.8.0_362-b09
[junit4] 2> 56520 INFO (Listener at localhost.localdomain/37727) [ ] o.e.j.s.session DefaultSessionIdManager workerName=node0
[junit4] 2> 56520 INFO (Listener at localhost.localdomain/37727) [ ] o.e.j.s.session No SessionScavenger set, using defaults
[junit4] 2> 56520 INFO (Listener at localhost.localdomain/37727) [ ] o.e.j.s.session node0 Scavenging every 660000ms
[junit4] 2> 56520 INFO (Listener at localhost.localdomain/37727) [ ] o.e.j.s.h.ContextHandler Started o.e.j.s.ServletContextHandler@7aea6c8e{static,/static,jar:file:/home/jenkins/.ivy2/cache/org.apache.hadoop/hadoop-hdfs/tests/hadoop-hdfs-3.2.4-tests.jar!/webapps/static,AVAILABLE}
[junit4] 2> 56748 INFO (Listener at localhost.localdomain/37727) [ ] o.e.j.s.h.ContextHandler Started o.e.j.w.WebAppContext@3a0fecfc{datanode,/,file:///home/jenkins/jenkins-slave/workspace/Lucene/Lucene-Solr-Tests-8.11/solr/build/solr-core/test/J0/temp/jetty-localhost-43745-hadoop-hdfs-3_2_4-tests_jar-_-any-1522603520265833791/webapp/,AVAILABLE}{jar:file:/home/jenkins/.ivy2/cache/org.apache.hadoop/hadoop-hdfs/tests/hadoop-hdfs-3.2.4-tests.jar!/webapps/datanode}
[junit4] 2> 56748 INFO (Listener at localhost.localdomain/37727) [ ] o.e.j.s.AbstractConnector Started ServerConnector@e3c8a9f{HTTP/1.1, (http/1.1)}{localhost:43745}
[junit4] 2> 56748 INFO (Listener at localhost.localdomain/37727) [ ] o.e.j.s.Server Started @56789ms
[junit4] 2> 59055 INFO (Block report processor) [ ] BlockStateChange BLOCK* processReport 0x75c7c8e71c4163dd: Processing first storage report for DS-9588d223-f4e5-4ad2-bf8d-0ad076b05f0e from datanode DatanodeRegistration(127.0.0.1:36847, datanodeUuid=3739b479-3371-4064-bfc4-6d4b0edb6576, infoPort=44345, infoSecurePort=0, ipcPort=39477, storageInfo=lv=-57;cid=testClusterID;nsid=1502112935;c=1706633131617)
[junit4] 2> 59058 INFO (Block report processor) [ ] BlockStateChange BLOCK* processReport 0x75c7c8e71c4163dd: from storage DS-9588d223-f4e5-4ad2-bf8d-0ad076b05f0e node DatanodeRegistration(127.0.0.1:36847, datanodeUuid=3739b479-3371-4064-bfc4-6d4b0edb6576, infoPort=44345, infoSecurePort=0, ipcPort=39477, storageInfo=lv=-57;cid=testClusterID;nsid=1502112935;c=1706633131617), blocks: 0, hasStaleStorage: true, processing time: 3 msecs, invalidatedBlocks: 0
[junit4] 2> 59058 INFO (Block report processor) [ ] BlockStateChange BLOCK* processReport 0x75c7c8e71c4163dd: Processing first storage report for DS-e753d180-872e-418b-865b-bfd53780bb89 from datanode DatanodeRegistration(127.0.0.1:36847, datanodeUuid=3739b479-3371-4064-bfc4-6d4b0edb6576, infoPort=44345, infoSecurePort=0, ipcPort=39477, storageInfo=lv=-57;cid=testClusterID;nsid=1502112935;c=1706633131617)
[junit4] 2> 59058 INFO (Block report processor) [ ] BlockStateChange BLOCK* processReport 0x75c7c8e71c4163dd: from storage DS-e753d180-872e-418b-865b-bfd53780bb89 node DatanodeRegistration(127.0.0.1:36847, datanodeUuid=3739b479-3371-4064-bfc4-6d4b0edb6576, infoPort=44345, infoSecurePort=0, ipcPort=39477, storageInfo=lv=-57;cid=testClusterID;nsid=1502112935;c=1706633131617), blocks: 0, hasStaleStorage: false, processing time: 0 msecs, invalidatedBlocks: 0
[junit4] 2> 59250 INFO (Listener at localhost.localdomain/39477) [ ] o.a.s.c.MiniSolrCloudCluster Starting cluster of 2 servers in /home/jenkins/jenkins-slave/workspace/Lucene/Lucene-Solr-Tests-8.11/solr/build/solr-core/test/J0/temp/solr.cloud.api.collections.TestHdfsCloudBackupRestore_F57566BC236BEAB5-001/tempDir-002
[junit4] 2> 59251 INFO (Listener at localhost.localdomain/39477) [ ] o.a.s.c.ZkTestServer STARTING ZK TEST SERVER
[junit4] 2> 59251 INFO (ZkTestServer Run Thread) [ ] o.a.s.c.ZkTestServer client port: 0.0.0.0/0.0.0.0:0
[junit4] 2> 59251 INFO (ZkTestServer Run Thread) [ ] o.a.s.c.ZkTestServer Starting server
[junit4] 2> 59252 WARN (ZkTestServer Run Thread) [ ] o.a.z.s.ServerCnxnFactory maxCnxns is not configured, using default value 0.
[junit4] 2> 59351 INFO (Listener at localhost.localdomain/39477) [ ] o.a.s.c.ZkTestServer start zk server on port: 41441
[junit4] 2> 59351 INFO (Listener at localhost.localdomain/39477) [ ] o.a.s.c.ZkTestServer waitForServerUp: 127.0.0.1:41441
[junit4] 2> 59351 INFO (Listener at localhost.localdomain/39477) [ ] o.a.s.c.ZkTestServer parse host and port list: 127.0.0.1:41441
[junit4] 2> 59351 INFO (Listener at localhost.localdomain/39477) [ ] o.a.s.c.ZkTestServer connecting to 127.0.0.1 41441
[junit4] 2> 59361 INFO (Listener at localhost.localdomain/39477) [ ] o.a.s.c.c.ConnectionManager Waiting for client to connect to ZooKeeper
[junit4] 2> 59366 INFO (zkConnectionManagerCallback-393-thread-1) [ ] o.a.s.c.c.ConnectionManager zkClient has connected
[junit4] 2> 59366 INFO (Listener at localhost.localdomain/39477) [ ] o.a.s.c.c.ConnectionManager Client is connected to ZooKeeper
[junit4] 2> 59385 INFO (Listener at localhost.localdomain/39477) [ ] o.a.s.c.c.ConnectionManager Waiting for client to connect to ZooKeeper
[junit4] 2> 59386 INFO (zkConnectionManagerCallback-395-thread-1) [ ] o.a.s.c.c.ConnectionManager zkClient has connected
[junit4] 2> 59386 INFO (Listener at localhost.localdomain/39477) [ ] o.a.s.c.c.ConnectionManager Client is connected to ZooKeeper
[junit4] 2> 59387 INFO (Listener at localhost.localdomain/39477) [ ] o.a.s.c.c.ConnectionManager Waiting for client to connect to ZooKeeper
[junit4] 2> 59389 INFO (zkConnectionManagerCallback-397-thread-1) [ ] o.a.s.c.c.ConnectionManager zkClient has connected
[junit4] 2> 59389 INFO (Listener at localhost.localdomain/39477) [ ] o.a.s.c.c.ConnectionManager Client is connected to ZooKeeper
[junit4] 2> 59391 WARN (Listener at localhost.localdomain/39477-SendThread(127.0.0.1:41441)) [ ] o.a.z.ClientCnxn An exception was thrown while closing send thread for session 0x1002e40fc1c0002.
[junit4] 2> => EndOfStreamException: Unable to read additional data from server sessionid 0x1002e40fc1c0002, likely server has closed socket
[junit4] 2> at org.apache.zookeeper.ClientCnxnSocketNIO.doIO(ClientCnxnSocketNIO.java:77)
[junit4] 2> org.apache.zookeeper.ClientCnxn$EndOfStreamException: Unable to read additional data from server sessionid 0x1002e40fc1c0002, likely server has closed socket
[junit4] 2> at org.apache.zookeeper.ClientCnxnSocketNIO.doIO(ClientCnxnSocketNIO.java:77) ~[zookeeper-3.6.2.jar:3.6.2]
[junit4] 2> at org.apache.zookeeper.ClientCnxnSocketNIO.doTransport(ClientCnxnSocketNIO.java:350) ~[zookeeper-3.6.2.jar:3.6.2]
[junit4] 2> at org.apache.zookeeper.ClientCnxn$SendThread.run(ClientCnxn.java:1275) [zookeeper-3.6.2.jar:3.6.2]
[junit4] 2> 59499 INFO (jetty-launcher-398-thread-1) [ ] o.a.s.c.s.e.JettySolrRunner Start Jetty (configured port=0, binding port=0)
[junit4] 2> 59499 INFO (jetty-launcher-398-thread-1) [ ] o.a.s.c.s.e.JettySolrRunner Trying to start Jetty on port 0 try number 2 ...
[junit4] 2> 59499 INFO (jetty-launcher-398-thread-1) [ ] o.e.j.s.Server jetty-9.4.53.v20231009; built: 2023-10-09T12:29:09.265Z; git: 27bde00a0b95a1d5bbee0eae7984f891d2d0f8c9; jvm 1.8.0_362-b09
[junit4] 2> 59508 INFO (jetty-launcher-398-thread-2) [ ] o.a.s.c.s.e.JettySolrRunner Start Jetty (configured port=0, binding port=0)
[junit4] 2> 59508 INFO (jetty-launcher-398-thread-2) [ ] o.a.s.c.s.e.JettySolrRunner Trying to start Jetty on port 0 try number 2 ...
[junit4] 2> 59508 INFO (jetty-launcher-398-thread-2) [ ] o.e.j.s.Server jetty-9.4.53.v20231009; built: 2023-10-09T12:29:09.265Z; git: 27bde00a0b95a1d5bbee0eae7984f891d2d0f8c9; jvm 1.8.0_362-b09
[junit4] 2> 59508 INFO (jetty-launcher-398-thread-1) [ ] o.e.j.s.session DefaultSessionIdManager workerName=node0
[junit4] 2> 59508 INFO (jetty-launcher-398-thread-1) [ ] o.e.j.s.session No SessionScavenger set, using defaults
[junit4] 2> 59508 INFO (jetty-launcher-398-thread-1) [ ] o.e.j.s.session node0 Scavenging every 660000ms
[junit4] 2> 59508 INFO (jetty-launcher-398-thread-1) [ ] o.e.j.s.h.ContextHandler Started o.e.j.s.ServletContextHandler@22322f4b{/solr,null,AVAILABLE}
[junit4] 2> 59518 INFO (jetty-launcher-398-thread-2) [ ] o.e.j.s.session DefaultSessionIdManager workerName=node0
[junit4] 2> 59518 INFO (jetty-launcher-398-thread-2) [ ] o.e.j.s.session No SessionScavenger set, using defaults
[junit4] 2> 59518 INFO (jetty-launcher-398-thread-1) [ ] o.e.j.s.AbstractConnector Started ServerConnector@69cd5747{HTTP/1.1, (http/1.1, h2c)}{127.0.0.1:43255}
[junit4] 2> 59518 INFO (jetty-launcher-398-thread-2) [ ] o.e.j.s.session node0 Scavenging every 660000ms
[junit4] 2> 59518 INFO (jetty-launcher-398-thread-1) [ ] o.e.j.s.Server Started @59559ms
[junit4] 2> 59518 INFO (jetty-launcher-398-thread-1) [ ] o.a.s.c.s.e.JettySolrRunner Jetty properties: {hostContext=/solr, zkHost=127.0.0.1:41441/solr, hostPort=43255}
[junit4] 2> 59518 ERROR (jetty-launcher-398-thread-1) [ ] o.a.s.u.StartupLoggingUtils Missing Java Option solr.log.dir. Logging may be missing or incomplete.
[junit4] 2> 59519 INFO (jetty-launcher-398-thread-1) [ ] o.a.s.s.SolrDispatchFilter Using logger factory org.apache.logging.slf4j.Log4jLoggerFactory
[junit4] 2> 59519 INFO (jetty-launcher-398-thread-2) [ ] o.e.j.s.h.ContextHandler Started o.e.j.s.ServletContextHandler@7eb8c058{/solr,null,AVAILABLE}
[junit4] 2> 59520 INFO (jetty-launcher-398-thread-1) [ ] o.a.s.s.SolrDispatchFilter ___ _ Welcome to Apache Solr? version 8.11.3
[junit4] 2> 59520 INFO (jetty-launcher-398-thread-1) [ ] o.a.s.s.SolrDispatchFilter / __| ___| |_ _ Starting in cloud mode on port null
[junit4] 2> 59520 INFO (jetty-launcher-398-thread-1) [ ] o.a.s.s.SolrDispatchFilter \__ \/ _ \ | '_| Install dir: /home/jenkins/jenkins-slave/workspace/Lucene/Lucene-Solr-Tests-8.11/solr
[junit4] 2> 59520 INFO (jetty-launcher-398-thread-1) [ ] o.a.s.s.SolrDispatchFilter |___/\___/_|_| Start time: 2024-01-30T16:45:38.630Z
[junit4] 2> 59531 INFO (jetty-launcher-398-thread-1) [ ] o.a.s.c.c.ConnectionManager Waiting for client to connect to ZooKeeper
[junit4] 2> 59531 INFO (jetty-launcher-398-thread-2) [ ] o.e.j.s.AbstractConnector Started ServerConnector@d0028f7{HTTP/1.1, (http/1.1, h2c)}{127.0.0.1:46345}
[junit4] 2> 59532 INFO (jetty-launcher-398-thread-2) [ ] o.e.j.s.Server Started @59573ms
[junit4] 2> 59532 INFO (jetty-launcher-398-thread-2) [ ] o.a.s.c.s.e.JettySolrRunner Jetty properties: {hostContext=/solr, zkHost=127.0.0.1:41441/solr, hostPort=46345}
[junit4] 2> 59532 ERROR (jetty-launcher-398-thread-2) [ ] o.a.s.u.StartupLoggingUtils Missing Java Option solr.log.dir. Logging may be missing or incomplete.
[junit4] 2> 59532 INFO (jetty-launcher-398-thread-2) [ ] o.a.s.s.SolrDispatchFilter Using logger factory org.apache.logging.slf4j.Log4jLoggerFactory
[junit4] 2> 59532 INFO (jetty-launcher-398-thread-2) [ ] o.a.s.s.SolrDispatchFilter ___ _ Welcome to Apache Solr? version 8.11.3
[junit4] 2> 59532 INFO (jetty-launcher-398-thread-2) [ ] o.a.s.s.SolrDispatchFilter / __| ___| |_ _ Starting in cloud mode on port null
[junit4] 2> 59532 INFO (jetty-launcher-398-thread-2) [ ] o.a.s.s.SolrDispatchFilter \__ \/ _ \ | '_| Install dir: /home/jenkins/jenkins-slave/workspace/Lucene/Lucene-Solr-Tests-8.11/solr
[junit4] 2> 59532 INFO (jetty-launcher-398-thread-2) [ ] o.a.s.s.SolrDispatchFilter |___/\___/_|_| Start time: 2024-01-30T16:45:38.642Z
[junit4] 2> 59537 INFO (jetty-launcher-398-thread-2) [ ] o.a.s.c.c.ConnectionManager Waiting for client to connect to ZooKeeper
[junit4] 2> 59537 INFO (zkConnectionManagerCallback-400-thread-1) [ ] o.a.s.c.c.ConnectionManager zkClient has connected
[junit4] 2> 59537 INFO (jetty-launcher-398-thread-1) [ ] o.a.s.c.c.ConnectionManager Client is connected to ZooKeeper
[junit4] 2> 59538 INFO (jetty-launcher-398-thread-1) [ ] o.a.s.s.SolrDispatchFilter solr.xml found in ZooKeeper. Loading...
[junit4] 2> 59538 INFO (zkConnectionManagerCallback-402-thread-1) [ ] o.a.s.c.c.ConnectionManager zkClient has connected
[junit4] 2> 59538 INFO (jetty-launcher-398-thread-2) [ ] o.a.s.c.c.ConnectionManager Client is connected to ZooKeeper
[junit4] 2> 59538 INFO (jetty-launcher-398-thread-2) [ ] o.a.s.s.SolrDispatchFilter solr.xml found in ZooKeeper. Loading...
[junit4] 2> 59546 INFO (jetty-launcher-398-thread-1) [ ] o.a.s.c.SolrXmlConfig MBean server found: com.sun.jmx.mbeanserver.JmxMBeanServer@29853e21, but no JMX reporters were configured - adding default JMX reporter.
[junit4] 2> 59548 INFO (jetty-launcher-398-thread-2) [ ] o.a.s.c.SolrXmlConfig MBean server found: com.sun.jmx.mbeanserver.JmxMBeanServer@29853e21, but no JMX reporters were configured - adding default JMX reporter.
[junit4] 2> 59549 WARN (jetty-launcher-398-thread-1-SendThread(127.0.0.1:41441)) [ ] o.a.z.ClientCnxn An exception was thrown while closing send thread for session 0x1002e40fc1c0003.
[junit4] 2> => EndOfStreamException: Unable to read additional data from server sessionid 0x1002e40fc1c0003, likely server has closed socket
[junit4] 2> at org.apache.zookeeper.ClientCnxnSocketNIO.doIO(ClientCnxnSocketNIO.java:77)
[junit4] 2> org.apache.zookeeper.ClientCnxn$EndOfStreamException: Unable to read additional data from server sessionid 0x1002e40fc1c0003, likely server has closed socket
[junit4] 2> at org.apache.zookeeper.ClientCnxnSocketNIO.doIO(ClientCnxnSocketNIO.java:77) ~[zookeeper-3.6.2.jar:3.6.2]
[junit4] 2> at org.apache.zookeeper.ClientCnxnSocketNIO.doTransport(ClientCnxnSocketNIO.java:350) ~[zookeeper-3.6.2.jar:3.6.2]
[junit4] 2> at org.apache.zookeeper.ClientCnxn$SendThread.run(ClientCnxn.java:1275) [zookeeper-3.6.2.jar:3.6.2]
[junit4] 2> 59549 WARN (jetty-launcher-398-thread-2-SendThread(127.0.0.1:41441)) [ ] o.a.z.ClientCnxn An exception was thrown while closing send thread for session 0x1002e40fc1c0004.
[junit4] 2> => EndOfStreamException: Unable to read additional data from server sessionid 0x1002e40fc1c0004, likely server has closed socket
[junit4] 2> at org.apache.zookeeper.ClientCnxnSocketNIO.doIO(ClientCnxnSocketNIO.java:77)
[junit4] 2> org.apache.zookeeper.ClientCnxn$EndOfStreamException: Unable to read additional data from server sessionid 0x1002e40fc1c0004, likely server has closed socket
[junit4] 2> at org.apache.zookeeper.ClientCnxnSocketNIO.doIO(ClientCnxnSocketNIO.java:77) ~[zookeeper-3.6.2.jar:3.6.2]
[junit4] 2> at org.apache.zookeeper.ClientCnxnSocketNIO.doTransport(ClientCnxnSocketNIO.java:350) ~[zookeeper-3.6.2.jar:3.6.2]
[junit4] 2> at org.apache.zookeeper.ClientCnxn$SendThread.run(ClientCnxn.java:1275) [zookeeper-3.6.2.jar:3.6.2]
[junit4] 2> 60810 INFO (jetty-launcher-398-thread-2) [ ] o.a.s.h.c.HttpShardHandlerFactory Host whitelist initialized: WhitelistHostChecker [whitelistHosts=null, whitelistHostCheckingEnabled=true]
[junit4] 2> 60820 WARN (jetty-launcher-398-thread-2) [ ] o.e.j.u.s.S.config Trusting all certificates configured for Client@26b7adbd[provider=null,keyStore=null,trustStore=null]
[junit4] 2> 60820 WARN (jetty-launcher-398-thread-2) [ ] o.e.j.u.s.S.config No Client EndPointIdentificationAlgorithm configured for Client@26b7adbd[provider=null,keyStore=null,trustStore=null]
[junit4] 2> 60873 WARN (jetty-launcher-398-thread-2) [ ] o.e.j.u.s.S.config Trusting all certificates configured for Client@57f0eeb3[provider=null,keyStore=null,trustStore=null]
[junit4] 2> 60873 WARN (jetty-launcher-398-thread-2) [ ] o.e.j.u.s.S.config No Client EndPointIdentificationAlgorithm configured for Client@57f0eeb3[provider=null,keyStore=null,trustStore=null]
[junit4] 2> 60874 INFO (jetty-launcher-398-thread-2) [ ] o.a.s.c.ZkContainer Zookeeper client=127.0.0.1:41441/solr
[junit4] 2> 60875 INFO (jetty-launcher-398-thread-2) [ ] o.a.s.c.c.ConnectionManager Waiting for client to connect to ZooKeeper
[junit4] 2> 60876 INFO (zkConnectionManagerCallback-416-thread-1) [ ] o.a.s.c.c.ConnectionManager zkClient has connected
[junit4] 2> 60876 INFO (jetty-launcher-398-thread-2) [ ] o.a.s.c.c.ConnectionManager Client is connected to ZooKeeper
[junit4] 2> 60880 WARN (jetty-launcher-398-thread-2-SendThread(127.0.0.1:41441)) [ ] o.a.z.ClientCnxn An exception was thrown while closing send thread for session 0x1002e40fc1c0005.
[junit4] 2> => EndOfStreamException: Unable to read additional data from server sessionid 0x1002e40fc1c0005, likely server has closed socket
[junit4] 2> at org.apache.zookeeper.ClientCnxnSocketNIO.doIO(ClientCnxnSocketNIO.java:77)
[junit4] 2> org.apache.zookeeper.ClientCnxn$EndOfStreamException: Unable to read additional data from server sessionid 0x1002e40fc1c0005, likely server has closed socket
[junit4] 2> at org.apache.zookeeper.ClientCnxnSocketNIO.doIO(ClientCnxnSocketNIO.java:77) ~[zookeeper-3.6.2.jar:3.6.2]
[junit4] 2> at org.apache.zookeeper.ClientCnxnSocketNIO.doTransport(ClientCnxnSocketNIO.java:350) ~[zookeeper-3.6.2.jar:3.6.2]
[junit4] 2> at org.apache.zookeeper.ClientCnxn$SendThread.run(ClientCnxn.java:1275) [zookeeper-3.6.2.jar:3.6.2]
[junit4] 2> 61011 INFO (jetty-launcher-398-thread-2) [n:127.0.0.1:46345_solr ] o.a.s.c.c.ConnectionManager Waiting for client to connect to ZooKeeper
[junit4] 2> 61020 INFO (zkConnectionManagerCallback-418-thread-1) [ ] o.a.s.c.c.ConnectionManager zkClient has connected
[junit4] 2> 61020 INFO (jetty-launcher-398-thread-2) [n:127.0.0.1:46345_solr ] o.a.s.c.c.ConnectionManager Client is connected to ZooKeeper
[junit4] 2> 61086 WARN (jetty-launcher-398-thread-2) [n:127.0.0.1:46345_solr ] o.a.s.c.ZkController Contents of zookeeper /security.json are world-readable; consider setting up ACLs as described in https://solr.apache.org/guide/zookeeper-access-control.html
[junit4] 2> 61091 INFO (jetty-launcher-398-thread-2) [n:127.0.0.1:46345_solr ] o.a.s.c.OverseerElectionContext I am going to be the leader 127.0.0.1:46345_solr
[junit4] 2> 61091 INFO (jetty-launcher-398-thread-2) [n:127.0.0.1:46345_solr ] o.a.s.c.Overseer Overseer (id=72108450680406022-127.0.0.1:46345_solr-n_0000000000) starting
[junit4] 2> 61105 INFO (OverseerStateUpdate-72108450680406022-127.0.0.1:46345_solr-n_0000000000) [n:127.0.0.1:46345_solr ] o.a.s.c.Overseer Starting to work on the main queue : 127.0.0.1:46345_solr
[junit4] 2> 61513 INFO (jetty-launcher-398-thread-2) [n:127.0.0.1:46345_solr ] o.a.s.c.ZkController Register node as live in ZooKeeper:/live_nodes/127.0.0.1:46345_solr
[junit4] 2> 61518 INFO (jetty-launcher-398-thread-2) [n:127.0.0.1:46345_solr ] o.a.s.c.ZkController non-data nodes now []
[junit4] 2> 61522 INFO (jetty-launcher-398-thread-2) [n:127.0.0.1:46345_solr ] o.a.s.p.PackageLoader /packages.json updated to version -1
[junit4] 2> 61522 WARN (jetty-launcher-398-thread-2) [n:127.0.0.1:46345_solr ] o.a.s.c.CoreContainer Not all security plugins configured! authentication=disabled authorization=disabled. Solr is only as secure as you make it. Consider configuring authentication/authorization before exposing Solr to users internal or external. See https://s.apache.org/solrsecurity for more info
[junit4] 2> 61522 INFO (jetty-launcher-398-thread-2) [n:127.0.0.1:46345_solr ] o.a.s.c.b.r.BackupRepositoryFactory Added backup repository with configuration params {type = repository,name = hdfs,class = org.apache.solr.core.backup.repository.HdfsBackupRepository,attributes = {name=hdfs, class=org.apache.solr.core.backup.repository.HdfsBackupRepository},args = {location=/backup,solr.hdfs.home=hdfs://localhost.localdomain:37727/solr,solr.hdfs.confdir=}}
[junit4] 2> 61522 INFO (jetty-launcher-398-thread-2) [n:127.0.0.1:46345_solr ] o.a.s.c.b.r.BackupRepositoryFactory Added backup repository with configuration params {type = repository,name = poisioned,class = org.apache.solr.cloud.api.collections.TestLocalFSCloudBackupRestore$PoinsionedRepository,attributes = {default=true, name=poisioned, class=org.apache.solr.cloud.api.collections.TestLocalFSCloudBackupRestore$PoinsionedRepository},}
[junit4] 2> 61522 INFO (jetty-launcher-398-thread-2) [n:127.0.0.1:46345_solr ] o.a.s.c.b.r.BackupRepositoryFactory Default configuration for backup repository is with configuration params {type = repository,name = poisioned,class = org.apache.solr.cloud.api.collections.TestLocalFSCloudBackupRestore$PoinsionedRepository,attributes = {default=true, name=poisioned, class=org.apache.solr.cloud.api.collections.TestLocalFSCloudBackupRestore$PoinsionedRepository},}
[junit4] 2> 61534 INFO (zkCallback-417-thread-1) [ ] o.a.s.c.c.ZkStateReader Updated live nodes from ZooKeeper... (0) -> (1)
[junit4] 2> 61572 INFO (jetty-launcher-398-thread-2) [n:127.0.0.1:46345_solr ] o.a.s.h.a.MetricsHistoryHandler No .system collection, keeping metrics history in memory.
[junit4] 2> 61596 INFO (jetty-launcher-398-thread-2) [n:127.0.0.1:46345_solr ] o.a.s.m.r.SolrJmxReporter JMX monitoring for 'solr.node' (registry 'solr.node') enabled at server: com.sun.jmx.mbeanserver.JmxMBeanServer@29853e21
[junit4] 2> 61644 INFO (jetty-launcher-398-thread-2) [n:127.0.0.1:46345_solr ] o.a.s.m.r.SolrJmxReporter JMX monitoring for 'solr.jvm' (registry 'solr.jvm') enabled at server: com.sun.jmx.mbeanserver.JmxMBeanServer@29853e21
[junit4] 2> 61645 INFO (jetty-launcher-398-thread-2) [n:127.0.0.1:46345_solr ] o.a.s.m.r.SolrJmxReporter JMX monitoring for 'solr.jetty' (registry 'solr.jetty') enabled at server: com.sun.jmx.mbeanserver.JmxMBeanServer@29853e21
[junit4] 2> 61646 INFO (jetty-launcher-398-thread-2) [n:127.0.0.1:46345_solr ] o.a.s.c.CorePropertiesLocator Found 0 core definitions underneath /home/jenkins/jenkins-slave/workspace/Lucene/Lucene-Solr-Tests-8.11/solr/build/solr-core/test/J0/temp/solr.cloud.api.collections.TestHdfsCloudBackupRestore_F57566BC236BEAB5-001/tempDir-002/node2
[junit4] 2> 61825 INFO (jetty-launcher-398-thread-1) [ ] o.a.s.h.c.HttpShardHandlerFactory Host whitelist initialized: WhitelistHostChecker [whitelistHosts=null, whitelistHostCheckingEnabled=true]
[junit4] 2> 61826 WARN (jetty-launcher-398-thread-1) [ ] o.e.j.u.s.S.config Trusting all certificates configured for Client@44a684f[provider=null,keyStore=null,trustStore=null]
[junit4] 2> 61826 WARN (jetty-launcher-398-thread-1) [ ] o.e.j.u.s.S.config No Client EndPointIdentificationAlgorithm configured for Client@44a684f[provider=null,keyStore=null,trustStore=null]
[junit4] 2> 61830 WARN (jetty-launcher-398-thread-1) [ ] o.e.j.u.s.S.config Trusting all certificates configured for Client@156b5694[provider=null,keyStore=null,trustStore=null]
[junit4] 2> 61830 WARN (jetty-launcher-398-thread-1) [ ] o.e.j.u.s.S.config No Client EndPointIdentificationAlgorithm configured for Client@156b5694[provider=null,keyStore=null,trustStore=null]
[junit4] 2> 61831 INFO (jetty-launcher-398-thread-1) [ ] o.a.s.c.ZkContainer Zookeeper client=127.0.0.1:41441/solr
[junit4] 2> 61832 INFO (jetty-launcher-398-thread-1) [ ] o.a.s.c.c.ConnectionManager Waiting for client to connect to ZooKeeper
[junit4] 2> 61834 INFO (zkConnectionManagerCallback-438-thread-1) [ ] o.a.s.c.c.ConnectionManager zkClient has connected
[junit4] 2> 61834 INFO (jetty-launcher-398-thread-1) [ ] o.a.s.c.c.ConnectionManager Client is connected to ZooKeeper
[junit4] 2> 61938 INFO (jetty-launcher-398-thread-1) [n:127.0.0.1:43255_solr ] o.a.s.c.c.ConnectionManager Waiting for client to connect to ZooKeeper
[junit4] 2> 61942 INFO (zkConnectionManagerCallback-440-thread-1) [ ] o.a.s.c.c.ConnectionManager zkClient has connected
[junit4] 2> 61942 INFO (jetty-launcher-398-thread-1) [n:127.0.0.1:43255_solr ] o.a.s.c.c.ConnectionManager Client is connected to ZooKeeper
[junit4] 2> 61949 WARN (jetty-launcher-398-thread-1) [n:127.0.0.1:43255_solr ] o.a.s.c.ZkController Contents of zookeeper /security.json are world-readable; consider setting up ACLs as described in https://solr.apache.org/guide/zookeeper-access-control.html
[junit4] 2> 61951 INFO (jetty-launcher-398-thread-1) [n:127.0.0.1:43255_solr ] o.a.s.c.c.ZkStateReader Updated live nodes from ZooKeeper... (0) -> (1)
[junit4] 2> 61954 INFO (jetty-launcher-398-thread-1) [n:127.0.0.1:43255_solr ] o.a.s.c.ZkController Publish node=127.0.0.1:43255_solr as DOWN
[junit4] 2> 61955 INFO (jetty-launcher-398-thread-1) [n:127.0.0.1:43255_solr ] o.a.s.c.TransientSolrCoreCacheDefault Allocating transient core cache for max 2147483647 cores with initial capacity of 1024
[junit4] 2> 61955 INFO (jetty-launcher-398-thread-1) [n:127.0.0.1:43255_solr ] o.a.s.c.ZkController Register node as live in ZooKeeper:/live_nodes/127.0.0.1:43255_solr
[junit4] 2> 61956 INFO (zkCallback-417-thread-1) [ ] o.a.s.c.c.ZkStateReader Updated live nodes from ZooKeeper... (1) -> (2)
[junit4] 2> 61956 INFO (zkCallback-439-thread-1) [ ] o.a.s.c.c.ZkStateReader Updated live nodes from ZooKeeper... (1) -> (2)
[junit4] 2> 61957 INFO (jetty-launcher-398-thread-1) [n:127.0.0.1:43255_solr ] o.a.s.c.ZkController non-data nodes now []
[junit4] 2> 61958 INFO (jetty-launcher-398-thread-1) [n:127.0.0.1:43255_solr ] o.a.s.p.PackageLoader /packages.json updated to version -1
[junit4] 2> 61959 WARN (jetty-launcher-398-thread-1) [n:127.0.0.1:43255_solr ] o.a.s.c.CoreContainer Not all security plugins configured! authentication=disabled authorization=disabled. Solr is only as secure as you make it. Consider configuring authentication/authorization before exposing Solr to users internal or external. See https://s.apache.org/solrsecurity for more info
[junit4] 2> 61959 INFO (jetty-launcher-398-thread-1) [n:127.0.0.1:43255_solr ] o.a.s.c.b.r.BackupRepositoryFactory Added backup repository with configuration params {type = repository,name = hdfs,class = org.apache.solr.core.backup.repository.HdfsBackupRepository,attributes = {name=hdfs, class=org.apache.solr.core.backup.repository.HdfsBackupRepository},args = {location=/backup,solr.hdfs.home=hdfs://localhost.localdomain:37727/solr,solr.hdfs.confdir=}}
[junit4] 2> 61959 INFO (jetty-launcher-398-thread-1) [n:127.0.0.1:43255_solr ] o.a.s.c.b.r.BackupRepositoryFactory Added backup repository with configuration params {type = repository,name = poisioned,class = org.apache.solr.cloud.api.collections.TestLocalFSCloudBackupRestore$PoinsionedRepository,attributes = {default=true, name=poisioned, class=org.apache.solr.cloud.api.collections.TestLocalFSCloudBackupRestore$PoinsionedRepository},}
[junit4] 2> 61959 INFO (jetty-launcher-398-thread-1) [n:127.0.0.1:43255_solr ] o.a.s.c.b.r.BackupRepositoryFactory Default configuration for backup repository is with configuration params {type = repository,name = poisioned,class = org.apache.solr.cloud.api.collections.TestLocalFSCloudBackupRestore$PoinsionedRepository,attributes = {default=true, name=poisioned, class=org.apache.solr.cloud.api.collections.TestLocalFSCloudBackupRestore$PoinsionedRepository},}
[junit4] 2> 61989 INFO (jetty-launcher-398-thread-1) [n:127.0.0.1:43255_solr ] o.a.s.h.a.MetricsHistoryHandler No .system collection, keeping metrics history in memory.
[junit4] 2> 62010 INFO (jetty-launcher-398-thread-1) [n:127.0.0.1:43255_solr ] o.a.s.m.r.SolrJmxReporter JMX monitoring for 'solr.node' (registry 'solr.node') enabled at server: com.sun.jmx.mbeanserver.JmxMBeanServer@29853e21
[junit4] 2> 62021 INFO (jetty-launcher-398-thread-1) [n:127.0.0.1:43255_solr ] o.a.s.m.r.SolrJmxReporter JMX monitoring for 'solr.jvm' (registry 'solr.jvm') enabled at server: com.sun.jmx.mbeanserver.JmxMBeanServer@29853e21
[junit4] 2> 62021 INFO (jetty-launcher-398-thread-1) [n:127.0.0.1:43255_solr ] o.a.s.m.r.SolrJmxReporter JMX monitoring for 'solr.jetty' (registry 'solr.jetty') enabled at server: com.sun.jmx.mbeanserver.JmxMBeanServer@29853e21
[junit4] 2> 62022 INFO (jetty-launcher-398-thread-1) [n:127.0.0.1:43255_solr ] o.a.s.c.CorePropertiesLocator Found 0 core definitions underneath /home/jenkins/jenkins-slave/workspace/Lucene/Lucene-Solr-Tests-8.11/solr/build/solr-core/test/J0/temp/solr.cloud.api.collections.TestHdfsCloudBackupRestore_F57566BC236BEAB5-001/tempDir-002/node1
[junit4] 2> 62043 INFO (Listener at localhost.localdomain/39477) [ ] o.a.s.c.MiniSolrCloudCluster waitForAllNodes: numServers=2
[junit4] 2> 62044 INFO (Listener at localhost.localdomain/39477) [ ] o.a.s.c.c.ConnectionManager Waiting for client to connect to ZooKeeper
[junit4] 2> 62047 INFO (zkConnectionManagerCallback-453-thread-1) [ ] o.a.s.c.c.ConnectionManager zkClient has connected
[junit4] 2> 62047 INFO (Listener at localhost.localdomain/39477) [ ] o.a.s.c.c.ConnectionManager Client is connected to ZooKeeper
[junit4] 2> 62054 INFO (Listener at localhost.localdomain/39477) [ ] o.a.s.c.c.ZkStateReader Updated live nodes from ZooKeeper... (0) -> (2)
[junit4] 2> 62055 INFO (Listener at localhost.localdomain/39477) [ ] o.a.s.c.s.i.ZkClientClusterStateProvider Cluster at 127.0.0.1:41441/solr ready
[junit4] 2> 62116 INFO (TEST-TestHdfsCloudBackupRestore.testRestoreFailure-seed#[F57566BC236BEAB5]) [ ] o.a.s.SolrTestCaseJ4 ###Starting testRestoreFailure
[junit4] 2> 62129 INFO (qtp1728755158-802) [n:127.0.0.1:43255_solr ] o.a.s.s.HttpSolrCall HttpSolrCall.init(http://127.0.0.1:43255/solr/admin/collections?action=CREATE&name=hdfsbackuprestore_testfailure&collection.configName=conf1&numShards=2&nrtReplicas=1&pullReplicas=0&tlogReplicas=0&wt=javabin&version=2)
[junit4] 2> 62141 INFO (OverseerThreadFactory-425-thread-1-processing-n:127.0.0.1:46345_solr) [n:127.0.0.1:46345_solr ] o.a.s.c.a.c.CreateCollectionCmd Create collection hdfsbackuprestore_testfailure
[junit4] 2> 62252 INFO (OverseerStateUpdate-72108450680406022-127.0.0.1:46345_solr-n_0000000000) [n:127.0.0.1:46345_solr ] o.a.s.c.o.SliceMutator createReplica() {
[junit4] 2> "operation":"ADDREPLICA",
[junit4] 2> "collection":"hdfsbackuprestore_testfailure",
[junit4] 2> "shard":"shard1",
[junit4] 2> "core":"hdfsbackuprestore_testfailure_shard1_replica_n1",
[junit4] 2> "state":"down",
[junit4] 2> "node_name":"127.0.0.1:43255_solr",
[junit4] 2> "base_url":"http://127.0.0.1:43255/solr",
[junit4] 2> "type":"NRT",
[junit4] 2> "waitForFinalState":"false"}
[junit4] 2> 62254 INFO (OverseerStateUpdate-72108450680406022-127.0.0.1:46345_solr-n_0000000000) [n:127.0.0.1:46345_solr ] o.a.s.c.o.SliceMutator createReplica() {
[junit4] 2> "operation":"ADDREPLICA",
[junit4] 2> "collection":"hdfsbackuprestore_testfailure",
[junit4] 2> "shard":"shard2",
[junit4] 2> "core":"hdfsbackuprestore_testfailure_shard2_replica_n2",
[junit4] 2> "state":"down",
[junit4] 2> "node_name":"127.0.0.1:46345_solr",
[junit4] 2> "base_url":"http://127.0.0.1:46345/solr",
[junit4] 2> "type":"NRT",
[junit4] 2> "waitForFinalState":"false"}
[junit4] 2> 62458 INFO (qtp1728755158-804) [n:127.0.0.1:43255_solr ] o.a.s.s.HttpSolrCall HttpSolrCall.init(http://127.0.0.1:43255/solr/admin/cores?null)
[junit4] 2> 62458 INFO (qtp1728755158-804) [n:127.0.0.1:43255_solr x:hdfsbackuprestore_testfailure_shard1_replica_n1 ] o.a.s.h.a.CoreAdminOperation core create command qt=/admin/cores&coreNodeName=core_node3&collection.configName=conf1&newCollection=true&name=hdfsbackuprestore_testfailure_shard1_replica_n1&action=CREATE&numShards=2&collection=hdfsbackuprestore_testfailure&shard=shard1&wt=javabin&version=2&replicaType=NRT
[junit4] 2> 62459 INFO (qtp63428351-811) [n:127.0.0.1:46345_solr ] o.a.s.s.HttpSolrCall HttpSolrCall.init(http://127.0.0.1:46345/solr/admin/cores?null)
[junit4] 2> 62460 INFO (qtp63428351-811) [n:127.0.0.1:46345_solr x:hdfsbackuprestore_testfailure_shard2_replica_n2 ] o.a.s.h.a.CoreAdminOperation core create command qt=/admin/cores&coreNodeName=core_node4&collection.configName=conf1&newCollection=true&name=hdfsbackuprestore_testfailure_shard2_replica_n2&action=CREATE&numShards=2&collection=hdfsbackuprestore_testfailure&shard=shard2&wt=javabin&version=2&replicaType=NRT
[junit4] 2> 62460 INFO (qtp63428351-811) [n:127.0.0.1:46345_solr x:hdfsbackuprestore_testfailure_shard2_replica_n2 ] o.a.s.c.TransientSolrCoreCacheDefault Allocating transient core cache for max 2147483647 cores with initial capacity of 1024
[junit4] 2> 62472 INFO (qtp63428351-811) [n:127.0.0.1:46345_solr c:hdfsbackuprestore_testfailure s:shard2 r:core_node4 x:hdfsbackuprestore_testfailure_shard2_replica_n2 ] o.a.s.c.SolrConfig Using Lucene MatchVersion: 8.11.3
[junit4] 2> 62474 INFO (qtp1728755158-804) [n:127.0.0.1:43255_solr c:hdfsbackuprestore_testfailure s:shard1 r:core_node3 x:hdfsbackuprestore_testfailure_shard1_replica_n1 ] o.a.s.c.SolrConfig Using Lucene MatchVersion: 8.11.3
[junit4] 2> 62475 INFO (qtp63428351-811) [n:127.0.0.1:46345_solr c:hdfsbackuprestore_testfailure s:shard2 r:core_node4 x:hdfsbackuprestore_testfailure_shard2_replica_n2 ] o.a.s.s.IndexSchema Schema name=minimal
[junit4] 2> 62476 INFO (qtp63428351-811) [n:127.0.0.1:46345_solr c:hdfsbackuprestore_testfailure s:shard2 r:core_node4 x:hdfsbackuprestore_testfailure_shard2_replica_n2 ] o.a.s.s.IndexSchema Loaded schema minimal/1.1 with uniqueid field id
[junit4] 2> 62476 INFO (qtp63428351-811) [n:127.0.0.1:46345_solr c:hdfsbackuprestore_testfailure s:shard2 r:core_node4 x:hdfsbackuprestore_testfailure_shard2_replica_n2 ] o.a.s.c.CoreContainer Creating SolrCore 'hdfsbackuprestore_testfailure_shard2_replica_n2' using configuration from configset conf1, trusted=true
[junit4] 2> 62476 INFO (qtp1728755158-804) [n:127.0.0.1:43255_solr c:hdfsbackuprestore_testfailure s:shard1 r:core_node3 x:hdfsbackuprestore_testfailure_shard1_replica_n1 ] o.a.s.s.IndexSchema Schema name=minimal
[junit4] 2> 62476 INFO (qtp63428351-811) [n:127.0.0.1:46345_solr c:hdfsbackuprestore_testfailure s:shard2 r:core_node4 x:hdfsbackuprestore_testfailure_shard2_replica_n2 ] o.a.s.m.r.SolrJmxReporter JMX monitoring for 'solr.core.hdfsbackuprestore_testfailure.shard2.replica_n2' (registry 'solr.core.hdfsbackuprestore_testfailure.shard2.replica_n2') enabled at server: com.sun.jmx.mbeanserver.JmxMBeanServer@29853e21
[junit4] 2> 62476 INFO (qtp1728755158-804) [n:127.0.0.1:43255_solr c:hdfsbackuprestore_testfailure s:shard1 r:core_node3 x:hdfsbackuprestore_testfailure_shard1_replica_n1 ] o.a.s.s.IndexSchema Loaded schema minimal/1.1 with uniqueid field id
[junit4] 2> 62476 INFO (qtp1728755158-804) [n:127.0.0.1:43255_solr c:hdfsbackuprestore_testfailure s:shard1 r:core_node3 x:hdfsbackuprestore_testfailure_shard1_replica_n1 ] o.a.s.c.CoreContainer Creating SolrCore 'hdfsbackuprestore_testfailure_shard1_replica_n1' using configuration from configset conf1, trusted=true
[junit4] 2> 62477 INFO (qtp1728755158-804) [n:127.0.0.1:43255_solr c:hdfsbackuprestore_testfailure s:shard1 r:core_node3 x:hdfsbackuprestore_testfailure_shard1_replica_n1 ] o.a.s.m.r.SolrJmxReporter JMX monitoring for 'solr.core.hdfsbackuprestore_testfailure.shard1.replica_n1' (registry 'solr.core.hdfsbackuprestore_testfailure.shard1.replica_n1') enabled at server: com.sun.jmx.mbeanserver.JmxMBeanServer@29853e21
[junit4] 2> 62485 INFO (qtp63428351-811) [n:127.0.0.1:46345_solr c:hdfsbackuprestore_testfailure s:shard2 r:core_node4 x:hdfsbackuprestore_testfailure_shard2_replica_n2 ] o.a.s.c.SolrCore [[hdfsbackuprestore_testfailure_shard2_replica_n2] ] Opening new SolrCore at [/home/jenkins/jenkins-slave/workspace/Lucene/Lucene-Solr-Tests-8.11/solr/build/solr-core/test/J0/temp/solr.cloud.api.collections.TestHdfsCloudBackupRestore_F57566BC236BEAB5-001/tempDir-002/node2/hdfsbackuprestore_testfailure_shard2_replica_n2], dataDir=[/home/jenkins/jenkins-slave/workspace/Lucene/Lucene-Solr-Tests-8.11/solr/build/solr-core/test/J0/temp/solr.cloud.api.collections.TestHdfsCloudBackupRestore_F57566BC236BEAB5-001/tempDir-002/node2/hdfsbackuprestore_testfailure_shard2_replica_n2/data/]
[junit4] 2> 62485 INFO (qtp1728755158-804) [n:127.0.0.1:43255_solr c:hdfsbackuprestore_testfailure s:shard1 r:core_node3 x:hdfsbackuprestore_testfailure_shard1_replica_n1 ] o.a.s.c.SolrCore [[hdfsbackuprestore_testfailure_shard1_replica_n1] ] Opening new SolrCore at [/home/jenkins/jenkins-slave/workspace/Lucene/Lucene-Solr-Tests-8.11/solr/build/solr-core/test/J0/temp/solr.cloud.api.collections.TestHdfsCloudBackupRestore_F57566BC236BEAB5-001/tempDir-002/node1/hdfsbackuprestore_testfailure_shard1_replica_n1], dataDir=[/home/jenkins/jenkins-slave/workspace/Lucene/Lucene-Solr-Tests-8.11/solr/build/solr-core/test/J0/temp/solr.cloud.api.collections.TestHdfsCloudBackupRestore_F57566BC236BEAB5-001/tempDir-002/node1/hdfsbackuprestore_testfailure_shard1_replica_n1/data/]
[junit4] 2> 62581 INFO (qtp1728755158-804) [n:127.0.0.1:43255_solr c:hdfsbackuprestore_testfailure s:shard1 r:core_node3 x:hdfsbackuprestore_testfailure_shard1_replica_n1 ] o.a.s.u.UpdateHandler Using UpdateLog implementation: org.apache.solr.update.UpdateLog
[junit4] 2> 62581 INFO (qtp1728755158-804) [n:127.0.0.1:43255_solr c:hdfsbackuprestore_testfailure s:shard1 r:core_node3 x:hdfsbackuprestore_testfailure_shard1_replica_n1 ] o.a.s.u.UpdateLog Initializing UpdateLog: dataDir=null defaultSyncLevel=FLUSH numRecordsToKeep=100 maxNumLogsToKeep=10 numVersionBuckets=65536
[junit4] 2> 62582 INFO (qtp1728755158-804) [n:127.0.0.1:43255_solr c:hdfsbackuprestore_testfailure s:shard1 r:core_node3 x:hdfsbackuprestore_testfailure_shard1_replica_n1 ] o.a.s.u.CommitTracker Hard AutoCommit: disabled
[junit4] 2> 62582 INFO (qtp1728755158-804) [n:127.0.0.1:43255_solr c:hdfsbackuprestore_testfailure s:shard1 r:core_node3 x:hdfsbackuprestore_testfailure_shard1_replica_n1 ] o.a.s.u.CommitTracker Soft AutoCommit: disabled
[junit4] 2> 62585 INFO (qtp63428351-811) [n:127.0.0.1:46345_solr c:hdfsbackuprestore_testfailure s:shard2 r:core_node4 x:hdfsbackuprestore_testfailure_shard2_replica_n2 ] o.a.s.u.UpdateHandler Using UpdateLog implementation: org.apache.solr.update.UpdateLog
[junit4] 2> 62585 INFO (qtp63428351-811) [n:127.0.0.1:46345_solr c:hdfsbackuprestore_testfailure s:shard2 r:core_node4 x:hdfsbackuprestore_testfailure_shard2_replica_n2 ] o.a.s.u.UpdateLog Initializing UpdateLog: dataDir=null defaultSyncLevel=FLUSH numRecordsToKeep=100 maxNumLogsToKeep=10 numVersionBuckets=65536
[junit4] 2> 62586 INFO (qtp63428351-811) [n:127.0.0.1:46345_solr c:hdfsbackuprestore_testfailure s:shard2 r:core_node4 x:hdfsbackuprestore_testfailure_shard2_replica_n2 ] o.a.s.u.CommitTracker Hard AutoCommit: disabled
[junit4] 2> 62586 INFO (qtp63428351-811) [n:127.0.0.1:46345_solr c:hdfsbackuprestore_testfailure s:shard2 r:core_node4 x:hdfsbackuprestore_testfailure_shard2_replica_n2 ] o.a.s.u.CommitTracker Soft AutoCommit: disabled
[junit4] 2> 62587 INFO (qtp1728755158-804) [n:127.0.0.1:43255_solr c:hdfsbackuprestore_testfailure s:shard1 r:core_node3 x:hdfsbackuprestore_testfailure_shard1_replica_n1 ] o.a.s.r.ManagedResourceStorage Configured ZooKeeperStorageIO with znodeBase: /configs/conf1
[junit4] 2> 62587 INFO (qtp1728755158-804) [n:127.0.0.1:43255_solr c:hdfsbackuprestore_testfailure s:shard1 r:core_node3 x:hdfsbackuprestore_testfailure_shard1_replica_n1 ] o.a.s.r.ManagedResourceStorage Loaded null at path _rest_managed.json using ZooKeeperStorageIO:path=/configs/conf1
[junit4] 2> 62589 INFO (qtp1728755158-804) [n:127.0.0.1:43255_solr c:hdfsbackuprestore_testfailure s:shard1 r:core_node3 x:hdfsbackuprestore_testfailure_shard1_replica_n1 ] o.a.s.h.ReplicationHandler Commits will be reserved for 10000 ms
[junit4] 2> 62590 INFO (qtp1728755158-804) [n:127.0.0.1:43255_solr c:hdfsbackuprestore_testfailure s:shard1 r:core_node3 x:hdfsbackuprestore_testfailure_shard1_replica_n1 ] o.a.s.u.UpdateLog Could not find max version in index or recent updates, using new clock 1789534553191219200
[junit4] 2> 62591 INFO (qtp63428351-811) [n:127.0.0.1:46345_solr c:hdfsbackuprestore_testfailure s:shard2 r:core_node4 x:hdfsbackuprestore_testfailure_shard2_replica_n2 ] o.a.s.r.ManagedResourceStorage Configured ZooKeeperStorageIO with znodeBase: /configs/conf1
[junit4] 2> 62592 INFO (qtp63428351-811) [n:127.0.0.1:46345_solr c:hdfsbackuprestore_testfailure s:shard2 r:core_node4 x:hdfsbackuprestore_testfailure_shard2_replica_n2 ] o.a.s.r.ManagedResourceStorage Loaded null at path _rest_managed.json using ZooKeeperStorageIO:path=/configs/conf1
[junit4] 2> 62593 INFO (qtp63428351-811) [n:127.0.0.1:46345_solr c:hdfsbackuprestore_testfailure s:shard2 r:core_node4 x:hdfsbackuprestore_testfailure_shard2_replica_n2 ] o.a.s.h.ReplicationHandler Commits will be reserved for 10000 ms
[junit4] 2> 62593 INFO (qtp63428351-811) [n:127.0.0.1:46345_solr c:hdfsbackuprestore_testfailure s:shard2 r:core_node4 x:hdfsbackuprestore_testfailure_shard2_replica_n2 ] o.a.s.u.UpdateLog Could not find max version in index or recent updates, using new clock 1789534553194364928
[junit4] 2> 62594 INFO (searcherExecutor-457-thread-1-processing-n:127.0.0.1:43255_solr x:hdfsbackuprestore_testfailure_shard1_replica_n1 c:hdfsbackuprestore_testfailure s:shard1 r:core_node3) [n:127.0.0.1:43255_solr c:hdfsbackuprestore_testfailure s:shard1 r:core_node3 x:hdfsbackuprestore_testfailure_shard1_replica_n1 ] o.a.s.c.SolrCore [hdfsbackuprestore_testfailure_shard1_replica_n1] Registered new searcher autowarm time: 0 ms
[junit4] 2> 62597 INFO (searcherExecutor-455-thread-1-processing-n:127.0.0.1:46345_solr x:hdfsbackuprestore_testfailure_shard2_replica_n2 c:hdfsbackuprestore_testfailure s:shard2 r:core_node4) [n:127.0.0.1:46345_solr c:hdfsbackuprestore_testfailure s:shard2 r:core_node4 x:hdfsbackuprestore_testfailure_shard2_replica_n2 ] o.a.s.c.SolrCore [hdfsbackuprestore_testfailure_shard2_replica_n2] Registered new searcher autowarm time: 0 ms
[junit4] 2> 62598 INFO (qtp1728755158-804) [n:127.0.0.1:43255_solr c:hdfsbackuprestore_testfailure s:shard1 r:core_node3 x:hdfsbackuprestore_testfailure_shard1_replica_n1 ] o.a.s.c.ZkShardTerms Successful update of terms at /collections/hdfsbackuprestore_testfailure/terms/shard1 to Terms{values={core_node3=0}, version=0}
[junit4] 2> 62598 INFO (qtp1728755158-804) [n:127.0.0.1:43255_solr c:hdfsbackuprestore_testfailure s:shard1 r:core_node3 x:hdfsbackuprestore_testfailure_shard1_replica_n1 ] o.a.s.c.ShardLeaderElectionContextBase make sure parent is created /collections/hdfsbackuprestore_testfailure/leaders/shard1
[junit4] 2> 62601 INFO (qtp63428351-811) [n:127.0.0.1:46345_solr c:hdfsbackuprestore_testfailure s:shard2 r:core_node4 x:hdfsbackuprestore_testfailure_shard2_replica_n2 ] o.a.s.c.ZkShardTerms Successful update of terms at /collections/hdfsbackuprestore_testfailure/terms/shard2 to Terms{values={core_node4=0}, version=0}
[junit4] 2> 62601 INFO (qtp63428351-811) [n:127.0.0.1:46345_solr c:hdfsbackuprestore_testfailure s:shard2 r:core_node4 x:hdfsbackuprestore_testfailure_shard2_replica_n2 ] o.a.s.c.ShardLeaderElectionContextBase make sure parent is created /collections/hdfsbackuprestore_testfailure/leaders/shard2
[junit4] 2> 62603 INFO (qtp1728755158-804) [n:127.0.0.1:43255_solr c:hdfsbackuprestore_testfailure s:shard1 r:core_node3 x:hdfsbackuprestore_testfailure_shard1_replica_n1 ] o.a.s.c.ShardLeaderElectionContext Enough replicas found to continue.
[junit4] 2> 62603 INFO (qtp1728755158-804) [n:127.0.0.1:43255_solr c:hdfsbackuprestore_testfailure s:shard1 r:core_node3 x:hdfsbackuprestore_testfailure_shard1_replica_n1 ] o.a.s.c.ShardLeaderElectionContext I may be the new leader - try and sync
[junit4] 2> 62603 INFO (qtp1728755158-804) [n:127.0.0.1:43255_solr c:hdfsbackuprestore_testfailure s:shard1 r:core_node3 x:hdfsbackuprestore_testfailure_shard1_replica_n1 ] o.a.s.c.SyncStrategy Sync replicas to http://127.0.0.1:43255/solr/hdfsbackuprestore_testfailure_shard1_replica_n1/
[junit4] 2> 62603 INFO (qtp1728755158-804) [n:127.0.0.1:43255_solr c:hdfsbackuprestore_testfailure s:shard1 r:core_node3 x:hdfsbackuprestore_testfailure_shard1_replica_n1 ] o.a.s.c.SyncStrategy Sync Success - now sync replicas to me
[junit4] 2> 62603 INFO (qtp1728755158-804) [n:127.0.0.1:43255_solr c:hdfsbackuprestore_testfailure s:shard1 r:core_node3 x:hdfsbackuprestore_testfailure_shard1_replica_n1 ] o.a.s.c.SyncStrategy http://127.0.0.1:43255/solr/hdfsbackuprestore_testfailure_shard1_replica_n1/ has no replicas
[junit4] 2> 62604 INFO (qtp1728755158-804) [n:127.0.0.1:43255_solr c:hdfsbackuprestore_testfailure s:shard1 r:core_node3 x:hdfsbackuprestore_testfailure_shard1_replica_n1 ] o.a.s.c.ShardLeaderElectionContextBase Creating leader registration node /collections/hdfsbackuprestore_testfailure/leaders/shard1/leader after winning as /collections/hdfsbackuprestore_testfailure/leader_elect/shard1/election/72108450680406024-core_node3-n_0000000000
[junit4] 2> 62605 INFO (qtp63428351-811) [n:127.0.0.1:46345_solr c:hdfsbackuprestore_testfailure s:shard2 r:core_node4 x:hdfsbackuprestore_testfailure_shard2_replica_n2 ] o.a.s.c.ShardLeaderElectionContext Enough replicas found to continue.
[junit4] 2> 62605 INFO (qtp63428351-811) [n:127.0.0.1:46345_solr c:hdfsbackuprestore_testfailure s:shard2 r:core_node4 x:hdfsbackuprestore_testfailure_shard2_replica_n2 ] o.a.s.c.ShardLeaderElectionContext I may be the new leader - try and sync
[junit4] 2> 62605 INFO (qtp63428351-811) [n:127.0.0.1:46345_solr c:hdfsbackuprestore_testfailure s:shard2 r:core_node4 x:hdfsbackuprestore_testfailure_shard2_replica_n2 ] o.a.s.c.SyncStrategy Sync replicas to http://127.0.0.1:46345/solr/hdfsbackuprestore_testfailure_shard2_replica_n2/
[junit4] 2> 62606 INFO (qtp63428351-811) [n:127.0.0.1:46345_solr c:hdfsbackuprestore_testfailure s:shard2 r:core_node4 x:hdfsbackuprestore_testfailure_shard2_replica_n2 ] o.a.s.c.SyncStrategy Sync Success - now sync replicas to me
[junit4] 2> 62606 INFO (qtp63428351-811) [n:127.0.0.1:46345_solr c:hdfsbackuprestore_testfailure s:shard2 r:core_node4 x:hdfsbackuprestore_testfailure_shard2_replica_n2 ] o.a.s.c.SyncStrategy http://127.0.0.1:46345/solr/hdfsbackuprestore_testfailure_shard2_replica_n2/ has no replicas
[junit4] 2> 62606 INFO (qtp63428351-811) [n:127.0.0.1:46345_solr c:hdfsbackuprestore_testfailure s:shard2 r:core_node4 x:hdfsbackuprestore_testfailure_shard2_replica_n2 ] o.a.s.c.ShardLeaderElectionContextBase Creating leader registration node /collections/hdfsbackuprestore_testfailure/leaders/shard2/leader after winning as /collections/hdfsbackuprestore_testfailure/leader_elect/shard2/election/72108450680406022-core_node4-n_0000000000
[junit4] 2> 62608 INFO (qtp63428351-811) [n:127.0.0.1:46345_solr c:hdfsbackuprestore_testfailure s:shard2 r:core_node4 x:hdfsbackuprestore_testfailure_shard2_replica_n2 ] o.a.s.c.ShardLeaderElectionContext I am the new leader: http://127.0.0.1:46345/solr/hdfsbackuprestore_testfailure_shard2_replica_n2/ shard2
[junit4] 2> 62610 INFO (qtp1728755158-804) [n:127.0.0.1:43255_solr c:hdfsbackuprestore_testfailure s:shard1 r:core_node3 x:hdfsbackuprestore_testfailure_shard1_replica_n1 ] o.a.s.c.ShardLeaderElectionContext I am the new leader: http://127.0.0.1:43255/solr/hdfsbackuprestore_testfailure_shard1_replica_n1/ shard1
[junit4] 2> 62710 INFO (zkCallback-417-thread-1) [ ] o.a.s.c.c.ZkStateReader A cluster state change: [WatchedEvent state:SyncConnected type:NodeDataChanged path:/collections/hdfsbackuprestore_testfailure/state.json] for collection [hdfsbackuprestore_testfailure] has occurred - updating... (live nodes size: [2])
[junit4] 2> 62710 INFO (zkCallback-439-thread-1) [ ] o.a.s.c.c.ZkStateReader A cluster state change: [WatchedEvent state:SyncConnected type:NodeDataChanged path:/collections/hdfsbackuprestore_testfailure/state.json] for collection [hdfsbackuprestore_testfailure] has occurred - updating... (live nodes size: [2])
[junit4] 2> 62712 INFO (qtp63428351-811) [n:127.0.0.1:46345_solr c:hdfsbackuprestore_testfailure s:shard2 r:core_node4 x:hdfsbackuprestore_testfailure_shard2_replica_n2 ] o.a.s.c.ZkController I am the leader, no recovery necessary
[junit4] 2> 62712 INFO (qtp1728755158-804) [n:127.0.0.1:43255_solr c:hdfsbackuprestore_testfailure s:shard1 r:core_node3 x:hdfsbackuprestore_testfailure_shard1_replica_n1 ] o.a.s.c.ZkController I am the leader, no recovery necessary
[junit4] 2> 62922 INFO (qtp63428351-811) [n:127.0.0.1:46345_solr ] o.a.s.s.HttpSolrCall [admin] webapp=null path=/admin/cores params={qt=/admin/cores&coreNodeName=core_node4&collection.configName=conf1&newCollection=true&name=hdfsbackuprestore_testfailure_shard2_replica_n2&action=CREATE&numShards=2&collection=hdfsbackuprestore_testfailure&shard=shard2&wt=javabin&version=2&replicaType=NRT} status=0 QTime=462
[junit4] 2> 62922 INFO (qtp1728755158-804) [n:127.0.0.1:43255_solr ] o.a.s.s.HttpSolrCall [admin] webapp=null path=/admin/cores params={qt=/admin/cores&coreNodeName=core_node3&collection.configName=conf1&newCollection=true&name=hdfsbackuprestore_testfailure_shard1_replica_n1&action=CREATE&numShards=2&collection=hdfsbackuprestore_testfailure&shard=shard1&wt=javabin&version=2&replicaType=NRT} status=0 QTime=464
[junit4] 2> 62925 INFO (qtp1728755158-802) [n:127.0.0.1:43255_solr ] o.a.s.h.a.CollectionsHandler Wait for new collection to be active for at most 45 seconds. Check all shard replicas
[junit4] 2> 63017 INFO (zkCallback-439-thread-1) [ ] o.a.s.c.c.ZkStateReader A cluster state change: [WatchedEvent state:SyncConnected type:NodeDataChanged path:/collections/hdfsbackuprestore_testfailure/state.json] for collection [hdfsbackuprestore_testfailure] has occurred - updating... (live nodes size: [2])
[junit4] 2> 63017 INFO (zkCallback-417-thread-1) [ ] o.a.s.c.c.ZkStateReader A cluster state change: [WatchedEvent state:SyncConnected type:NodeDataChanged path:/collections/hdfsbackuprestore_testfailure/state.json] for collection [hdfsbackuprestore_testfailure] has occurred -
[...truncated too long message...]
[junit4] > at com.codahale.metrics.InstrumentedExecutorService$InstrumentedRunnable.run(InstrumentedExecutorService.java:180)
[junit4] > at org.apache.solr.common.util.ExecutorUtil$MDCAwareThreadPoolExecutor.lambda$execute$0(ExecutorUtil.java:218)
[junit4] > at java.util.concurrent.ThreadPoolExecutor.runWorker(ThreadPoolExecutor.java:1149)
[junit4] > at java.util.concurrent.ThreadPoolExecutor$Worker.run(ThreadPoolExecutor.java:624)
[junit4] > at java.lang.Thread.run(Thread.java:750)
[junit4] > expected null, but was:<ObjectTracker found 5 object(s) that were not released!!! [InternalHttpClient, MMapDirectory, SolrCore, InternalHttpClient, MMapDirectory]
[junit4] > org.apache.solr.common.util.ObjectReleaseTracker$ObjectTrackerException: org.apache.http.impl.client.InternalHttpClient
[junit4] > at org.apache.solr.common.util.ObjectReleaseTracker.track(ObjectReleaseTracker.java:42)
[junit4] > at org.apache.solr.client.solrj.impl.HttpClientUtil.createClient(HttpClientUtil.java:341)
[junit4] > at org.apache.solr.client.solrj.impl.HttpClientUtil.createClient(HttpClientUtil.java:350)
[junit4] > at org.apache.solr.handler.IndexFetcher.createHttpClient(IndexFetcher.java:233)
[junit4] > at org.apache.solr.handler.IndexFetcher.<init>(IndexFetcher.java:275)
[junit4] > at org.apache.solr.handler.ReplicationHandler.inform(ReplicationHandler.java:1289)
[junit4] > at org.apache.solr.cloud.ReplicateFromLeader.startReplication(ReplicateFromLeader.java:134)
[junit4] > at org.apache.solr.cloud.ZkController.startReplicationFromLeader(ZkController.java:1404)
[junit4] > at org.apache.solr.cloud.RecoveryStrategy.doSyncOrReplicateRecovery(RecoveryStrategy.java:714)
[junit4] > at org.apache.solr.cloud.RecoveryStrategy.doRecovery(RecoveryStrategy.java:339)
[junit4] > at org.apache.solr.cloud.RecoveryStrategy.run(RecoveryStrategy.java:318)
[junit4] > at com.codahale.metrics.InstrumentedExecutorService$InstrumentedRunnable.run(InstrumentedExecutorService.java:180)
[junit4] > at java.util.concurrent.Executors$RunnableAdapter.call(Executors.java:511)
[junit4] > at java.util.concurrent.FutureTask.run(FutureTask.java:266)
[junit4] > at org.apache.solr.common.util.ExecutorUtil$MDCAwareThreadPoolExecutor.lambda$execute$0(ExecutorUtil.java:218)
[junit4] > at java.util.concurrent.ThreadPoolExecutor.runWorker(ThreadPoolExecutor.java:1149)
[junit4] > at java.util.concurrent.ThreadPoolExecutor$Worker.run(ThreadPoolExecutor.java:624)
[junit4] > at java.lang.Thread.run(Thread.java:750)
[junit4] > org.apache.solr.common.util.ObjectReleaseTracker$ObjectTrackerException: org.apache.lucene.store.MMapDirectory
[junit4] > at org.apache.solr.common.util.ObjectReleaseTracker.track(ObjectReleaseTracker.java:42)
[junit4] > at org.apache.solr.core.CachingDirectoryFactory.get(CachingDirectoryFactory.java:362)
[junit4] > at org.apache.solr.core.SolrCore.initSnapshotMetaDataManager(SolrCore.java:553)
[junit4] > at org.apache.solr.core.SolrCore.<init>(SolrCore.java:995)
[junit4] > at org.apache.solr.core.SolrCore.<init>(SolrCore.java:921)
[junit4] > at org.apache.solr.core.CoreContainer.createFromDescriptor(CoreContainer.java:1463)
[junit4] > at org.apache.solr.core.CoreContainer.create(CoreContainer.java:1344)
[junit4] > at org.apache.solr.handler.admin.CoreAdminOperation.lambda$static$0(CoreAdminOperation.java:95)
[junit4] > at org.apache.solr.handler.admin.CoreAdminOperation.execute(CoreAdminOperation.java:367)
[junit4] > at org.apache.solr.handler.admin.CoreAdminHandler$CallInfo.call(CoreAdminHandler.java:397)
[junit4] > at org.apache.solr.handler.admin.CoreAdminHandler.lambda$handleRequestBody$0(CoreAdminHandler.java:189)
[junit4] > at com.codahale.metrics.InstrumentedExecutorService$InstrumentedRunnable.run(InstrumentedExecutorService.java:180)
[junit4] > at org.apache.solr.common.util.ExecutorUtil$MDCAwareThreadPoolExecutor.lambda$execute$0(ExecutorUtil.java:218)
[junit4] > at java.util.concurrent.ThreadPoolExecutor.runWorker(ThreadPoolExecutor.java:1149)
[junit4] > at java.util.concurrent.ThreadPoolExecutor$Worker.run(ThreadPoolExecutor.java:624)
[junit4] > at java.lang.Thread.run(Thread.java:750)
[junit4] > org.apache.solr.common.util.ObjectReleaseTracker$ObjectTrackerException: org.apache.solr.core.SolrCore
[junit4] > at org.apache.solr.common.util.ObjectReleaseTracker.track(ObjectReleaseTracker.java:42)
[junit4] > at org.apache.solr.core.SolrCore.<init>(SolrCore.java:1092)
[junit4] > at org.apache.solr.core.SolrCore.<init>(SolrCore.java:921)
[junit4] > at org.apache.solr.core.CoreContainer.createFromDescriptor(CoreContainer.java:1463)
[junit4] > at org.apache.solr.core.CoreContainer.create(CoreContainer.java:1344)
[junit4] > at org.apache.solr.handler.admin.CoreAdminOperation.lambda$static$0(CoreAdminOperation.java:95)
[junit4] > at org.apache.solr.handler.admin.CoreAdminOperation.execute(CoreAdminOperation.java:367)
[junit4] > at org.apache.solr.handler.admin.CoreAdminHandler$CallInfo.call(CoreAdminHandler.java:397)
[junit4] > at org.apache.solr.handler.admin.CoreAdminHandler.lambda$handleRequestBody$0(CoreAdminHandler.java:189)
[junit4] > at com.codahale.metrics.InstrumentedExecutorService$InstrumentedRunnable.run(InstrumentedExecutorService.java:180)
[junit4] > at org.apache.solr.common.util.ExecutorUtil$MDCAwareThreadPoolExecutor.lambda$execute$0(ExecutorUtil.java:218)
[junit4] > at java.util.concurrent.ThreadPoolExecutor.runWorker(ThreadPoolExecutor.java:1149)
[junit4] > at java.util.concurrent.ThreadPoolExecutor$Worker.run(ThreadPoolExecutor.java:624)
[junit4] > at java.lang.Thread.run(Thread.java:750)
[junit4] > org.apache.solr.common.util.ObjectReleaseTracker$ObjectTrackerException: org.apache.http.impl.client.InternalHttpClient
[junit4] > at org.apache.solr.common.util.ObjectReleaseTracker.track(ObjectReleaseTracker.java:42)
[junit4] > at org.apache.solr.client.solrj.impl.HttpClientUtil.createClient(HttpClientUtil.java:341)
[junit4] > at org.apache.solr.client.solrj.impl.HttpClientUtil.createClient(HttpClientUtil.java:350)
[junit4] > at org.apache.solr.handler.IndexFetcher.createHttpClient(IndexFetcher.java:233)
[junit4] > at org.apache.solr.handler.IndexFetcher.<init>(IndexFetcher.java:275)
[junit4] > at org.apache.solr.handler.ReplicationHandler.doFetch(ReplicationHandler.java:454)
[junit4] > at org.apache.solr.cloud.RecoveryStrategy.replicate(RecoveryStrategy.java:252)
[junit4] > at org.apache.solr.cloud.RecoveryStrategy.doSyncOrReplicateRecovery(RecoveryStrategy.java:683)
[junit4] > at org.apache.solr.cloud.RecoveryStrategy.doRecovery(RecoveryStrategy.java:339)
[junit4] > at org.apache.solr.cloud.RecoveryStrategy.run(RecoveryStrategy.java:318)
[junit4] > at com.codahale.metrics.InstrumentedExecutorService$InstrumentedRunnable.run(InstrumentedExecutorService.java:180)
[junit4] > at java.util.concurrent.Executors$RunnableAdapter.call(Executors.java:511)
[junit4] > at java.util.concurrent.FutureTask.run(FutureTask.java:266)
[junit4] > at org.apache.solr.common.util.ExecutorUtil$MDCAwareThreadPoolExecutor.lambda$execute$0(ExecutorUtil.java:218)
[junit4] > at java.util.concurrent.ThreadPoolExecutor.runWorker(ThreadPoolExecutor.java:1149)
[junit4] > at java.util.concurrent.ThreadPoolExecutor$Worker.run(ThreadPoolExecutor.java:624)
[junit4] > at java.lang.Thread.run(Thread.java:750)
[junit4] > org.apache.solr.common.util.ObjectReleaseTracker$ObjectTrackerException: org.apache.lucene.store.MMapDirectory
[junit4] > at org.apache.solr.common.util.ObjectReleaseTracker.track(ObjectReleaseTracker.java:42)
[junit4] > at org.apache.solr.core.CachingDirectoryFactory.get(CachingDirectoryFactory.java:362)
[junit4] > at org.apache.solr.update.SolrIndexWriter.create(SolrIndexWriter.java:98)
[junit4] > at org.apache.solr.core.SolrCore.initIndex(SolrCore.java:813)
[junit4] > at org.apache.solr.core.SolrCore.<init>(SolrCore.java:1003)
[junit4] > at org.apache.solr.core.SolrCore.<init>(SolrCore.java:921)
[junit4] > at org.apache.solr.core.CoreContainer.createFromDescriptor(CoreContainer.java:1463)
[junit4] > at org.apache.solr.core.CoreContainer.create(CoreContainer.java:1344)
[junit4] > at org.apache.solr.handler.admin.CoreAdminOperation.lambda$static$0(CoreAdminOperation.java:95)
[junit4] > at org.apache.solr.handler.admin.CoreAdminOperation.execute(CoreAdminOperation.java:367)
[junit4] > at org.apache.solr.handler.admin.CoreAdminHandler$CallInfo.call(CoreAdminHandler.java:397)
[junit4] > at org.apache.solr.handler.admin.CoreAdminHandler.lambda$handleRequestBody$0(CoreAdminHandler.java:189)
[junit4] > at com.codahale.metrics.InstrumentedExecutorService$InstrumentedRunnable.run(InstrumentedExecutorService.java:180)
[junit4] > at org.apache.solr.common.util.ExecutorUtil$MDCAwareThreadPoolExecutor.lambda$execute$0(ExecutorUtil.java:218)
[junit4] > at java.util.concurrent.ThreadPoolExecutor.runWorker(ThreadPoolExecutor.java:1149)
[junit4] > at java.util.concurrent.ThreadPoolExecutor$Worker.run(ThreadPoolExecutor.java:624)
[junit4] > at java.lang.Thread.run(Thread.java:750)
[junit4] > >
[junit4] > at __randomizedtesting.SeedInfo.seed([F57566BC236BEAB5]:0)
[junit4] > at org.apache.solr.SolrTestCaseJ4.teardownTestCases(SolrTestCaseJ4.java:345)
[junit4] > at java.lang.Thread.run(Thread.java:750)
[junit4] Completed [73/959 (1!)] on J0 in 131.47s, 2 tests, 1 failure <<< FAILURES!
[...truncated 57431 lines...]