You are viewing a plain text version of this content. The canonical link for it is here.
Posted to builds@beam.apache.org by Apache Jenkins Server <je...@builds.apache.org> on 2023/04/29 04:29:23 UTC
Build failed in Jenkins: beam_Publish_Beam_SDK_Snapshots #5268
See <https://ci-beam.apache.org/job/beam_Publish_Beam_SDK_Snapshots/5268/display/redirect>
Changes:
------------------------------------------
[...truncated 2.46 MB...]
#16 1.507 guppy3==3.1.2
#16 1.507 hdfs==2.7.0
#16 1.507 httplib2==0.21.0
#16 1.507 hypothesis==6.70.2
#16 1.507 idna==3.4
#16 1.507 importlib-metadata==6.1.0
#16 1.507 iniconfig==2.0.0
#16 1.507 joblib==1.2.0
#16 1.507 mmh3==3.1.0
#16 1.507 mock==5.0.1
#16 1.507 nltk==3.8.1
#16 1.507 nose==1.3.7
#16 1.507 numpy==1.21.6
#16 1.507 oauth2client==4.1.3
#16 1.507 objsize==0.6.1
#16 1.507 orjson==3.8.9
#16 1.507 overrides==6.5.0
#16 1.507 packaging==23.0
#16 1.507 pandas==1.3.5
#16 1.507 parameterized==0.8.1
#16 1.507 pip==23.1.2
#16 1.507 pluggy==1.0.0
#16 1.507 proto-plus==1.22.2
#16 1.507 protobuf==4.22.1
#16 1.507 psycopg2-binary==2.9.6
#16 1.507 pyarrow==11.0.0
#16 1.507 pyasn1==0.4.8
#16 1.507 pyasn1-modules==0.2.8
#16 1.507 pycparser==2.21
#16 1.507 pydot==1.4.2
#16 1.507 PyHamcrest==1.10.1
#16 1.507 pymongo==4.3.3
#16 1.507 PyMySQL==1.0.3
#16 1.507 pyparsing==3.0.9
#16 1.507 pytest==7.2.2
#16 1.507 pytest-timeout==2.1.0
#16 1.507 pytest-xdist==3.2.1
#16 1.507 python-dateutil==2.8.2
#16 1.507 python-snappy==0.6.1
#16 1.507 pytz==2023.3
#16 1.507 PyYAML==6.0
#16 1.507 regex==2022.10.31
#16 1.507 requests==2.28.2
#16 1.507 requests-mock==1.10.0
#16 1.507 rsa==4.9
#16 1.507 scikit-learn==1.0.2
#16 1.507 scipy==1.7.3
#16 1.507 setuptools==67.7.2
#16 1.507 six==1.16.0
#16 1.507 sortedcontainers==2.4.0
#16 1.507 soupsieve==2.4
#16 1.507 SQLAlchemy==1.4.47
#16 1.507 sqlparse==0.4.3
#16 1.507 tenacity==8.2.2
#16 1.507 testcontainers==3.7.1
#16 1.507 threadpoolctl==3.1.0
#16 1.507 tomli==2.0.1
#16 1.507 tqdm==4.65.0
#16 1.507 typing_extensions==4.5.0
#16 1.507 urllib3==1.26.15
#16 1.507 websocket-client==1.5.1
#16 1.507 wheel==0.40.0
#16 1.507 wrapt==1.15.0
#16 1.507 zipp==3.15.0
#16 1.507 zstandard==0.20.0
#16 DONE 2.1s
#17 [beam 13/16] COPY target/LICENSE /opt/apache/beam/
#17 DONE 0.1s
#18 [beam 14/16] COPY target/LICENSE.python /opt/apache/beam/
#18 DONE 0.1s
#19 [beam 15/16] COPY target/NOTICE /opt/apache/beam/
#19 DONE 0.1s
#20 [beam 16/16] COPY target/launcher/linux_amd64/boot /opt/apache/beam/
#20 DONE 0.2s
#21 [third_party_licenses 1/4] COPY target/license_scripts /tmp/license_scripts/
#21 DONE 0.1s
#22 [third_party_licenses 2/4] COPY target/go-licenses/* /opt/apache/beam/third_party_licenses/golang/
#22 DONE 0.1s
#23 [third_party_licenses 3/4] COPY target/license_scripts /tmp/license_scripts/
#23 DONE 0.1s
#24 [third_party_licenses 4/4] RUN if [ "true" = "true" ] ; then pip install 'pip-licenses<5' pyyaml tenacity && python /tmp/license_scripts/pull_licenses_py.py ; fi
#24 1.083 Collecting pip-licenses<5
#24 1.156 Downloading pip_licenses-3.5.5-py3-none-any.whl (17 kB)
#24 1.166 Requirement already satisfied: pyyaml in /usr/local/lib/python3.7/site-packages (6.0)
#24 1.166 Requirement already satisfied: tenacity in /usr/local/lib/python3.7/site-packages (8.2.2)
#24 1.209 Collecting PTable (from pip-licenses<5)
#24 1.227 Downloading PTable-0.9.2.tar.gz (31 kB)
#24 1.248 Preparing metadata (setup.py): started
#24 1.635 Preparing metadata (setup.py): finished with status 'done'
#24 1.656 Building wheels for collected packages: PTable
#24 1.657 Building wheel for PTable (setup.py): started
#24 2.253 Building wheel for PTable (setup.py): finished with status 'done'
#24 2.254 Created wheel for PTable: filename=PTable-0.9.2-py3-none-any.whl size=22908 sha256=d4f1c28cd93802653221d48d9a39ed974b1d1664042a8c72d010e50dd7d56e3d
#24 2.255 Stored in directory: /root/.cache/pip/wheels/33/df/2f/674985b3f8a2de3f96357d1eadef5110f74fa91b3785e52a54
#24 2.260 Successfully built PTable
#24 3.497 Installing collected packages: PTable, pip-licenses
#24 3.577 Successfully installed PTable-0.9.2 pip-licenses-3.5.5
#24 3.578 WARNING: Running pip as the 'root' user can result in broken permissions and conflicting behaviour with the system package manager. It is recommended to use a virtual environment instead: https://pip.pypa.io/warnings/venv
#24 9.534 INFO:root:Successfully pulled licenses for 109 dependencies
#24 9.534 Skip pulling license for bs4
#24 DONE 9.7s
#25 [stage-2 1/2] COPY --from=third_party_licenses /opt/apache/beam/third_party_licenses /opt/apache/beam/third_party_licenses
#25 DONE 0.4s
#26 [stage-2 2/2] RUN if [ "true" != "true" ] ; then rm -rf /opt/apache/beam/third_party_licenses ; fi
#26 DONE 0.9s
#27 exporting to image
#27 exporting layers
> Task :sdks:python:container:py310:docker
#24 15.24 INFO:root:Successfully pulled licenses for 131 dependencies
#24 15.24 Skip pulling license for bs4
#24 DONE 15.3s
#25 [stage-2 1/2] COPY --from=third_party_licenses /opt/apache/beam/third_party_licenses /opt/apache/beam/third_party_licenses
#25 DONE 0.4s
#26 [stage-2 2/2] RUN if [ "true" != "true" ] ; then rm -rf /opt/apache/beam/third_party_licenses ; fi
#26 DONE 1.6s
#27 exporting to image
#27 exporting layers
> Task :sdks:python:container:py37:docker
#27 exporting layers 20.6s done
#27 writing image sha256:d2961c729c33f678a1ddb6f7e09231bc7f77cdac0d21f2df9a26f2251aee305c done
#27 naming to gcr.io/apache-beam-testing/beam-sdk/beam_python3.7_sdk:2.48.0.dev done
#27 DONE 20.6s
> Task :sdks:python:container:py37:dockerTag2.48.0-SNAPSHOT
> Task :sdks:python:container:py38:docker
#27 exporting layers 26.2s done
#27 writing image sha256:a92e2af3e33c9aa8c9b66b18b3da04f7eca2977c3a3a6aa6b0f3abac050d0837 done
#27 naming to gcr.io/apache-beam-testing/beam-sdk/beam_python3.8_sdk:2.48.0.dev done
#27 DONE 26.2s
> Task :sdks:python:container:py38:dockerTag2.48.0-SNAPSHOT
> Task :sdks:python:container:py310:docker
#27 exporting layers 25.8s done
#27 writing image sha256:f3f41c5862a54f11ffa230e0500d4de0af0c3e6b685c61158a8385ad8be93ecd done
#27 naming to gcr.io/apache-beam-testing/beam-sdk/beam_python3.10_sdk:2.48.0.dev done
#27 DONE 25.8s
> Task :sdks:python:container:py310:dockerTag2.48.0-SNAPSHOT
> Task :sdks:python:container:py311:docker
#27 exporting layers 26.1s done
#27 writing image sha256:1d82ae8d1f87e78f41ad7b9f84465d78df67254827efc772eea6ad142dd61de7
#27 writing image sha256:1d82ae8d1f87e78f41ad7b9f84465d78df67254827efc772eea6ad142dd61de7 0.0s done
#27 naming to gcr.io/apache-beam-testing/beam-sdk/beam_python3.11_sdk:2.48.0.dev done
#27 DONE 26.1s
> Task :sdks:python:container:py311:dockerTag2.48.0-SNAPSHOT
> Task :sdks:python:container:py39:docker
#27 exporting layers 22.3s done
#27 writing image sha256:aff2a00bf323e7517a198c902ae3d0e70d1b6059b8727579e01fce156afce189 done
#27 naming to gcr.io/apache-beam-testing/beam-sdk/beam_python3.9_sdk:2.48.0.dev done
#27 DONE 22.3s
> Task :sdks:python:container:py39:dockerTag2.48.0-SNAPSHOT
> Task :sdks:python:container:py37:dockerPush2.48.0-SNAPSHOT
> Task :sdks:python:container:py38:dockerPush2.48.0-SNAPSHOT
> Task :sdks:python:container:py310:dockerPush2.48.0-SNAPSHOT
> Task :sdks:python:container:py311:dockerPush2.48.0-SNAPSHOT
> Task :sdks:python:container:py39:dockerPush2.48.0-SNAPSHOT
> Task :sdks:python:container:py37:dockerTag955a04eac5ff4e7d3c3c166df521d672fe5f59c0
> Task :sdks:python:container:py37:dockerPush955a04eac5ff4e7d3c3c166df521d672fe5f59c0
> Task :sdks:python:container:py38:dockerTag955a04eac5ff4e7d3c3c166df521d672fe5f59c0
> Task :sdks:python:container:py37:dockerTagLatest
> Task :sdks:python:container:py38:dockerPush955a04eac5ff4e7d3c3c166df521d672fe5f59c0
> Task :sdks:python:container:py38:dockerTagLatest
> Task :sdks:python:container:py37:dockerPushLatest
> Task :sdks:python:container:py37:dockerTagsPush
> Task :sdks:python:container:py38:dockerPushLatest
> Task :sdks:python:container:py38:dockerTagsPush
> Task :sdks:python:container:py310:dockerTag955a04eac5ff4e7d3c3c166df521d672fe5f59c0
> Task :sdks:python:container:py310:dockerPush955a04eac5ff4e7d3c3c166df521d672fe5f59c0
> Task :sdks:python:container:py310:dockerTagLatest
> Task :sdks:python:container:py310:dockerPushLatest
> Task :sdks:python:container:py310:dockerTagsPush
> Task :sdks:python:container:py311:dockerTag955a04eac5ff4e7d3c3c166df521d672fe5f59c0
> Task :sdks:python:container:py311:dockerPush955a04eac5ff4e7d3c3c166df521d672fe5f59c0
> Task :sdks:python:container:py311:dockerTagLatest
> Task :sdks:python:container:py311:dockerPushLatest
> Task :sdks:python:container:py311:dockerTagsPush
> Task :sdks:python:container:py39:dockerTag955a04eac5ff4e7d3c3c166df521d672fe5f59c0
> Task :sdks:python:container:py39:dockerPush955a04eac5ff4e7d3c3c166df521d672fe5f59c0
> Task :sdks:python:container:py39:dockerTagLatest
> Task :sdks:python:container:py39:dockerPushLatest
> Task :sdks:python:container:py39:dockerTagsPush
FAILURE: Build failed with an exception.
* What went wrong:
Execution failed for task ':sdks:java:container:java8:docker'.
> Process 'command 'docker'' finished with non-zero exit value 1
* Try:
> Run with --stacktrace option to get the stack trace.
> Run with --info or --debug option to get more log output.
* Get more help at https://help.gradle.org
Deprecated Gradle features were used in this build, making it incompatible with Gradle 8.0.
You can use '--warning-mode all' to show the individual deprecation warnings and determine if they come from your own scripts or plugins.
See https://docs.gradle.org/7.5.1/userguide/command_line_interface.html#sec:command_line_warnings
Execution optimizations have been disabled for 3 invalid unit(s) of work during this build to ensure correctness.
Please consult deprecation warnings for more details.
BUILD FAILED in 15m 52s
200 actionable tasks: 163 executed, 23 from cache, 14 up-to-date
Build scan background action failed.
java.lang.IllegalArgumentException: com.gradle.enterprise.gradleplugin.internal.extension.a is not an interface
at java.lang.reflect.Proxy$ProxyClassFactory.apply(Proxy.java:590)
at java.lang.reflect.Proxy$ProxyClassFactory.apply(Proxy.java:557)
at java.lang.reflect.WeakCache$Factory.get(WeakCache.java:230)
at java.lang.reflect.WeakCache.get(WeakCache.java:127)
at java.lang.reflect.Proxy.getProxyClass0(Proxy.java:419)
at java.lang.reflect.Proxy.newProxyInstance(Proxy.java:719)
at com.gradle.ProxyFactory$ProxyingInvocationHandler.createLocalProxy(ProxyFactory.java:64)
at com.gradle.ProxyFactory$ProxyingInvocationHandler.lambda$adaptActionArg$1(ProxyFactory.java:59)
at com.gradle.enterprise.gradleplugin.internal.extension.b$3.run(SourceFile:100)
at java.util.concurrent.Executors$RunnableAdapter.call(Executors.java:511)
at java.util.concurrent.FutureTask.run(FutureTask.java:266)
at java.util.concurrent.ThreadPoolExecutor.runWorker(ThreadPoolExecutor.java:1149)
at java.util.concurrent.ThreadPoolExecutor$Worker.run(ThreadPoolExecutor.java:624)
at java.lang.Thread.run(Thread.java:750)
Publishing build scan...
https://gradle.com/s/5h5jezcdrve7w
Build step 'Invoke Gradle script' changed build result to FAILURE
Build step 'Invoke Gradle script' marked build as failure
---------------------------------------------------------------------
To unsubscribe, e-mail: builds-unsubscribe@beam.apache.org
For additional commands, e-mail: builds-help@beam.apache.org
Jenkins build is back to normal : beam_Publish_Beam_SDK_Snapshots #5269
Posted by Apache Jenkins Server <je...@builds.apache.org>.
See <https://ci-beam.apache.org/job/beam_Publish_Beam_SDK_Snapshots/5269/display/redirect>
---------------------------------------------------------------------
To unsubscribe, e-mail: builds-unsubscribe@beam.apache.org
For additional commands, e-mail: builds-help@beam.apache.org