You are viewing a plain text version of this content. The canonical link for it is here.
Posted to dev@pdfbox.apache.org by Apache Jenkins Server <je...@builds.apache.org> on 2025/04/05 13:11:28 UTC
Build failed in Jenkins: PDFBox » PDFBox-Trunk-jdk23 » Apache PDFBox parent #1187
See <https://ci-builds.apache.org/job/PDFBox/job/PDFBox-Trunk-jdk23/org.apache.pdfbox$pdfbox-parent/1187/display/redirect>
Changes:
------------------------------------------
[...truncated 1.66 KiB...]
[INFO] pdfbox-reactor [pom]
[INFO] Downloading from central: https://repo.maven.apache.org/maven2/org/sonatype/ossindex/maven/ossindex-maven-plugin/maven-metadata.xml
[INFO] Downloaded from central: https://repo.maven.apache.org/maven2/org/sonatype/ossindex/maven/ossindex-maven-plugin/maven-metadata.xml (572 B at 842 B/s)
[INFO]
[INFO] ------------------< org.apache.pdfbox:pdfbox-parent >-------------------
[INFO] Building Apache PDFBox parent 4.0.0-SNAPSHOT [1/11]
[INFO] from parent/pom.xml
[INFO] --------------------------------[ pom ]---------------------------------
[INFO]
[INFO] --- clean:3.4.1:clean (default-clean) @ pdfbox-parent ---
[INFO]
[INFO] --- enforcer:3.5.0:enforce (default) @ pdfbox-parent ---
[INFO] Rule 0: org.apache.maven.enforcer.rules.version.RequireMavenVersion passed
[INFO]
[INFO] --- enforcer:3.5.0:enforce (enforce-maven-version) @ pdfbox-parent ---
[INFO]
[INFO] --- enforcer:3.5.0:enforce (enforce-java-version) @ pdfbox-parent ---
[INFO] Rule 0: org.apache.maven.enforcer.rules.version.RequireJavaVersion passed
[INFO]
[INFO] --- checkstyle:3.6.0:check (check) @ pdfbox-parent ---
[INFO] Starting audit...
Audit done.
[INFO] You have 0 Checkstyle violations.
[INFO]
[INFO] --- jacoco:0.8.13:prepare-agent (default) @ pdfbox-parent ---
[INFO] surefireArgLine set to -javaagent:/home/jenkins/.m2/repository/org/jacoco/org.jacoco.agent/0.8.13/org.jacoco.agent-0.8.13-runtime.jar=destfile=<https://ci-builds.apache.org/job/PDFBox/job/PDFBox-Trunk-jdk23/org.apache.pdfbox$pdfbox-parent/ws/target/jacoco.exec>
[INFO]
[INFO] --- remote-resources:3.3.0:process (process-resource-bundles) @ pdfbox-parent ---
[INFO] Preparing remote bundle org.apache.apache.resources:apache-jar-resource-bundle:1.7
[INFO] Copying 3 resources from 1 bundle.
[INFO]
[INFO] --- jacoco:0.8.13:report (report) @ pdfbox-parent ---
[INFO] Skipping JaCoCo execution due to missing execution data file.
[INFO]
[INFO] --- source:3.3.1:jar-no-fork (attach-sources) @ pdfbox-parent ---
[INFO] Skipping source per configuration.
[INFO]
[INFO] --- apache-rat:0.16.1:check (default) @ pdfbox-parent ---
[INFO] Rat check: Summary over all files. Unapproved: 0, unknown: 0, generated: 0, approved: 2 licenses.
[INFO]
[INFO] --- dependency-check:12.1.0:check (default) @ pdfbox-parent ---
[INFO] Checking for updates
[WARNING] An NVD API Key was not provided - it is highly recommended to use an NVD API key as the update can take a VERY long time without an API Key
[ERROR] Error updating the NVD Data
org.owasp.dependencycheck.data.update.exception.UpdateException: Error updating the NVD Data
at org.owasp.dependencycheck.data.update.NvdApiDataSource.processApi (NvdApiDataSource.java:399)
at org.owasp.dependencycheck.data.update.NvdApiDataSource.update (NvdApiDataSource.java:117)
at org.owasp.dependencycheck.Engine.doUpdates (Engine.java:903)
at org.owasp.dependencycheck.Engine.initializeAndUpdateDatabase (Engine.java:708)
at org.owasp.dependencycheck.Engine.analyzeDependencies (Engine.java:634)
at org.owasp.dependencycheck.maven.BaseDependencyCheckMojo.runCheck (BaseDependencyCheckMojo.java:2048)
at org.owasp.dependencycheck.maven.BaseDependencyCheckMojo.execute (BaseDependencyCheckMojo.java:1246)
at org.apache.maven.plugin.DefaultBuildPluginManager.executeMojo (DefaultBuildPluginManager.java:126)
at org.apache.maven.lifecycle.internal.MojoExecutor.doExecute2 (MojoExecutor.java:328)
at org.apache.maven.lifecycle.internal.MojoExecutor.doExecute (MojoExecutor.java:316)
at org.apache.maven.lifecycle.internal.MojoExecutor.execute (MojoExecutor.java:212)
at org.apache.maven.lifecycle.internal.MojoExecutor.execute (MojoExecutor.java:174)
at org.apache.maven.lifecycle.internal.MojoExecutor.access$000 (MojoExecutor.java:75)
at org.apache.maven.lifecycle.internal.MojoExecutor$1.run (MojoExecutor.java:162)
at org.apache.maven.plugin.DefaultMojosExecutionStrategy.execute (DefaultMojosExecutionStrategy.java:39)
at org.apache.maven.lifecycle.internal.MojoExecutor.execute (MojoExecutor.java:159)
at org.apache.maven.lifecycle.internal.LifecycleModuleBuilder.buildProject (LifecycleModuleBuilder.java:105)
at org.apache.maven.lifecycle.internal.LifecycleModuleBuilder.buildProject (LifecycleModuleBuilder.java:73)
at org.apache.maven.lifecycle.internal.builder.singlethreaded.SingleThreadedBuilder.build (SingleThreadedBuilder.java:53)
at org.apache.maven.lifecycle.internal.LifecycleStarter.execute (LifecycleStarter.java:118)
at org.apache.maven.DefaultMaven.doExecute (DefaultMaven.java:261)
at org.apache.maven.DefaultMaven.doExecute (DefaultMaven.java:173)
at org.apache.maven.DefaultMaven.execute (DefaultMaven.java:101)
at org.jvnet.hudson.maven3.launcher.Maven35Launcher.main (Maven35Launcher.java:138)
at jdk.internal.reflect.DirectMethodHandleAccessor.invoke (DirectMethodHandleAccessor.java:103)
at java.lang.reflect.Method.invoke (Method.java:580)
at org.codehaus.plexus.classworlds.launcher.Launcher.launchEnhanced (Launcher.java:255)
at org.codehaus.plexus.classworlds.launcher.Launcher.launch (Launcher.java:201)
at jenkins.maven3.agent.Maven35Main.launch (Maven35Main.java:179)
at jdk.internal.reflect.DirectMethodHandleAccessor.invoke (DirectMethodHandleAccessor.java:103)
at java.lang.reflect.Method.invoke (Method.java:580)
at hudson.maven.Maven3Builder.call (Maven3Builder.java:140)
at hudson.maven.Maven3Builder.call (Maven3Builder.java:71)
at hudson.remoting.UserRequest.perform (UserRequest.java:225)
at hudson.remoting.UserRequest.perform (UserRequest.java:50)
at hudson.remoting.Request$2.run (Request.java:391)
at hudson.remoting.InterceptingExecutorService.lambda$wrap$0 (InterceptingExecutorService.java:81)
at java.util.concurrent.FutureTask.run (FutureTask.java:317)
at java.util.concurrent.ThreadPoolExecutor.runWorker (ThreadPoolExecutor.java:1144)
at java.util.concurrent.ThreadPoolExecutor$Worker.run (ThreadPoolExecutor.java:642)
at java.lang.Thread.run (Thread.java:1575)
Caused by: io.github.jeremylong.openvulnerability.client.nvd.NvdApiException: Failed to parse NVD data
at io.github.jeremylong.openvulnerability.client.nvd.NvdCveClient._next (NvdCveClient.java:389)
at io.github.jeremylong.openvulnerability.client.nvd.NvdCveClient.next (NvdCveClient.java:357)
at org.owasp.dependencycheck.data.update.NvdApiDataSource.processApi (NvdApiDataSource.java:355)
at org.owasp.dependencycheck.data.update.NvdApiDataSource.update (NvdApiDataSource.java:117)
at org.owasp.dependencycheck.Engine.doUpdates (Engine.java:903)
at org.owasp.dependencycheck.Engine.initializeAndUpdateDatabase (Engine.java:708)
at org.owasp.dependencycheck.Engine.analyzeDependencies (Engine.java:634)
at org.owasp.dependencycheck.maven.BaseDependencyCheckMojo.runCheck (BaseDependencyCheckMojo.java:2048)
at org.owasp.dependencycheck.maven.BaseDependencyCheckMojo.execute (BaseDependencyCheckMojo.java:1246)
at org.apache.maven.plugin.DefaultBuildPluginManager.executeMojo (DefaultBuildPluginManager.java:126)
at org.apache.maven.lifecycle.internal.MojoExecutor.doExecute2 (MojoExecutor.java:328)
at org.apache.maven.lifecycle.internal.MojoExecutor.doExecute (MojoExecutor.java:316)
at org.apache.maven.lifecycle.internal.MojoExecutor.execute (MojoExecutor.java:212)
at org.apache.maven.lifecycle.internal.MojoExecutor.execute (MojoExecutor.java:174)
at org.apache.maven.lifecycle.internal.MojoExecutor.access$000 (MojoExecutor.java:75)
at org.apache.maven.lifecycle.internal.MojoExecutor$1.run (MojoExecutor.java:162)
at org.apache.maven.plugin.DefaultMojosExecutionStrategy.execute (DefaultMojosExecutionStrategy.java:39)
at org.apache.maven.lifecycle.internal.MojoExecutor.execute (MojoExecutor.java:159)
at org.apache.maven.lifecycle.internal.LifecycleModuleBuilder.buildProject (LifecycleModuleBuilder.java:105)
at org.apache.maven.lifecycle.internal.LifecycleModuleBuilder.buildProject (LifecycleModuleBuilder.java:73)
at org.apache.maven.lifecycle.internal.builder.singlethreaded.SingleThreadedBuilder.build (SingleThreadedBuilder.java:53)
at org.apache.maven.lifecycle.internal.LifecycleStarter.execute (LifecycleStarter.java:118)
at org.apache.maven.DefaultMaven.doExecute (DefaultMaven.java:261)
at org.apache.maven.DefaultMaven.doExecute (DefaultMaven.java:173)
at org.apache.maven.DefaultMaven.execute (DefaultMaven.java:101)
at org.jvnet.hudson.maven3.launcher.Maven35Launcher.main (Maven35Launcher.java:138)
at jdk.internal.reflect.DirectMethodHandleAccessor.invoke (DirectMethodHandleAccessor.java:103)
at java.lang.reflect.Method.invoke (Method.java:580)
at org.codehaus.plexus.classworlds.launcher.Launcher.launchEnhanced (Launcher.java:255)
at org.codehaus.plexus.classworlds.launcher.Launcher.launch (Launcher.java:201)
at jenkins.maven3.agent.Maven35Main.launch (Maven35Main.java:179)
at jdk.internal.reflect.DirectMethodHandleAccessor.invoke (DirectMethodHandleAccessor.java:103)
at java.lang.reflect.Method.invoke (Method.java:580)
at hudson.maven.Maven3Builder.call (Maven3Builder.java:140)
at hudson.maven.Maven3Builder.call (Maven3Builder.java:71)
at hudson.remoting.UserRequest.perform (UserRequest.java:225)
at hudson.remoting.UserRequest.perform (UserRequest.java:50)
at hudson.remoting.Request$2.run (Request.java:391)
at hudson.remoting.InterceptingExecutorService.lambda$wrap$0 (InterceptingExecutorService.java:81)
at java.util.concurrent.FutureTask.run (FutureTask.java:317)
at java.util.concurrent.ThreadPoolExecutor.runWorker (ThreadPoolExecutor.java:1144)
at java.util.concurrent.ThreadPoolExecutor$Worker.run (ThreadPoolExecutor.java:642)
at java.lang.Thread.run (Thread.java:1575)
Caused by: com.fasterxml.jackson.databind.JsonMappingException: Unexpected character (']' (code 93)): expected a valid value (JSON String, Number, Array, Object or token 'null', 'true' or 'false')
at [Source: REDACTED (`StreamReadFeature.INCLUDE_SOURCE_IN_LOCATION` disabled); line: 1, column: 3512323] (through reference chain: io.github.jeremylong.openvulnerability.client.nvd.CveApiJson20["vulnerabilities"])
at com.fasterxml.jackson.databind.JsonMappingException.wrapWithPath (JsonMappingException.java:401)
at com.fasterxml.jackson.databind.JsonMappingException.wrapWithPath (JsonMappingException.java:360)
at com.fasterxml.jackson.databind.deser.BeanDeserializerBase.wrapAndThrow (BeanDeserializerBase.java:1964)
at com.fasterxml.jackson.databind.deser.BeanDeserializer.vanillaDeserialize (BeanDeserializer.java:312)
at com.fasterxml.jackson.databind.deser.BeanDeserializer.deserialize (BeanDeserializer.java:177)
at com.fasterxml.jackson.databind.deser.DefaultDeserializationContext.readRootValue (DefaultDeserializationContext.java:342)
at com.fasterxml.jackson.databind.ObjectMapper._readMapAndClose (ObjectMapper.java:4917)
at com.fasterxml.jackson.databind.ObjectMapper.readValue (ObjectMapper.java:3860)
at com.fasterxml.jackson.databind.ObjectMapper.readValue (ObjectMapper.java:3828)
at io.github.jeremylong.openvulnerability.client.nvd.NvdCveClient._next (NvdCveClient.java:384)
at io.github.jeremylong.openvulnerability.client.nvd.NvdCveClient.next (NvdCveClient.java:357)
at org.owasp.dependencycheck.data.update.NvdApiDataSource.processApi (NvdApiDataSource.java:355)
at org.owasp.dependencycheck.data.update.NvdApiDataSource.update (NvdApiDataSource.java:117)
at org.owasp.dependencycheck.Engine.doUpdates (Engine.java:903)
at org.owasp.dependencycheck.Engine.initializeAndUpdateDatabase (Engine.java:708)
at org.owasp.dependencycheck.Engine.analyzeDependencies (Engine.java:634)
at org.owasp.dependencycheck.maven.BaseDependencyCheckMojo.runCheck (BaseDependencyCheckMojo.java:2048)
at org.owasp.dependencycheck.maven.BaseDependencyCheckMojo.execute (BaseDependencyCheckMojo.java:1246)
at org.apache.maven.plugin.DefaultBuildPluginManager.executeMojo (DefaultBuildPluginManager.java:126)
at org.apache.maven.lifecycle.internal.MojoExecutor.doExecute2 (MojoExecutor.java:328)
at org.apache.maven.lifecycle.internal.MojoExecutor.doExecute (MojoExecutor.java:316)
at org.apache.maven.lifecycle.internal.MojoExecutor.execute (MojoExecutor.java:212)
at org.apache.maven.lifecycle.internal.MojoExecutor.execute (MojoExecutor.java:174)
at org.apache.maven.lifecycle.internal.MojoExecutor.access$000 (MojoExecutor.java:75)
at org.apache.maven.lifecycle.internal.MojoExecutor$1.run (MojoExecutor.java:162)
at org.apache.maven.plugin.DefaultMojosExecutionStrategy.execute (DefaultMojosExecutionStrategy.java:39)
at org.apache.maven.lifecycle.internal.MojoExecutor.execute (MojoExecutor.java:159)
at org.apache.maven.lifecycle.internal.LifecycleModuleBuilder.buildProject (LifecycleModuleBuilder.java:105)
at org.apache.maven.lifecycle.internal.LifecycleModuleBuilder.buildProject (LifecycleModuleBuilder.java:73)
at org.apache.maven.lifecycle.internal.builder.singlethreaded.SingleThreadedBuilder.build (SingleThreadedBuilder.java:53)
at org.apache.maven.lifecycle.internal.LifecycleStarter.execute (LifecycleStarter.java:118)
at org.apache.maven.DefaultMaven.doExecute (DefaultMaven.java:261)
at org.apache.maven.DefaultMaven.doExecute (DefaultMaven.java:173)
at org.apache.maven.DefaultMaven.execute (DefaultMaven.java:101)
at org.jvnet.hudson.maven3.launcher.Maven35Launcher.main (Maven35Launcher.java:138)
at jdk.internal.reflect.DirectMethodHandleAccessor.invoke (DirectMethodHandleAccessor.java:103)
at java.lang.reflect.Method.invoke (Method.java:580)
at org.codehaus.plexus.classworlds.launcher.Launcher.launchEnhanced (Launcher.java:255)
at org.codehaus.plexus.classworlds.launcher.Launcher.launch (Launcher.java:201)
at jenkins.maven3.agent.Maven35Main.launch (Maven35Main.java:179)
at jdk.internal.reflect.DirectMethodHandleAccessor.invoke (DirectMethodHandleAccessor.java:103)
at java.lang.reflect.Method.invoke (Method.java:580)
at hudson.maven.Maven3Builder.call (Maven3Builder.java:140)
at hudson.maven.Maven3Builder.call (Maven3Builder.java:71)
at hudson.remoting.UserRequest.perform (UserRequest.java:225)
at hudson.remoting.UserRequest.perform (UserRequest.java:50)
at hudson.remoting.Request$2.run (Request.java:391)
at hudson.remoting.InterceptingExecutorService.lambda$wrap$0 (InterceptingExecutorService.java:81)
at java.util.concurrent.FutureTask.run (FutureTask.java:317)
at java.util.concurrent.ThreadPoolExecutor.runWorker (ThreadPoolExecutor.java:1144)
at java.util.concurrent.ThreadPoolExecutor$Worker.run (ThreadPoolExecutor.java:642)
at java.lang.Thread.run (Thread.java:1575)
Caused by: com.fasterxml.jackson.core.JsonParseException: Unexpected character (']' (code 93)): expected a valid value (JSON String, Number, Array, Object or token 'null', 'true' or 'false')
at [Source: REDACTED (`StreamReadFeature.INCLUDE_SOURCE_IN_LOCATION` disabled); line: 1, column: 3512323]
at com.fasterxml.jackson.core.JsonParser._constructReadException (JsonParser.java:2660)
at com.fasterxml.jackson.core.base.ParserMinimalBase._reportUnexpectedChar (ParserMinimalBase.java:741)
at com.fasterxml.jackson.core.json.ReaderBasedJsonParser._handleOddValue (ReaderBasedJsonParser.java:2054)
at com.fasterxml.jackson.core.json.ReaderBasedJsonParser.nextToken (ReaderBasedJsonParser.java:780)
at com.fasterxml.jackson.databind.deser.std.CollectionDeserializer._deserializeFromArray (CollectionDeserializer.java:352)
at com.fasterxml.jackson.databind.deser.std.CollectionDeserializer.deserialize (CollectionDeserializer.java:246)
at com.fasterxml.jackson.databind.deser.std.CollectionDeserializer.deserialize (CollectionDeserializer.java:30)
at com.fasterxml.jackson.databind.deser.impl.FieldProperty.deserializeAndSet (FieldProperty.java:138)
at com.fasterxml.jackson.databind.deser.BeanDeserializer.vanillaDeserialize (BeanDeserializer.java:310)
at com.fasterxml.jackson.databind.deser.BeanDeserializer.deserialize (BeanDeserializer.java:177)
at com.fasterxml.jackson.databind.deser.DefaultDeserializationContext.readRootValue (DefaultDeserializationContext.java:342)
at com.fasterxml.jackson.databind.ObjectMapper._readMapAndClose (ObjectMapper.java:4917)
at com.fasterxml.jackson.databind.ObjectMapper.readValue (ObjectMapper.java:3860)
at com.fasterxml.jackson.databind.ObjectMapper.readValue (ObjectMapper.java:3828)
at io.github.jeremylong.openvulnerability.client.nvd.NvdCveClient._next (NvdCveClient.java:384)
at io.github.jeremylong.openvulnerability.client.nvd.NvdCveClient.next (NvdCveClient.java:357)
at org.owasp.dependencycheck.data.update.NvdApiDataSource.processApi (NvdApiDataSource.java:355)
at org.owasp.dependencycheck.data.update.NvdApiDataSource.update (NvdApiDataSource.java:117)
at org.owasp.dependencycheck.Engine.doUpdates (Engine.java:903)
at org.owasp.dependencycheck.Engine.initializeAndUpdateDatabase (Engine.java:708)
at org.owasp.dependencycheck.Engine.analyzeDependencies (Engine.java:634)
at org.owasp.dependencycheck.maven.BaseDependencyCheckMojo.runCheck (BaseDependencyCheckMojo.java:2048)
at org.owasp.dependencycheck.maven.BaseDependencyCheckMojo.execute (BaseDependencyCheckMojo.java:1246)
at org.apache.maven.plugin.DefaultBuildPluginManager.executeMojo (DefaultBuildPluginManager.java:126)
at org.apache.maven.lifecycle.internal.MojoExecutor.doExecute2 (MojoExecutor.java:328)
at org.apache.maven.lifecycle.internal.MojoExecutor.doExecute (MojoExecutor.java:316)
at org.apache.maven.lifecycle.internal.MojoExecutor.execute (MojoExecutor.java:212)
at org.apache.maven.lifecycle.internal.MojoExecutor.execute (MojoExecutor.java:174)
at org.apache.maven.lifecycle.internal.MojoExecutor.access$000 (MojoExecutor.java:75)
at org.apache.maven.lifecycle.internal.MojoExecutor$1.run (MojoExecutor.java:162)
at org.apache.maven.plugin.DefaultMojosExecutionStrategy.execute (DefaultMojosExecutionStrategy.java:39)
at org.apache.maven.lifecycle.internal.MojoExecutor.execute (MojoExecutor.java:159)
at org.apache.maven.lifecycle.internal.LifecycleModuleBuilder.buildProject (LifecycleModuleBuilder.java:105)
at org.apache.maven.lifecycle.internal.LifecycleModuleBuilder.buildProject (LifecycleModuleBuilder.java:73)
at org.apache.maven.lifecycle.internal.builder.singlethreaded.SingleThreadedBuilder.build (SingleThreadedBuilder.java:53)
at org.apache.maven.lifecycle.internal.LifecycleStarter.execute (LifecycleStarter.java:118)
at org.apache.maven.DefaultMaven.doExecute (DefaultMaven.java:261)
at org.apache.maven.DefaultMaven.doExecute (DefaultMaven.java:173)
at org.apache.maven.DefaultMaven.execute (DefaultMaven.java:101)
at org.jvnet.hudson.maven3.launcher.Maven35Launcher.main (Maven35Launcher.java:138)
at jdk.internal.reflect.DirectMethodHandleAccessor.invoke (DirectMethodHandleAccessor.java:103)
at java.lang.reflect.Method.invoke (Method.java:580)
at org.codehaus.plexus.classworlds.launcher.Launcher.launchEnhanced (Launcher.java:255)
at org.codehaus.plexus.classworlds.launcher.Launcher.launch (Launcher.java:201)
at jenkins.maven3.agent.Maven35Main.launch (Maven35Main.java:179)
at jdk.internal.reflect.DirectMethodHandleAccessor.invoke (DirectMethodHandleAccessor.java:103)
at java.lang.reflect.Method.invoke (Method.java:580)
at hudson.maven.Maven3Builder.call (Maven3Builder.java:140)
at hudson.maven.Maven3Builder.call (Maven3Builder.java:71)
at hudson.remoting.UserRequest.perform (UserRequest.java:225)
at hudson.remoting.UserRequest.perform (UserRequest.java:50)
at hudson.remoting.Request$2.run (Request.java:391)
at hudson.remoting.InterceptingExecutorService.lambda$wrap$0 (InterceptingExecutorService.java:81)
at java.util.concurrent.FutureTask.run (FutureTask.java:317)
at java.util.concurrent.ThreadPoolExecutor.runWorker (ThreadPoolExecutor.java:1144)
at java.util.concurrent.ThreadPoolExecutor$Worker.run (ThreadPoolExecutor.java:642)
at java.lang.Thread.run (Thread.java:1575)
[INFO] Updating CISA Known Exploited Vulnerability list: https://www.cisa.gov/sites/default/files/feeds/known_exploited_vulnerabilities.json
[INFO] Begin database defrag
[INFO] End database defrag (11702 ms)
[WARNING] Unable to update 1 or more Cached Web DataSource, using local data instead. Results may not include recent vulnerabilities.
[ERROR] Unable to continue dependency-check analysis.
[WARNING] Attempt to (de-)serialize anonymous class org.jfrog.hudson.maven2.MavenDependenciesRecorder$1; see: https://jenkins.io/redirect/serialization-of-anonymous-classes/
---------------------------------------------------------------------
To unsubscribe, e-mail: dev-unsubscribe@pdfbox.apache.org
For additional commands, e-mail: dev-help@pdfbox.apache.org