You are viewing a plain text version of this content. The canonical link for it is here.
Posted to dev@zookeeper.apache.org by Apache Jenkins Server <je...@builds.apache.org> on 2016/07/18 14:06:00 UTC
ZooKeeper_branch34_solaris - Build # 1221 - Failure
See https://builds.apache.org/job/ZooKeeper_branch34_solaris/1221/
###################################################################################
########################## LAST 60 LINES OF THE CONSOLE ###########################
[...truncated 173456 lines...]
[junit] 2016-07-18 14:06:44,323 [myid:] - INFO [main:JMXEnv@246] - expect:StandaloneServer_port
[junit] 2016-07-18 14:06:44,323 [myid:] - INFO [main:JMXEnv@250] - found:StandaloneServer_port org.apache.ZooKeeperService:name0=StandaloneServer_port11221
[junit] 2016-07-18 14:06:44,323 [myid:] - INFO [main:ClientBase@490] - STOPPING server
[junit] 2016-07-18 14:06:44,324 [myid:] - INFO [main:ZooKeeperServer@469] - shutting down
[junit] 2016-07-18 14:06:44,324 [myid:] - INFO [main:SessionTrackerImpl@225] - Shutting down
[junit] 2016-07-18 14:06:44,324 [myid:] - INFO [main:PrepRequestProcessor@765] - Shutting down
[junit] 2016-07-18 14:06:44,324 [myid:] - INFO [main:SyncRequestProcessor@209] - Shutting down
[junit] 2016-07-18 14:06:44,324 [myid:] - INFO [ProcessThread(sid:0 cport:11221)::PrepRequestProcessor@143] - PrepRequestProcessor exited loop!
[junit] 2016-07-18 14:06:44,325 [myid:] - INFO [SyncThread:0:SyncRequestProcessor@187] - SyncRequestProcessor exited!
[junit] 2016-07-18 14:06:44,325 [myid:] - INFO [main:FinalRequestProcessor@402] - shutdown of request processor complete
[junit] 2016-07-18 14:06:44,325 [myid:] - INFO [main:FourLetterWordMain@62] - connecting to 127.0.0.1 11221
[junit] 2016-07-18 14:06:44,326 [myid:] - INFO [main:JMXEnv@146] - ensureOnly:[]
[junit] 2016-07-18 14:06:44,327 [myid:] - INFO [main:ClientBase@443] - STARTING server
[junit] 2016-07-18 14:06:44,327 [myid:] - INFO [main:ClientBase@364] - CREATING server instance 127.0.0.1:11221
[junit] 2016-07-18 14:06:44,327 [myid:] - INFO [main:NIOServerCnxnFactory@89] - binding to port 0.0.0.0/0.0.0.0:11221
[junit] 2016-07-18 14:06:44,327 [myid:] - INFO [main:ClientBase@339] - STARTING server instance 127.0.0.1:11221
[junit] 2016-07-18 14:06:44,328 [myid:] - INFO [main:ZooKeeperServer@170] - Created server with tickTime 3000 minSessionTimeout 6000 maxSessionTimeout 60000 datadir /zonestorage/hudson_solaris/home/hudson/hudson-slave/workspace/ZooKeeper_branch34_solaris/trunk/build/test/tmp/test3892480650238972538.junit.dir/version-2 snapdir /zonestorage/hudson_solaris/home/hudson/hudson-slave/workspace/ZooKeeper_branch34_solaris/trunk/build/test/tmp/test3892480650238972538.junit.dir/version-2
[junit] 2016-07-18 14:06:44,330 [myid:] - INFO [main:FourLetterWordMain@62] - connecting to 127.0.0.1 11221
[junit] 2016-07-18 14:06:44,331 [myid:] - INFO [NIOServerCxn.Factory:0.0.0.0/0.0.0.0:11221:NIOServerCnxnFactory@192] - Accepted socket connection from /127.0.0.1:65007
[junit] 2016-07-18 14:06:44,331 [myid:] - INFO [NIOServerCxn.Factory:0.0.0.0/0.0.0.0:11221:NIOServerCnxn@827] - Processing stat command from /127.0.0.1:65007
[junit] 2016-07-18 14:06:44,331 [myid:] - INFO [Thread-5:NIOServerCnxn$StatCommand@663] - Stat command output
[junit] 2016-07-18 14:06:44,332 [myid:] - INFO [Thread-5:NIOServerCnxn@1008] - Closed socket connection for client /127.0.0.1:65007 (no session established for client)
[junit] 2016-07-18 14:06:44,333 [myid:] - INFO [main:JMXEnv@229] - ensureParent:[InMemoryDataTree, StandaloneServer_port]
[junit] 2016-07-18 14:06:44,334 [myid:] - INFO [main:JMXEnv@246] - expect:InMemoryDataTree
[junit] 2016-07-18 14:06:44,334 [myid:] - INFO [main:JMXEnv@250] - found:InMemoryDataTree org.apache.ZooKeeperService:name0=StandaloneServer_port11221,name1=InMemoryDataTree
[junit] 2016-07-18 14:06:44,335 [myid:] - INFO [main:JMXEnv@246] - expect:StandaloneServer_port
[junit] 2016-07-18 14:06:44,335 [myid:] - INFO [main:JMXEnv@250] - found:StandaloneServer_port org.apache.ZooKeeperService:name0=StandaloneServer_port11221
[junit] 2016-07-18 14:06:44,335 [myid:] - INFO [main:JUnit4ZKTestRunner$LoggedInvokeMethod@58] - Memory used 9198
[junit] 2016-07-18 14:06:44,336 [myid:] - INFO [main:JUnit4ZKTestRunner$LoggedInvokeMethod@63] - Number of threads 20
[junit] 2016-07-18 14:06:44,336 [myid:] - INFO [main:JUnit4ZKTestRunner$LoggedInvokeMethod@78] - FINISHED TEST METHOD testQuota
[junit] 2016-07-18 14:06:44,336 [myid:] - INFO [main:ClientBase@520] - tearDown starting
[junit] 2016-07-18 14:06:44,412 [myid:] - INFO [main:ZooKeeper@684] - Session: 0x155fe5494ab0000 closed
[junit] 2016-07-18 14:06:44,412 [myid:] - INFO [main-EventThread:ClientCnxn$EventThread@519] - EventThread shut down for session: 0x155fe5494ab0000
[junit] 2016-07-18 14:06:44,412 [myid:] - INFO [main:ClientBase@490] - STOPPING server
[junit] 2016-07-18 14:06:44,414 [myid:] - INFO [main:ZooKeeperServer@469] - shutting down
[junit] 2016-07-18 14:06:44,414 [myid:] - INFO [main:SessionTrackerImpl@225] - Shutting down
[junit] 2016-07-18 14:06:44,414 [myid:] - INFO [main:PrepRequestProcessor@765] - Shutting down
[junit] 2016-07-18 14:06:44,414 [myid:] - INFO [main:SyncRequestProcessor@209] - Shutting down
[junit] 2016-07-18 14:06:44,414 [myid:] - INFO [ProcessThread(sid:0 cport:11221)::PrepRequestProcessor@143] - PrepRequestProcessor exited loop!
[junit] 2016-07-18 14:06:44,414 [myid:] - INFO [SyncThread:0:SyncRequestProcessor@187] - SyncRequestProcessor exited!
[junit] 2016-07-18 14:06:44,415 [myid:] - INFO [main:FinalRequestProcessor@402] - shutdown of request processor complete
[junit] 2016-07-18 14:06:44,415 [myid:] - INFO [main:FourLetterWordMain@62] - connecting to 127.0.0.1 11221
[junit] 2016-07-18 14:06:44,416 [myid:] - INFO [main:JMXEnv@146] - ensureOnly:[]
[junit] 2016-07-18 14:06:44,419 [myid:] - INFO [main:ClientBase@545] - fdcount after test is: 42 at start it was 28
[junit] 2016-07-18 14:06:44,419 [myid:] - INFO [main:ClientBase@547] - sleeping for 20 secs
[junit] 2016-07-18 14:06:44,420 [myid:] - INFO [main:ZKTestCase$1@60] - SUCCEEDED testQuota
[junit] 2016-07-18 14:06:44,420 [myid:] - INFO [main:ZKTestCase$1@55] - FINISHED testQuota
[junit] Tests run: 1, Failures: 0, Errors: 0, Time elapsed: 2.034 sec
BUILD FAILED
/zonestorage/hudson_solaris/home/hudson/hudson-slave/workspace/ZooKeeper_branch34_solaris/trunk/build.xml:1320: Tests failed!
Total time: 30 minutes 8 seconds
Build step 'Invoke Ant' marked build as failure
[locks-and-latches] Releasing all the locks
[locks-and-latches] All the locks released
Recording test results
Email was triggered for: Failure - Any
Sending email for trigger: Failure - Any
###################################################################################
############################## FAILED TESTS (if any) ##############################
1 tests failed.
FAILED: org.apache.zookeeper.test.LETest.testLE
Error Message:
Threads didn't join
Stack Trace:
junit.framework.AssertionFailedError: Threads didn't join
at org.apache.zookeeper.test.LETest.testLE(LETest.java:120)
at org.apache.zookeeper.JUnit4ZKTestRunner$LoggedInvokeMethod.evaluate(JUnit4ZKTestRunner.java:55)
ZooKeeper_branch34_solaris - Build # 1227 - Still Failing
Posted by Apache Jenkins Server <je...@builds.apache.org>.
See https://builds.apache.org/job/ZooKeeper_branch34_solaris/1227/
###################################################################################
########################## LAST 60 LINES OF THE CONSOLE ###########################
[...truncated 31519 lines...]
[junit] 2016-07-24 13:46:59,657 [myid:2] - INFO [ProcessThread(sid:2 cport:-1)::PrepRequestProcessor@143] - PrepRequestProcessor exited loop!
[junit] 2016-07-24 13:46:59,657 [myid:2] - INFO [CommitProcessor:2:CommitProcessor@153] - CommitProcessor exited loop!
[junit] 2016-07-24 13:46:59,657 [myid:] - INFO [main:Leader$ToBeAppliedRequestProcessor@661] - Shutting down
[junit] 2016-07-24 13:46:59,658 [myid:] - INFO [main:FinalRequestProcessor@402] - shutdown of request processor complete
[junit] 2016-07-24 13:46:59,658 [myid:] - INFO [main:SyncRequestProcessor@209] - Shutting down
[junit] 2016-07-24 13:46:59,658 [myid:2] - INFO [SyncThread:2:SyncRequestProcessor@187] - SyncRequestProcessor exited!
[junit] 2016-07-24 13:46:59,659 [myid:2] - WARN [QuorumPeer[myid=2]/0.0.0.0:11292:QuorumPeer@862] - Unexpected exception
[junit] java.lang.InterruptedException: sleep interrupted
[junit] at java.lang.Thread.sleep(Native Method)
[junit] at org.apache.zookeeper.server.quorum.Leader.lead(Leader.java:456)
[junit] at org.apache.zookeeper.server.quorum.QuorumPeer.run(QuorumPeer.java:859)
[junit] 2016-07-24 13:46:59,659 [myid:2] - ERROR [/127.0.0.1:11294:QuorumCnxManager$Listener@547] - Exception while listening
[junit] java.net.SocketException: Socket closed
[junit] at java.net.PlainSocketImpl.socketAccept(Native Method)
[junit] at java.net.PlainSocketImpl.accept(PlainSocketImpl.java:408)
[junit] at java.net.ServerSocket.implAccept(ServerSocket.java:462)
[junit] at java.net.ServerSocket.accept(ServerSocket.java:430)
[junit] at org.apache.zookeeper.server.quorum.QuorumCnxManager$Listener.run(QuorumCnxManager.java:539)
[junit] 2016-07-24 13:46:59,659 [myid:2] - INFO [QuorumPeer[myid=2]/0.0.0.0:11292:Leader@496] - Shutting down
[junit] 2016-07-24 13:46:59,660 [myid:2] - WARN [QuorumPeer[myid=2]/0.0.0.0:11292:QuorumPeer@874] - QuorumPeer main thread exited
[junit] 2016-07-24 13:46:59,659 [myid:] - INFO [main:QuorumBase@310] - Shutting down leader election QuorumPeer[myid=2]/0.0.0.0:11292
[junit] 2016-07-24 13:46:59,660 [myid:] - INFO [main:QuorumBase@315] - Waiting for QuorumPeer[myid=2]/0.0.0.0:11292 to exit thread
[junit] 2016-07-24 13:46:59,660 [myid:] - INFO [main:ZKTestCase$1@60] - SUCCEEDED testNewFollowerRestartAfterNewEpoch
[junit] 2016-07-24 13:46:59,660 [myid:] - INFO [main:ZKTestCase$1@55] - FINISHED testNewFollowerRestartAfterNewEpoch
[junit] Tests run: 10, Failures: 0, Errors: 0, Time elapsed: 195.543 sec
[junit] 2016-07-24 13:47:00,001 [myid:2] - INFO [SessionTracker:SessionTrackerImpl@162] - SessionTrackerImpl exited loop!
[junit] 2016-07-24 13:47:00,071 [myid:] - INFO [main-SendThread(127.0.0.1:11239):ClientCnxn$SendThread@1032] - Opening socket connection to server 127.0.0.1/127.0.0.1:11239. Will not attempt to authenticate using SASL (java.lang.SecurityException: Unable to locate a login configuration)
[junit] 2016-07-24 13:47:00,071 [myid:] - ERROR [main-SendThread(127.0.0.1:11239):ClientCnxnSocketNIO@289] - Unable to open socket to 127.0.0.1/127.0.0.1:11239
[junit] 2016-07-24 13:47:00,071 [myid:] - WARN [main-SendThread(127.0.0.1:11239):ClientCnxn$SendThread@1162] - Session 0x1561d263fb20000 for server null, unexpected error, closing socket connection and attempting reconnect
[junit] java.net.ConnectException: Connection refused
[junit] at sun.nio.ch.Net.connect(Native Method)
[junit] at sun.nio.ch.SocketChannelImpl.connect(SocketChannelImpl.java:500)
[junit] at org.apache.zookeeper.ClientCnxnSocketNIO.registerAndConnect(ClientCnxnSocketNIO.java:277)
[junit] at org.apache.zookeeper.ClientCnxnSocketNIO.connect(ClientCnxnSocketNIO.java:287)
[junit] at org.apache.zookeeper.ClientCnxn$SendThread.startConnect(ClientCnxn.java:1024)
[junit] at org.apache.zookeeper.ClientCnxn$SendThread.run(ClientCnxn.java:1060)
[junit] 2016-07-24 13:47:00,253 [myid:] - INFO [main-SendThread(127.0.0.1:11242):ClientCnxn$SendThread@1032] - Opening socket connection to server 127.0.0.1/127.0.0.1:11242. Will not attempt to authenticate using SASL (java.lang.SecurityException: Unable to locate a login configuration)
[junit] 2016-07-24 13:47:00,254 [myid:] - ERROR [main-SendThread(127.0.0.1:11242):ClientCnxnSocketNIO@289] - Unable to open socket to 127.0.0.1/127.0.0.1:11242
[junit] 2016-07-24 13:47:00,254 [myid:] - WARN [main-SendThread(127.0.0.1:11242):ClientCnxn$SendThread@1162] - Session 0x2561d263fb50000 for server null, unexpected error, closing socket connection and attempting reconnect
[junit] java.net.ConnectException: Connection refused
[junit] at sun.nio.ch.Net.connect(Native Method)
[junit] at sun.nio.ch.SocketChannelImpl.connect(SocketChannelImpl.java:500)
[junit] at org.apache.zookeeper.ClientCnxnSocketNIO.registerAndConnect(ClientCnxnSocketNIO.java:277)
[junit] at org.apache.zookeeper.ClientCnxnSocketNIO.connect(ClientCnxnSocketNIO.java:287)
[junit] at org.apache.zookeeper.ClientCnxn$SendThread.startConnect(ClientCnxn.java:1024)
[junit] at org.apache.zookeeper.ClientCnxn$SendThread.run(ClientCnxn.java:1060)
[junit] Running org.apache.zookeeper.server.quorum.WatchLeakTest
[junit] Tests run: 1, Failures: 0, Errors: 1, Time elapsed: 0 sec
BUILD FAILED
/zonestorage/hudson_solaris/home/hudson/hudson-slave/workspace/ZooKeeper_branch34_solaris/trunk/build.xml:1289: Process fork failed.
Total time: 19 minutes 15 seconds
Build step 'Invoke Ant' marked build as failure
[locks-and-latches] Releasing all the locks
[locks-and-latches] All the locks released
Recording test results
Email was triggered for: Failure - Any
Sending email for trigger: Failure - Any
###################################################################################
############################## FAILED TESTS (if any) ##############################
1 tests failed.
FAILED: org.apache.zookeeper.server.quorum.WatchLeakTest.unknown
Error Message:
Forked Java VM exited abnormally. Please note the time in the report does not reflect the time until the VM exit.
Stack Trace:
junit.framework.AssertionFailedError: Forked Java VM exited abnormally. Please note the time in the report does not reflect the time until the VM exit.
ZooKeeper_branch34_solaris - Build # 1226 - Still Failing
Posted by Apache Jenkins Server <je...@builds.apache.org>.
See https://builds.apache.org/job/ZooKeeper_branch34_solaris/1226/
###################################################################################
########################## LAST 60 LINES OF THE CONSOLE ###########################
[...truncated 132 lines...]
[javac] public static class ExitCodeException extends IOException {
[javac] ^
[javac] /zonestorage/hudson_solaris/home/hudson/hudson-slave/workspace/ZooKeeper_branch34_solaris/trunk/src/java/main/org/apache/zookeeper/server/quorum/QuorumPeer.java:680: warning: [deprecation] org.apache.zookeeper.server.quorum.LeaderElection in org.apache.zookeeper.server.quorum has been deprecated
[javac] le = new LeaderElection(this);
[javac] ^
[javac] /zonestorage/hudson_solaris/home/hudson/hudson-slave/workspace/ZooKeeper_branch34_solaris/trunk/src/java/main/org/apache/zookeeper/server/quorum/QuorumPeer.java:683: warning: [deprecation] org.apache.zookeeper.server.quorum.AuthFastLeaderElection in org.apache.zookeeper.server.quorum has been deprecated
[javac] le = new AuthFastLeaderElection(this);
[javac] ^
[javac] /zonestorage/hudson_solaris/home/hudson/hudson-slave/workspace/ZooKeeper_branch34_solaris/trunk/src/java/main/org/apache/zookeeper/server/quorum/QuorumPeer.java:686: warning: [deprecation] org.apache.zookeeper.server.quorum.AuthFastLeaderElection in org.apache.zookeeper.server.quorum has been deprecated
[javac] le = new AuthFastLeaderElection(this, true);
[javac] ^
[javac] /zonestorage/hudson_solaris/home/hudson/hudson-slave/workspace/ZooKeeper_branch34_solaris/trunk/src/java/main/org/apache/zookeeper/server/quorum/QuorumPeer.java:707: warning: [deprecation] org.apache.zookeeper.server.quorum.LeaderElection in org.apache.zookeeper.server.quorum has been deprecated
[javac] electionAlg = new LeaderElection(this);
[javac] ^
[javac] 5 warnings
jar:
BUILD FAILED
/zonestorage/hudson_solaris/home/hudson/hudson-slave/workspace/ZooKeeper_branch34_solaris/trunk/build.xml:541: Execute failed: java.io.IOException: Cannot run program "hostname": error=12, Not enough space
at java.lang.ProcessBuilder.start(ProcessBuilder.java:460)
at java.lang.Runtime.exec(Runtime.java:593)
at org.apache.tools.ant.taskdefs.Execute$Java13CommandLauncher.exec(Execute.java:862)
at org.apache.tools.ant.taskdefs.Execute.launch(Execute.java:481)
at org.apache.tools.ant.taskdefs.Execute.execute(Execute.java:495)
at org.apache.tools.ant.taskdefs.ExecTask.runExecute(ExecTask.java:631)
at org.apache.tools.ant.taskdefs.ExecTask.runExec(ExecTask.java:672)
at org.apache.tools.ant.taskdefs.ExecTask.execute(ExecTask.java:498)
at org.apache.tools.ant.UnknownElement.execute(UnknownElement.java:291)
at sun.reflect.GeneratedMethodAccessor4.invoke(Unknown Source)
at sun.reflect.DelegatingMethodAccessorImpl.invoke(DelegatingMethodAccessorImpl.java:25)
at java.lang.reflect.Method.invoke(Method.java:597)
at org.apache.tools.ant.dispatch.DispatchUtils.execute(DispatchUtils.java:106)
at org.apache.tools.ant.Task.perform(Task.java:348)
at org.apache.tools.ant.Target.execute(Target.java:390)
at org.apache.tools.ant.Target.performTasks(Target.java:411)
at org.apache.tools.ant.Project.executeSortedTargets(Project.java:1399)
at org.apache.tools.ant.Project.executeTarget(Project.java:1368)
at org.apache.tools.ant.helper.DefaultExecutor.executeTargets(DefaultExecutor.java:41)
at org.apache.tools.ant.Project.executeTargets(Project.java:1251)
at org.apache.tools.ant.Main.runBuild(Main.java:809)
at org.apache.tools.ant.Main.startAnt(Main.java:217)
at org.apache.tools.ant.launch.Launcher.run(Launcher.java:280)
at org.apache.tools.ant.launch.Launcher.main(Launcher.java:109)
Caused by: java.io.IOException: error=12, Not enough space
at java.lang.UNIXProcess.forkAndExec(Native Method)
at java.lang.UNIXProcess.<init>(UNIXProcess.java:53)
at java.lang.ProcessImpl.start(ProcessImpl.java:65)
at java.lang.ProcessBuilder.start(ProcessBuilder.java:453)
... 23 more
Total time: 1 minute 39 seconds
Build step 'Invoke Ant' marked build as failure
[locks-and-latches] Releasing all the locks
[locks-and-latches] All the locks released
Recording test results
ERROR: Step ?Publish JUnit test result report? failed: No test report files were found. Configuration error?
Email was triggered for: Failure - Any
Sending email for trigger: Failure - Any
###################################################################################
############################## FAILED TESTS (if any) ##############################
No tests ran.
ZooKeeper_branch34_solaris - Build # 1225 - Still Failing
Posted by Apache Jenkins Server <je...@builds.apache.org>.
See https://builds.apache.org/job/ZooKeeper_branch34_solaris/1225/
###################################################################################
########################## LAST 60 LINES OF THE CONSOLE ###########################
[...truncated 181585 lines...]
[junit] 2016-07-22 14:11:13,413 [myid:] - INFO [main:JMXEnv@246] - expect:StandaloneServer_port
[junit] 2016-07-22 14:11:13,413 [myid:] - INFO [main:JMXEnv@250] - found:StandaloneServer_port org.apache.ZooKeeperService:name0=StandaloneServer_port11221
[junit] 2016-07-22 14:11:13,413 [myid:] - INFO [main:ClientBase@490] - STOPPING server
[junit] 2016-07-22 14:11:13,414 [myid:] - INFO [main:ZooKeeperServer@469] - shutting down
[junit] 2016-07-22 14:11:13,414 [myid:] - INFO [main:SessionTrackerImpl@225] - Shutting down
[junit] 2016-07-22 14:11:13,414 [myid:] - INFO [main:PrepRequestProcessor@765] - Shutting down
[junit] 2016-07-22 14:11:13,414 [myid:] - INFO [main:SyncRequestProcessor@209] - Shutting down
[junit] 2016-07-22 14:11:13,414 [myid:] - INFO [ProcessThread(sid:0 cport:11221)::PrepRequestProcessor@143] - PrepRequestProcessor exited loop!
[junit] 2016-07-22 14:11:13,415 [myid:] - INFO [SyncThread:0:SyncRequestProcessor@187] - SyncRequestProcessor exited!
[junit] 2016-07-22 14:11:13,415 [myid:] - INFO [main:FinalRequestProcessor@402] - shutdown of request processor complete
[junit] 2016-07-22 14:11:13,415 [myid:] - INFO [main:FourLetterWordMain@62] - connecting to 127.0.0.1 11221
[junit] 2016-07-22 14:11:13,416 [myid:] - INFO [main:JMXEnv@146] - ensureOnly:[]
[junit] 2016-07-22 14:11:13,417 [myid:] - INFO [main:ClientBase@443] - STARTING server
[junit] 2016-07-22 14:11:13,417 [myid:] - INFO [main:ClientBase@364] - CREATING server instance 127.0.0.1:11221
[junit] 2016-07-22 14:11:13,417 [myid:] - INFO [main:NIOServerCnxnFactory@89] - binding to port 0.0.0.0/0.0.0.0:11221
[junit] 2016-07-22 14:11:13,418 [myid:] - INFO [main:ClientBase@339] - STARTING server instance 127.0.0.1:11221
[junit] 2016-07-22 14:11:13,418 [myid:] - INFO [main:ZooKeeperServer@170] - Created server with tickTime 3000 minSessionTimeout 6000 maxSessionTimeout 60000 datadir /zonestorage/hudson_solaris/home/hudson/hudson-slave/workspace/ZooKeeper_branch34_solaris/trunk/build/test/tmp/test6789559231591091284.junit.dir/version-2 snapdir /zonestorage/hudson_solaris/home/hudson/hudson-slave/workspace/ZooKeeper_branch34_solaris/trunk/build/test/tmp/test6789559231591091284.junit.dir/version-2
[junit] 2016-07-22 14:11:13,421 [myid:] - INFO [main:FourLetterWordMain@62] - connecting to 127.0.0.1 11221
[junit] 2016-07-22 14:11:13,422 [myid:] - INFO [NIOServerCxn.Factory:0.0.0.0/0.0.0.0:11221:NIOServerCnxnFactory@192] - Accepted socket connection from /127.0.0.1:54999
[junit] 2016-07-22 14:11:13,422 [myid:] - INFO [NIOServerCxn.Factory:0.0.0.0/0.0.0.0:11221:NIOServerCnxn@827] - Processing stat command from /127.0.0.1:54999
[junit] 2016-07-22 14:11:13,422 [myid:] - INFO [Thread-5:NIOServerCnxn$StatCommand@663] - Stat command output
[junit] 2016-07-22 14:11:13,423 [myid:] - INFO [Thread-5:NIOServerCnxn@1008] - Closed socket connection for client /127.0.0.1:54999 (no session established for client)
[junit] 2016-07-22 14:11:13,423 [myid:] - INFO [main:JMXEnv@229] - ensureParent:[InMemoryDataTree, StandaloneServer_port]
[junit] 2016-07-22 14:11:13,424 [myid:] - INFO [main:JMXEnv@246] - expect:InMemoryDataTree
[junit] 2016-07-22 14:11:13,424 [myid:] - INFO [main:JMXEnv@250] - found:InMemoryDataTree org.apache.ZooKeeperService:name0=StandaloneServer_port11221,name1=InMemoryDataTree
[junit] 2016-07-22 14:11:13,425 [myid:] - INFO [main:JMXEnv@246] - expect:StandaloneServer_port
[junit] 2016-07-22 14:11:13,425 [myid:] - INFO [main:JMXEnv@250] - found:StandaloneServer_port org.apache.ZooKeeperService:name0=StandaloneServer_port11221
[junit] 2016-07-22 14:11:13,425 [myid:] - INFO [main:JUnit4ZKTestRunner$LoggedInvokeMethod@58] - Memory used 9197
[junit] 2016-07-22 14:11:13,425 [myid:] - INFO [main:JUnit4ZKTestRunner$LoggedInvokeMethod@63] - Number of threads 20
[junit] 2016-07-22 14:11:13,425 [myid:] - INFO [main:JUnit4ZKTestRunner$LoggedInvokeMethod@78] - FINISHED TEST METHOD testQuota
[junit] 2016-07-22 14:11:13,425 [myid:] - INFO [main:ClientBase@520] - tearDown starting
[junit] 2016-07-22 14:11:13,542 [myid:] - INFO [main:ZooKeeper@684] - Session: 0x15612f21d270000 closed
[junit] 2016-07-22 14:11:13,542 [myid:] - INFO [main-EventThread:ClientCnxn$EventThread@519] - EventThread shut down for session: 0x15612f21d270000
[junit] 2016-07-22 14:11:13,542 [myid:] - INFO [main:ClientBase@490] - STOPPING server
[junit] 2016-07-22 14:11:13,544 [myid:] - INFO [main:ZooKeeperServer@469] - shutting down
[junit] 2016-07-22 14:11:13,544 [myid:] - INFO [main:SessionTrackerImpl@225] - Shutting down
[junit] 2016-07-22 14:11:13,544 [myid:] - INFO [main:PrepRequestProcessor@765] - Shutting down
[junit] 2016-07-22 14:11:13,544 [myid:] - INFO [main:SyncRequestProcessor@209] - Shutting down
[junit] 2016-07-22 14:11:13,544 [myid:] - INFO [ProcessThread(sid:0 cport:11221)::PrepRequestProcessor@143] - PrepRequestProcessor exited loop!
[junit] 2016-07-22 14:11:13,544 [myid:] - INFO [SyncThread:0:SyncRequestProcessor@187] - SyncRequestProcessor exited!
[junit] 2016-07-22 14:11:13,545 [myid:] - INFO [main:FinalRequestProcessor@402] - shutdown of request processor complete
[junit] 2016-07-22 14:11:13,545 [myid:] - INFO [main:FourLetterWordMain@62] - connecting to 127.0.0.1 11221
[junit] 2016-07-22 14:11:13,546 [myid:] - INFO [main:JMXEnv@146] - ensureOnly:[]
[junit] 2016-07-22 14:11:13,663 [myid:] - INFO [main:ClientBase@545] - fdcount after test is: 38 at start it was 28
[junit] 2016-07-22 14:11:13,663 [myid:] - INFO [main:ClientBase@547] - sleeping for 20 secs
[junit] 2016-07-22 14:11:13,683 [myid:] - INFO [main:ZKTestCase$1@60] - SUCCEEDED testQuota
[junit] 2016-07-22 14:11:13,683 [myid:] - INFO [main:ZKTestCase$1@55] - FINISHED testQuota
[junit] Tests run: 1, Failures: 0, Errors: 0, Time elapsed: 10.742 sec
BUILD FAILED
/zonestorage/hudson_solaris/home/hudson/hudson-slave/workspace/ZooKeeper_branch34_solaris/trunk/build.xml:1320: Tests failed!
Total time: 44 minutes 35 seconds
Build step 'Invoke Ant' marked build as failure
[locks-and-latches] Releasing all the locks
[locks-and-latches] All the locks released
Recording test results
Email was triggered for: Failure - Any
Sending email for trigger: Failure - Any
###################################################################################
############################## FAILED TESTS (if any) ##############################
1 tests failed.
FAILED: org.apache.zookeeper.test.FLENewEpochTest.testLENewEpoch
Error Message:
First leader election failed
Stack Trace:
junit.framework.AssertionFailedError: First leader election failed
at org.apache.zookeeper.test.FLENewEpochTest.testLENewEpoch(FLENewEpochTest.java:174)
at org.apache.zookeeper.JUnit4ZKTestRunner$LoggedInvokeMethod.evaluate(JUnit4ZKTestRunner.java:55)
ZooKeeper_branch34_solaris - Build # 1224 - Still Failing
Posted by Apache Jenkins Server <je...@builds.apache.org>.
See https://builds.apache.org/job/ZooKeeper_branch34_solaris/1224/
###################################################################################
########################## LAST 60 LINES OF THE CONSOLE ###########################
[...truncated 157653 lines...]
[junit] 2016-07-21 14:04:10,961 [myid:] - INFO [main:JMXEnv@246] - expect:StandaloneServer_port
[junit] 2016-07-21 14:04:10,961 [myid:] - INFO [main:JMXEnv@250] - found:StandaloneServer_port org.apache.ZooKeeperService:name0=StandaloneServer_port11221
[junit] 2016-07-21 14:04:10,961 [myid:] - INFO [main:ClientBase@490] - STOPPING server
[junit] 2016-07-21 14:04:10,964 [myid:] - INFO [main:ZooKeeperServer@469] - shutting down
[junit] 2016-07-21 14:04:10,964 [myid:] - INFO [main:SessionTrackerImpl@225] - Shutting down
[junit] 2016-07-21 14:04:10,964 [myid:] - INFO [main:PrepRequestProcessor@765] - Shutting down
[junit] 2016-07-21 14:04:10,965 [myid:] - INFO [main:SyncRequestProcessor@209] - Shutting down
[junit] 2016-07-21 14:04:10,965 [myid:] - INFO [ProcessThread(sid:0 cport:11221)::PrepRequestProcessor@143] - PrepRequestProcessor exited loop!
[junit] 2016-07-21 14:04:10,965 [myid:] - INFO [SyncThread:0:SyncRequestProcessor@187] - SyncRequestProcessor exited!
[junit] 2016-07-21 14:04:10,965 [myid:] - INFO [main:FinalRequestProcessor@402] - shutdown of request processor complete
[junit] 2016-07-21 14:04:10,965 [myid:] - INFO [main:FourLetterWordMain@62] - connecting to 127.0.0.1 11221
[junit] 2016-07-21 14:04:10,966 [myid:] - INFO [main:JMXEnv@146] - ensureOnly:[]
[junit] 2016-07-21 14:04:10,967 [myid:] - INFO [main:ClientBase@443] - STARTING server
[junit] 2016-07-21 14:04:10,967 [myid:] - INFO [main:ClientBase@364] - CREATING server instance 127.0.0.1:11221
[junit] 2016-07-21 14:04:10,967 [myid:] - INFO [main:NIOServerCnxnFactory@89] - binding to port 0.0.0.0/0.0.0.0:11221
[junit] 2016-07-21 14:04:10,967 [myid:] - INFO [main:ClientBase@339] - STARTING server instance 127.0.0.1:11221
[junit] 2016-07-21 14:04:10,968 [myid:] - INFO [main:ZooKeeperServer@170] - Created server with tickTime 3000 minSessionTimeout 6000 maxSessionTimeout 60000 datadir /zonestorage/hudson_solaris/home/hudson/hudson-slave/workspace/ZooKeeper_branch34_solaris/trunk/build/test/tmp/test6079422165602243746.junit.dir/version-2 snapdir /zonestorage/hudson_solaris/home/hudson/hudson-slave/workspace/ZooKeeper_branch34_solaris/trunk/build/test/tmp/test6079422165602243746.junit.dir/version-2
[junit] 2016-07-21 14:04:10,970 [myid:] - INFO [main:FourLetterWordMain@62] - connecting to 127.0.0.1 11221
[junit] 2016-07-21 14:04:10,971 [myid:] - INFO [NIOServerCxn.Factory:0.0.0.0/0.0.0.0:11221:NIOServerCnxnFactory@192] - Accepted socket connection from /127.0.0.1:50323
[junit] 2016-07-21 14:04:10,971 [myid:] - INFO [NIOServerCxn.Factory:0.0.0.0/0.0.0.0:11221:NIOServerCnxn@827] - Processing stat command from /127.0.0.1:50323
[junit] 2016-07-21 14:04:10,971 [myid:] - INFO [Thread-5:NIOServerCnxn$StatCommand@663] - Stat command output
[junit] 2016-07-21 14:04:10,972 [myid:] - INFO [Thread-5:NIOServerCnxn@1008] - Closed socket connection for client /127.0.0.1:50323 (no session established for client)
[junit] 2016-07-21 14:04:10,972 [myid:] - INFO [main:JMXEnv@229] - ensureParent:[InMemoryDataTree, StandaloneServer_port]
[junit] 2016-07-21 14:04:10,973 [myid:] - INFO [main:JMXEnv@246] - expect:InMemoryDataTree
[junit] 2016-07-21 14:04:10,973 [myid:] - INFO [main:JMXEnv@250] - found:InMemoryDataTree org.apache.ZooKeeperService:name0=StandaloneServer_port11221,name1=InMemoryDataTree
[junit] 2016-07-21 14:04:10,973 [myid:] - INFO [main:JMXEnv@246] - expect:StandaloneServer_port
[junit] 2016-07-21 14:04:10,973 [myid:] - INFO [main:JMXEnv@250] - found:StandaloneServer_port org.apache.ZooKeeperService:name0=StandaloneServer_port11221
[junit] 2016-07-21 14:04:10,974 [myid:] - INFO [main:JUnit4ZKTestRunner$LoggedInvokeMethod@58] - Memory used 8698
[junit] 2016-07-21 14:04:10,974 [myid:] - INFO [main:JUnit4ZKTestRunner$LoggedInvokeMethod@63] - Number of threads 20
[junit] 2016-07-21 14:04:10,974 [myid:] - INFO [main:JUnit4ZKTestRunner$LoggedInvokeMethod@78] - FINISHED TEST METHOD testQuota
[junit] 2016-07-21 14:04:10,974 [myid:] - INFO [main:ClientBase@520] - tearDown starting
[junit] 2016-07-21 14:04:11,052 [myid:] - INFO [main:ZooKeeper@684] - Session: 0x1560dc547800000 closed
[junit] 2016-07-21 14:04:11,052 [myid:] - INFO [main-EventThread:ClientCnxn$EventThread@519] - EventThread shut down for session: 0x1560dc547800000
[junit] 2016-07-21 14:04:11,052 [myid:] - INFO [main:ClientBase@490] - STOPPING server
[junit] 2016-07-21 14:04:11,054 [myid:] - INFO [main:ZooKeeperServer@469] - shutting down
[junit] 2016-07-21 14:04:11,054 [myid:] - INFO [main:SessionTrackerImpl@225] - Shutting down
[junit] 2016-07-21 14:04:11,054 [myid:] - INFO [main:PrepRequestProcessor@765] - Shutting down
[junit] 2016-07-21 14:04:11,054 [myid:] - INFO [main:SyncRequestProcessor@209] - Shutting down
[junit] 2016-07-21 14:04:11,054 [myid:] - INFO [ProcessThread(sid:0 cport:11221)::PrepRequestProcessor@143] - PrepRequestProcessor exited loop!
[junit] 2016-07-21 14:04:11,054 [myid:] - INFO [SyncThread:0:SyncRequestProcessor@187] - SyncRequestProcessor exited!
[junit] 2016-07-21 14:04:11,055 [myid:] - INFO [main:FinalRequestProcessor@402] - shutdown of request processor complete
[junit] 2016-07-21 14:04:11,055 [myid:] - INFO [main:FourLetterWordMain@62] - connecting to 127.0.0.1 11221
[junit] 2016-07-21 14:04:11,056 [myid:] - INFO [main:JMXEnv@146] - ensureOnly:[]
[junit] 2016-07-21 14:04:11,062 [myid:] - INFO [main:ClientBase@545] - fdcount after test is: 42 at start it was 28
[junit] 2016-07-21 14:04:11,062 [myid:] - INFO [main:ClientBase@547] - sleeping for 20 secs
[junit] 2016-07-21 14:04:11,063 [myid:] - INFO [main:ZKTestCase$1@60] - SUCCEEDED testQuota
[junit] 2016-07-21 14:04:11,063 [myid:] - INFO [main:ZKTestCase$1@55] - FINISHED testQuota
[junit] Tests run: 1, Failures: 0, Errors: 0, Time elapsed: 3.559 sec
BUILD FAILED
/zonestorage/hudson_solaris/home/hudson/hudson-slave/workspace/ZooKeeper_branch34_solaris/trunk/build.xml:1320: Tests failed!
Total time: 38 minutes 30 seconds
Build step 'Invoke Ant' marked build as failure
[locks-and-latches] Releasing all the locks
[locks-and-latches] All the locks released
Recording test results
Email was triggered for: Failure - Any
Sending email for trigger: Failure - Any
###################################################################################
############################## FAILED TESTS (if any) ##############################
7 tests failed.
FAILED: org.apache.zookeeper.server.quorum.QuorumPeerMainTest.testUpdatingEpoch
Error Message:
Waiting too long
Stack Trace:
java.lang.RuntimeException: Waiting too long
at org.apache.zookeeper.server.quorum.QuorumPeerMainTest.waitForAll(QuorumPeerMainTest.java:348)
at org.apache.zookeeper.server.quorum.QuorumPeerMainTest.testUpdatingEpoch(QuorumPeerMainTest.java:743)
at org.apache.zookeeper.JUnit4ZKTestRunner$LoggedInvokeMethod.evaluate(JUnit4ZKTestRunner.java:55)
FAILED: org.apache.zookeeper.server.quorum.QuorumPeerMainTest.testNewFollowerRestartAfterNewEpoch
Error Message:
Waiting too long
Stack Trace:
java.lang.RuntimeException: Waiting too long
at org.apache.zookeeper.server.quorum.QuorumPeerMainTest.waitForAll(QuorumPeerMainTest.java:348)
at org.apache.zookeeper.server.quorum.QuorumPeerMainTest.LaunchServers(QuorumPeerMainTest.java:394)
at org.apache.zookeeper.server.quorum.QuorumPeerMainTest.testNewFollowerRestartAfterNewEpoch(QuorumPeerMainTest.java:803)
at org.apache.zookeeper.JUnit4ZKTestRunner$LoggedInvokeMethod.evaluate(JUnit4ZKTestRunner.java:55)
FAILED: org.apache.zookeeper.test.FLENewEpochTest.testLENewEpoch
Error Message:
First leader election failed
Stack Trace:
junit.framework.AssertionFailedError: First leader election failed
at org.apache.zookeeper.test.FLENewEpochTest.testLENewEpoch(FLENewEpochTest.java:174)
at org.apache.zookeeper.JUnit4ZKTestRunner$LoggedInvokeMethod.evaluate(JUnit4ZKTestRunner.java:55)
FAILED: org.apache.zookeeper.test.FourLetterWordsTest.testSetTraceMask
Error Message:
Exception while executing four letter word: stmk2
Stack Trace:
java.io.IOException: Exception while executing four letter word: stmk2
at org.apache.zookeeper.client.FourLetterWordMain.send4LetterWord(FourLetterWordMain.java:86)
at org.apache.zookeeper.client.FourLetterWordMain.send4LetterWord(FourLetterWordMain.java:48)
at org.apache.zookeeper.test.FourLetterWordsTest.sendRequest(FourLetterWordsTest.java:112)
at org.apache.zookeeper.test.FourLetterWordsTest.testSetTraceMask(FourLetterWordsTest.java:211)
at org.apache.zookeeper.JUnit4ZKTestRunner$LoggedInvokeMethod.evaluate(JUnit4ZKTestRunner.java:55)
Caused by: java.net.SocketTimeoutException: Read timed out
at java.net.SocketInputStream.socketRead0(Native Method)
at java.net.SocketInputStream.read(SocketInputStream.java:129)
at sun.nio.cs.StreamDecoder.readBytes(StreamDecoder.java:264)
at sun.nio.cs.StreamDecoder.implRead(StreamDecoder.java:306)
at sun.nio.cs.StreamDecoder.read(StreamDecoder.java:158)
at java.io.InputStreamReader.read(InputStreamReader.java:167)
at java.io.BufferedReader.fill(BufferedReader.java:136)
at java.io.BufferedReader.readLine(BufferedReader.java:299)
at java.io.BufferedReader.readLine(BufferedReader.java:362)
at org.apache.zookeeper.client.FourLetterWordMain.send4LetterWord(FourLetterWordMain.java:81)
FAILED: org.apache.zookeeper.test.LoadFromLogTest.testRestoreWithTransactionErrors
Error Message:
KeeperErrorCode = ConnectionLoss for /invaliddir/test-
Stack Trace:
org.apache.zookeeper.KeeperException$ConnectionLossException: KeeperErrorCode = ConnectionLoss for /invaliddir/test-
at org.apache.zookeeper.KeeperException.create(KeeperException.java:99)
at org.apache.zookeeper.KeeperException.create(KeeperException.java:51)
at org.apache.zookeeper.ZooKeeper.create(ZooKeeper.java:783)
at org.apache.zookeeper.test.LoadFromLogTest.testRestoreWithTransactionErrors(LoadFromLogTest.java:367)
at org.apache.zookeeper.JUnit4ZKTestRunner$LoggedInvokeMethod.evaluate(JUnit4ZKTestRunner.java:55)
FAILED: org.apache.zookeeper.test.LoadFromLogTest.testReloadSnapshotWithMissingParent
Error Message:
Address already in use
Stack Trace:
java.net.BindException: Address already in use
at sun.nio.ch.Net.bind(Native Method)
at sun.nio.ch.ServerSocketChannelImpl.bind(ServerSocketChannelImpl.java:126)
at sun.nio.ch.ServerSocketAdaptor.bind(ServerSocketAdaptor.java:59)
at sun.nio.ch.ServerSocketAdaptor.bind(ServerSocketAdaptor.java:52)
at org.apache.zookeeper.server.NIOServerCnxnFactory.configure(NIOServerCnxnFactory.java:90)
at org.apache.zookeeper.server.ServerCnxnFactory.createFactory(ServerCnxnFactory.java:126)
at org.apache.zookeeper.server.ServerCnxnFactory.createFactory(ServerCnxnFactory.java:119)
at org.apache.zookeeper.test.LoadFromLogTest.testReloadSnapshotWithMissingParent(LoadFromLogTest.java:411)
at org.apache.zookeeper.JUnit4ZKTestRunner$LoggedInvokeMethod.evaluate(JUnit4ZKTestRunner.java:55)
FAILED: org.apache.zookeeper.test.LETest.testLE
Error Message:
Threads didn't join
Stack Trace:
junit.framework.AssertionFailedError: Threads didn't join
at org.apache.zookeeper.test.LETest.testLE(LETest.java:120)
at org.apache.zookeeper.JUnit4ZKTestRunner$LoggedInvokeMethod.evaluate(JUnit4ZKTestRunner.java:55)
ZooKeeper_branch34_solaris - Build # 1223 - Still Failing
Posted by Apache Jenkins Server <je...@builds.apache.org>.
See https://builds.apache.org/job/ZooKeeper_branch34_solaris/1223/
###################################################################################
########################## LAST 60 LINES OF THE CONSOLE ###########################
[...truncated 169692 lines...]
[junit] 2016-07-20 14:51:17,916 [myid:] - INFO [main:ClientBase@490] - STOPPING server
[junit] 2016-07-20 14:51:17,917 [myid:] - INFO [main:ZooKeeperServer@469] - shutting down
[junit] 2016-07-20 14:51:17,917 [myid:] - INFO [main:SessionTrackerImpl@225] - Shutting down
[junit] 2016-07-20 14:51:17,917 [myid:] - INFO [main:PrepRequestProcessor@765] - Shutting down
[junit] 2016-07-20 14:51:17,917 [myid:] - INFO [main:SyncRequestProcessor@209] - Shutting down
[junit] 2016-07-20 14:51:17,917 [myid:] - INFO [ProcessThread(sid:0 cport:11221)::PrepRequestProcessor@143] - PrepRequestProcessor exited loop!
[junit] 2016-07-20 14:51:17,918 [myid:] - INFO [SyncThread:0:SyncRequestProcessor@187] - SyncRequestProcessor exited!
[junit] 2016-07-20 14:51:17,918 [myid:] - INFO [main:FinalRequestProcessor@402] - shutdown of request processor complete
[junit] 2016-07-20 14:51:17,918 [myid:] - INFO [main:FourLetterWordMain@62] - connecting to 127.0.0.1 11221
[junit] 2016-07-20 14:51:17,919 [myid:] - INFO [main:JMXEnv@146] - ensureOnly:[]
[junit] 2016-07-20 14:51:17,919 [myid:] - INFO [main:ClientBase@443] - STARTING server
[junit] 2016-07-20 14:51:17,920 [myid:] - INFO [main:ClientBase@364] - CREATING server instance 127.0.0.1:11221
[junit] 2016-07-20 14:51:17,920 [myid:] - INFO [main:NIOServerCnxnFactory@89] - binding to port 0.0.0.0/0.0.0.0:11221
[junit] 2016-07-20 14:51:17,920 [myid:] - INFO [main:ClientBase@339] - STARTING server instance 127.0.0.1:11221
[junit] 2016-07-20 14:51:17,921 [myid:] - INFO [main:ZooKeeperServer@170] - Created server with tickTime 3000 minSessionTimeout 6000 maxSessionTimeout 60000 datadir /zonestorage/hudson_solaris/home/hudson/hudson-slave/workspace/ZooKeeper_branch34_solaris/trunk/build/test/tmp/test2250417998450653453.junit.dir/version-2 snapdir /zonestorage/hudson_solaris/home/hudson/hudson-slave/workspace/ZooKeeper_branch34_solaris/trunk/build/test/tmp/test2250417998450653453.junit.dir/version-2
[junit] 2016-07-20 14:51:17,923 [myid:] - INFO [main:FourLetterWordMain@62] - connecting to 127.0.0.1 11221
[junit] 2016-07-20 14:51:17,923 [myid:] - INFO [NIOServerCxn.Factory:0.0.0.0/0.0.0.0:11221:NIOServerCnxnFactory@192] - Accepted socket connection from /127.0.0.1:62154
[junit] 2016-07-20 14:51:17,924 [myid:] - INFO [NIOServerCxn.Factory:0.0.0.0/0.0.0.0:11221:NIOServerCnxn@827] - Processing stat command from /127.0.0.1:62154
[junit] 2016-07-20 14:51:17,924 [myid:] - INFO [Thread-5:NIOServerCnxn$StatCommand@663] - Stat command output
[junit] 2016-07-20 14:51:17,924 [myid:] - INFO [Thread-5:NIOServerCnxn@1008] - Closed socket connection for client /127.0.0.1:62154 (no session established for client)
[junit] 2016-07-20 14:51:17,924 [myid:] - INFO [main:JMXEnv@229] - ensureParent:[InMemoryDataTree, StandaloneServer_port]
[junit] 2016-07-20 14:51:17,926 [myid:] - INFO [main:JMXEnv@246] - expect:InMemoryDataTree
[junit] 2016-07-20 14:51:17,926 [myid:] - INFO [main:JMXEnv@250] - found:InMemoryDataTree org.apache.ZooKeeperService:name0=StandaloneServer_port11221,name1=InMemoryDataTree
[junit] 2016-07-20 14:51:17,926 [myid:] - INFO [main:JMXEnv@246] - expect:StandaloneServer_port
[junit] 2016-07-20 14:51:17,926 [myid:] - INFO [main:JMXEnv@250] - found:StandaloneServer_port org.apache.ZooKeeperService:name0=StandaloneServer_port11221
[junit] 2016-07-20 14:51:17,926 [myid:] - INFO [main:JUnit4ZKTestRunner$LoggedInvokeMethod@58] - Memory used 9197
[junit] 2016-07-20 14:51:17,927 [myid:] - INFO [main:JUnit4ZKTestRunner$LoggedInvokeMethod@63] - Number of threads 20
[junit] 2016-07-20 14:51:17,927 [myid:] - INFO [main:JUnit4ZKTestRunner$LoggedInvokeMethod@78] - FINISHED TEST METHOD testQuota
[junit] 2016-07-20 14:51:17,927 [myid:] - INFO [main:ClientBase@520] - tearDown starting
[junit] 2016-07-20 14:51:18,001 [myid:] - INFO [SessionTracker:SessionTrackerImpl@162] - SessionTrackerImpl exited loop!
[junit] 2016-07-20 14:51:18,001 [myid:] - INFO [SessionTracker:SessionTrackerImpl@162] - SessionTrackerImpl exited loop!
[junit] 2016-07-20 14:51:18,011 [myid:] - INFO [main:ZooKeeper@684] - Session: 0x15608ca196a0000 closed
[junit] 2016-07-20 14:51:18,011 [myid:] - INFO [main-EventThread:ClientCnxn$EventThread@519] - EventThread shut down for session: 0x15608ca196a0000
[junit] 2016-07-20 14:51:18,012 [myid:] - INFO [main:ClientBase@490] - STOPPING server
[junit] 2016-07-20 14:51:18,013 [myid:] - INFO [main:ZooKeeperServer@469] - shutting down
[junit] 2016-07-20 14:51:18,013 [myid:] - INFO [main:SessionTrackerImpl@225] - Shutting down
[junit] 2016-07-20 14:51:18,013 [myid:] - INFO [main:PrepRequestProcessor@765] - Shutting down
[junit] 2016-07-20 14:51:18,013 [myid:] - INFO [main:SyncRequestProcessor@209] - Shutting down
[junit] 2016-07-20 14:51:18,013 [myid:] - INFO [ProcessThread(sid:0 cport:11221)::PrepRequestProcessor@143] - PrepRequestProcessor exited loop!
[junit] 2016-07-20 14:51:18,013 [myid:] - INFO [SyncThread:0:SyncRequestProcessor@187] - SyncRequestProcessor exited!
[junit] 2016-07-20 14:51:18,013 [myid:] - INFO [main:FinalRequestProcessor@402] - shutdown of request processor complete
[junit] 2016-07-20 14:51:18,014 [myid:] - INFO [main:FourLetterWordMain@62] - connecting to 127.0.0.1 11221
[junit] 2016-07-20 14:51:18,014 [myid:] - INFO [main:JMXEnv@146] - ensureOnly:[]
[junit] 2016-07-20 14:51:18,018 [myid:] - INFO [main:ClientBase@545] - fdcount after test is: 42 at start it was 28
[junit] 2016-07-20 14:51:18,018 [myid:] - INFO [main:ClientBase@547] - sleeping for 20 secs
[junit] 2016-07-20 14:51:18,019 [myid:] - INFO [main:ZKTestCase$1@60] - SUCCEEDED testQuota
[junit] 2016-07-20 14:51:18,019 [myid:] - INFO [main:ZKTestCase$1@55] - FINISHED testQuota
[junit] Tests run: 1, Failures: 0, Errors: 0, Time elapsed: 0.685 sec
BUILD FAILED
/zonestorage/hudson_solaris/home/hudson/hudson-slave/workspace/ZooKeeper_branch34_solaris/trunk/build.xml:1320: Tests failed!
Total time: 28 minutes 24 seconds
Build step 'Invoke Ant' marked build as failure
[locks-and-latches] Releasing all the locks
[locks-and-latches] All the locks released
Recording test results
Email was triggered for: Failure - Any
Sending email for trigger: Failure - Any
###################################################################################
############################## FAILED TESTS (if any) ##############################
3 tests failed.
FAILED: org.apache.zookeeper.test.LoadFromLogTest.testRestoreWithTransactionErrors
Error Message:
KeeperErrorCode = ConnectionLoss for /invaliddir/test-
Stack Trace:
org.apache.zookeeper.KeeperException$ConnectionLossException: KeeperErrorCode = ConnectionLoss for /invaliddir/test-
at org.apache.zookeeper.KeeperException.create(KeeperException.java:99)
at org.apache.zookeeper.KeeperException.create(KeeperException.java:51)
at org.apache.zookeeper.ZooKeeper.create(ZooKeeper.java:783)
at org.apache.zookeeper.test.LoadFromLogTest.testRestoreWithTransactionErrors(LoadFromLogTest.java:367)
at org.apache.zookeeper.JUnit4ZKTestRunner$LoggedInvokeMethod.evaluate(JUnit4ZKTestRunner.java:55)
FAILED: org.apache.zookeeper.test.LoadFromLogTest.testReloadSnapshotWithMissingParent
Error Message:
Address already in use
Stack Trace:
java.net.BindException: Address already in use
at sun.nio.ch.Net.bind(Native Method)
at sun.nio.ch.ServerSocketChannelImpl.bind(ServerSocketChannelImpl.java:126)
at sun.nio.ch.ServerSocketAdaptor.bind(ServerSocketAdaptor.java:59)
at sun.nio.ch.ServerSocketAdaptor.bind(ServerSocketAdaptor.java:52)
at org.apache.zookeeper.server.NIOServerCnxnFactory.configure(NIOServerCnxnFactory.java:90)
at org.apache.zookeeper.server.ServerCnxnFactory.createFactory(ServerCnxnFactory.java:126)
at org.apache.zookeeper.server.ServerCnxnFactory.createFactory(ServerCnxnFactory.java:119)
at org.apache.zookeeper.test.LoadFromLogTest.testReloadSnapshotWithMissingParent(LoadFromLogTest.java:411)
at org.apache.zookeeper.JUnit4ZKTestRunner$LoggedInvokeMethod.evaluate(JUnit4ZKTestRunner.java:55)
FAILED: org.apache.zookeeper.test.LETest.testLE
Error Message:
Threads didn't join
Stack Trace:
junit.framework.AssertionFailedError: Threads didn't join
at org.apache.zookeeper.test.LETest.testLE(LETest.java:120)
at org.apache.zookeeper.JUnit4ZKTestRunner$LoggedInvokeMethod.evaluate(JUnit4ZKTestRunner.java:55)
ZooKeeper_branch34_solaris - Build # 1222 - Still Failing
Posted by Apache Jenkins Server <je...@builds.apache.org>.
See https://builds.apache.org/job/ZooKeeper_branch34_solaris/1222/
###################################################################################
########################## LAST 60 LINES OF THE CONSOLE ###########################
[...truncated 94 lines...]
[ivy:retrieve] :: retrieving :: org.apache.zookeeper#zookeeper
[ivy:retrieve] confs: [default]
[ivy:retrieve] 5 artifacts copied, 0 already retrieved (1889kB/375ms)
clover.setup:
clover.info:
clover:
jute:
[javac] Compiling 39 source files to /zonestorage/hudson_solaris/home/hudson/hudson-slave/workspace/ZooKeeper_branch34_solaris/trunk/build/classes
[javac] Note: Some input files use unchecked or unsafe operations.
[javac] Note: Recompile with -Xlint:unchecked for details.
compile_jute_uptodate:
compile_jute:
[mkdir] Created dir: /zonestorage/hudson_solaris/home/hudson/hudson-slave/workspace/ZooKeeper_branch34_solaris/trunk/src/java/generated
[mkdir] Created dir: /zonestorage/hudson_solaris/home/hudson/hudson-slave/workspace/ZooKeeper_branch34_solaris/trunk/src/c/generated
[java] ../../zookeeper.jute Parsed Successfully
[java] ../../zookeeper.jute Parsed Successfully
[touch] Creating /zonestorage/hudson_solaris/home/hudson/hudson-slave/workspace/ZooKeeper_branch34_solaris/trunk/src/java/generated/.generated
ver-gen:
[javac] Compiling 1 source file to /zonestorage/hudson_solaris/home/hudson/hudson-slave/workspace/ZooKeeper_branch34_solaris/trunk/build/classes
svn-revision:
[mkdir] Created dir: /zonestorage/hudson_solaris/home/hudson/hudson-slave/workspace/ZooKeeper_branch34_solaris/trunk/.revision
version-info:
build-generated:
[javac] Compiling 56 source files to /zonestorage/hudson_solaris/home/hudson/hudson-slave/workspace/ZooKeeper_branch34_solaris/trunk/build/classes
compile:
[javac] Compiling 157 source files to /zonestorage/hudson_solaris/home/hudson/hudson-slave/workspace/ZooKeeper_branch34_solaris/trunk/build/classes
[javac] /zonestorage/hudson_solaris/home/hudson/hudson-slave/workspace/ZooKeeper_branch34_solaris/trunk/src/java/main/org/apache/zookeeper/Shell.java:276: warning: [serial] serializable class org.apache.zookeeper.Shell.ExitCodeException has no definition of serialVersionUID
[javac] public static class ExitCodeException extends IOException {
[javac] ^
[javac] /zonestorage/hudson_solaris/home/hudson/hudson-slave/workspace/ZooKeeper_branch34_solaris/trunk/src/java/main/org/apache/zookeeper/server/quorum/QuorumPeer.java:680: warning: [deprecation] org.apache.zookeeper.server.quorum.LeaderElection in org.apache.zookeeper.server.quorum has been deprecated
[javac] le = new LeaderElection(this);
[javac] ^
[javac] /zonestorage/hudson_solaris/home/hudson/hudson-slave/workspace/ZooKeeper_branch34_solaris/trunk/src/java/main/org/apache/zookeeper/server/quorum/QuorumPeer.java:683: warning: [deprecation] org.apache.zookeeper.server.quorum.AuthFastLeaderElection in org.apache.zookeeper.server.quorum has been deprecated
[javac] le = new AuthFastLeaderElection(this);
[javac] ^
[javac] /zonestorage/hudson_solaris/home/hudson/hudson-slave/workspace/ZooKeeper_branch34_solaris/trunk/src/java/main/org/apache/zookeeper/server/quorum/QuorumPeer.java:686: warning: [deprecation] org.apache.zookeeper.server.quorum.AuthFastLeaderElection in org.apache.zookeeper.server.quorum has been deprecated
[javac] le = new AuthFastLeaderElection(this, true);
[javac] ^
[javac] /zonestorage/hudson_solaris/home/hudson/hudson-slave/workspace/ZooKeeper_branch34_solaris/trunk/src/java/main/org/apache/zookeeper/server/quorum/QuorumPeer.java:707: warning: [deprecation] org.apache.zookeeper.server.quorum.LeaderElection in org.apache.zookeeper.server.quorum has been deprecated
[javac] electionAlg = new LeaderElection(this);
[javac] ^
Build step 'Invoke Ant' marked build as failure
[locks-and-latches] Releasing all the locks
[locks-and-latches] All the locks released
Recording test results
ERROR: Step ?Publish JUnit test result report? failed: No test report files were found. Configuration error?
Email was triggered for: Failure - Any
Sending email for trigger: Failure - Any
###################################################################################
############################## FAILED TESTS (if any) ##############################
No tests ran.