You are viewing a plain text version of this content. The canonical link for it is here.
Posted to builds@beam.apache.org by Apache Jenkins Server <je...@builds.apache.org> on 2023/02/16 05:53:42 UTC
Build failed in Jenkins: beam_PostCommit_XVR_Samza #2286
See <https://ci-beam.apache.org/job/beam_PostCommit_XVR_Samza/2286/display/redirect>
Changes:
------------------------------------------
[...truncated 869.28 KB...]
Successfully installed apache-beam-2.46.0.dev0
[91mWARNING: Running pip as the 'root' user can result in broken permissions and conflicting behaviour with the system package manager. It is recommended to use a virtual environment instead: https://pip.pypa.io/warnings/venv
[0mRemoving intermediate container fc7bf816bf59
---> 3d7e538a964e
Step 15/32 : RUN pip check || (echo "Container does not include required Beam dependencies or has conflicting dependencies. If Beam dependencies have changed, you need to regenerate base_image_requirements.txt files. See: https://s.apache.org/beam-python-requirements-generate" && exit 1)
---> Running in 796d9077b169
No broken requirements found.
Removing intermediate container 796d9077b169
---> 607d8194ee5e
Step 16/32 : RUN pip freeze --all
---> Running in 95b8525a628f
absl-py==1.4.0
apache-beam @ file:///opt/apache/beam/tars/apache-beam.tar.gz
astunparse==1.6.3
attrs==22.2.0
beautifulsoup4==4.11.2
bs4==0.0.1
cachetools==4.2.4
certifi==2022.12.7
cffi==1.15.1
charset-normalizer==3.0.1
click==8.1.3
cloudpickle==2.2.1
crcmod==1.7
cryptography==39.0.1
Cython==0.29.33
deprecation==2.1.0
dill==0.3.1.1
docker==6.0.1
docopt==0.6.2
exceptiongroup==1.1.0
execnet==1.9.0
fastavro==1.7.1
fasteners==0.18
flatbuffers==23.1.21
freezegun==1.2.2
future==0.18.3
gast==0.4.0
google-api-core==2.11.0
google-api-python-client==2.78.0
google-apitools==0.5.31
google-auth==2.16.0
google-auth-httplib2==0.1.0
google-auth-oauthlib==0.4.6
google-cloud-bigquery==3.5.0
google-cloud-bigquery-storage==2.16.2
google-cloud-bigtable==1.7.3
google-cloud-core==2.3.2
google-cloud-datastore==1.15.5
google-cloud-dlp==3.11.1
google-cloud-language==1.3.2
google-cloud-profiler==3.1.0
google-cloud-pubsub==2.14.1
google-cloud-pubsublite==1.6.0
google-cloud-recommendations-ai==0.7.1
google-cloud-spanner==3.27.1
google-cloud-videointelligence==1.16.3
google-cloud-vision==3.3.1
google-crc32c==1.5.0
google-pasta==0.2.0
google-resumable-media==2.4.1
googleapis-common-protos==1.58.0
greenlet==2.0.2
grpc-google-iam-v1==0.12.6
grpcio==1.51.1
grpcio-status==1.48.2
guppy3==3.1.2
h5py==3.8.0
hdfs==2.7.0
httplib2==0.21.0
hypothesis==6.68.1
idna==3.4
importlib-metadata==6.0.0
iniconfig==2.0.0
joblib==1.2.0
keras==2.11.0
libclang==15.0.6.1
Markdown==3.4.1
MarkupSafe==2.1.2
mmh3==3.0.0
mock==2.0.0
nltk==3.8.1
nose==1.3.7
numpy==1.21.6
oauth2client==4.1.3
oauthlib==3.2.2
objsize==0.6.1
opt-einsum==3.3.0
orjson==3.8.6
overrides==6.5.0
packaging==23.0
pandas==1.3.5
parameterized==0.8.1
pbr==5.11.1
pip==23.0
pluggy==1.0.0
proto-plus==1.22.2
protobuf==3.19.6
psycopg2-binary==2.9.5
py==1.11.0
pyarrow==9.0.0
pyasn1==0.4.8
pyasn1-modules==0.2.8
pycparser==2.21
pydot==1.4.2
PyHamcrest==1.10.1
pymongo==3.13.0
PyMySQL==1.0.2
pyparsing==3.0.9
pytest==7.2.1
pytest-forked==1.6.0
pytest-timeout==2.1.0
pytest-xdist==2.5.0
python-dateutil==2.8.2
python-snappy==0.6.1
pytz==2022.7.1
PyYAML==6.0
regex==2022.10.31
requests==2.28.2
requests-mock==1.10.0
requests-oauthlib==1.3.1
rsa==4.9
scikit-learn==1.0.2
scipy==1.7.3
setuptools==67.3.2
six==1.16.0
sortedcontainers==2.4.0
soupsieve==2.4
SQLAlchemy==1.4.46
sqlparse==0.4.3
tenacity==5.1.5
tensorboard==2.11.2
tensorboard-data-server==0.6.1
tensorboard-plugin-wit==1.8.1
tensorflow==2.11.0
tensorflow-estimator==2.11.0
tensorflow-io-gcs-filesystem==0.30.0
termcolor==2.2.0
testcontainers==3.7.1
threadpoolctl==3.1.0
tomli==2.0.1
tqdm==4.64.1
typing_extensions==4.4.0
uritemplate==4.1.1
urllib3==1.26.14
websocket-client==1.5.1
Werkzeug==2.2.3
wheel==0.38.4
wrapt==1.14.1
zipp==3.13.0
zstandard==0.19.0
Removing intermediate container 95b8525a628f
---> 456a138e6ad9
Step 17/32 : COPY target/LICENSE /opt/apache/beam/
---> 2ce58a225b54
Step 18/32 : COPY target/LICENSE.python /opt/apache/beam/
---> 5f1907c171ca
Step 19/32 : COPY target/NOTICE /opt/apache/beam/
---> a384b162b9e0
Step 20/32 : COPY target/launcher/linux_amd64/boot /opt/apache/beam/
---> 158af305819f
Step 21/32 : ENTRYPOINT ["/opt/apache/beam/boot"]
---> Running in 4eac54ed0e81
Removing intermediate container 4eac54ed0e81
---> db45685f4b45
Step 22/32 : FROM beam as third_party_licenses
---> db45685f4b45
Step 23/32 : ARG pull_licenses
---> Running in 86a20ef6f87e
Removing intermediate container 86a20ef6f87e
---> bd0f334a3376
Step 24/32 : COPY target/license_scripts /tmp/license_scripts/
---> 89717f8f3d90
Step 25/32 : COPY target/LICENSE target/go-licenses/* /opt/apache/beam/third_party_licenses/golang/
---> 663babf59323
Step 26/32 : RUN rm /opt/apache/beam/third_party_licenses/golang/LICENSE
---> Running in eafe461ae58c
Removing intermediate container eafe461ae58c
---> ffd14c8afbff
Step 27/32 : COPY target/license_scripts /tmp/license_scripts/
---> d3516af42fb5
Step 28/32 : RUN if [ "$pull_licenses" = "true" ] ; then pip install 'pip-licenses<4.0.0' pyyaml tenacity && python /tmp/license_scripts/pull_licenses_py.py ; fi
---> Running in 38db38b6ec3d
Collecting pip-licenses<4.0.0
Downloading pip_licenses-3.5.5-py3-none-any.whl (17 kB)
Requirement already satisfied: pyyaml in /usr/local/lib/python3.7/site-packages (6.0)
Requirement already satisfied: tenacity in /usr/local/lib/python3.7/site-packages (5.1.5)
Collecting PTable
Downloading PTable-0.9.2.tar.gz (31 kB)
Preparing metadata (setup.py): started
Preparing metadata (setup.py): finished with status 'done'
Requirement already satisfied: six>=1.9.0 in /usr/local/lib/python3.7/site-packages (from tenacity) (1.16.0)
Building wheels for collected packages: PTable
Building wheel for PTable (setup.py): started
Building wheel for PTable (setup.py): finished with status 'done'
Created wheel for PTable: filename=PTable-0.9.2-py3-none-any.whl size=22908 sha256=a1afee983466fa32584c022991ffd0857b1d0e2b78e9b43b75c27f217e74417e
Stored in directory: /root/.cache/pip/wheels/33/df/2f/674985b3f8a2de3f96357d1eadef5110f74fa91b3785e52a54
Successfully built PTable
Installing collected packages: PTable, pip-licenses
Successfully installed PTable-0.9.2 pip-licenses-3.5.5
[91mWARNING: Running pip as the 'root' user can result in broken permissions and conflicting behaviour with the system package manager. It is recommended to use a virtual environment instead: https://pip.pypa.io/warnings/venv
[0mSkip pulling license for bs4
[91mINFO:root:Successfully pulled licenses for 136 dependencies
[0mRemoving intermediate container 38db38b6ec3d
---> b8342dc90504
Step 29/32 : FROM beam
---> db45685f4b45
Step 30/32 : ARG pull_licenses
---> Running in d52ee138287e
Removing intermediate container d52ee138287e
---> 5e7c5b915ed3
Step 31/32 : COPY --from=third_party_licenses /opt/apache/beam/third_party_licenses /opt/apache/beam/third_party_licenses
---> 879588c4fa09
Step 32/32 : RUN if [ "$pull_licenses" != "true" ] ; then rm -rf /opt/apache/beam/third_party_licenses ; fi
---> Running in b7986774b4df
Removing intermediate container b7986774b4df
---> de23e035e31f
Successfully built de23e035e31f
Successfully tagged apache/beam_python3.7_sdk:2.46.0.dev
FAILURE: Build failed with an exception.
* What went wrong:
Execution failed for task ':sdks:java:container:pullLicenses'.
> Process 'command './license_scripts/license_script.sh'' finished with non-zero exit value 1
* Try:
> Run with --stacktrace option to get the stack trace.
> Run with --info or --debug option to get more log output.
* Get more help at https://help.gradle.org
Deprecated Gradle features were used in this build, making it incompatible with Gradle 8.0.
You can use '--warning-mode all' to show the individual deprecation warnings and determine if they come from your own scripts or plugins.
See https://docs.gradle.org/7.5.1/userguide/command_line_interface.html#sec:command_line_warnings
Execution optimizations have been disabled for 1 invalid unit(s) of work during this build to ensure correctness.
Please consult deprecation warnings for more details.
BUILD FAILED in 11m 7s
252 actionable tasks: 164 executed, 76 from cache, 12 up-to-date
Publishing build scan...
https://gradle.com/s/nppclkmmzti7c
Build step 'Invoke Gradle script' changed build result to FAILURE
Build step 'Invoke Gradle script' marked build as failure
---------------------------------------------------------------------
To unsubscribe, e-mail: builds-unsubscribe@beam.apache.org
For additional commands, e-mail: builds-help@beam.apache.org
Jenkins build is back to normal : beam_PostCommit_XVR_Samza #2289
Posted by Apache Jenkins Server <je...@builds.apache.org>.
See <https://ci-beam.apache.org/job/beam_PostCommit_XVR_Samza/2289/display/redirect?page=changes>
---------------------------------------------------------------------
To unsubscribe, e-mail: builds-unsubscribe@beam.apache.org
For additional commands, e-mail: builds-help@beam.apache.org
Build failed in Jenkins: beam_PostCommit_XVR_Samza #2288
Posted by Apache Jenkins Server <je...@builds.apache.org>.
See <https://ci-beam.apache.org/job/beam_PostCommit_XVR_Samza/2288/display/redirect?page=changes>
Changes:
[noreply] Fix beam.Row.__eq__ for rows with trailing columns (#23876)
[noreply] TFMA notebook showing ExtractEvaluateAndWriteResult Tranfsorm (#25381)
[noreply] Fix whitespace check (#25514)
[noreply] Add back links removed in #24744 (#25513)
------------------------------------------
[...truncated 868.35 KB...]
Successfully installed apache-beam-2.46.0.dev0
[91mWARNING: Running pip as the 'root' user can result in broken permissions and conflicting behaviour with the system package manager. It is recommended to use a virtual environment instead: https://pip.pypa.io/warnings/venv
[0mRemoving intermediate container e04665784291
---> 6ced7333d39c
Step 15/32 : RUN pip check || (echo "Container does not include required Beam dependencies or has conflicting dependencies. If Beam dependencies have changed, you need to regenerate base_image_requirements.txt files. See: https://s.apache.org/beam-python-requirements-generate" && exit 1)
---> Running in 0ea8505cb6c1
No broken requirements found.
Removing intermediate container 0ea8505cb6c1
---> e0e7110ace30
Step 16/32 : RUN pip freeze --all
---> Running in d06ce0cd7151
absl-py==1.4.0
apache-beam @ file:///opt/apache/beam/tars/apache-beam.tar.gz
astunparse==1.6.3
attrs==22.2.0
beautifulsoup4==4.11.2
bs4==0.0.1
cachetools==4.2.4
certifi==2022.12.7
cffi==1.15.1
charset-normalizer==3.0.1
click==8.1.3
cloudpickle==2.2.1
crcmod==1.7
cryptography==39.0.1
Cython==0.29.33
deprecation==2.1.0
dill==0.3.1.1
docker==6.0.1
docopt==0.6.2
exceptiongroup==1.1.0
execnet==1.9.0
fastavro==1.7.1
fasteners==0.18
flatbuffers==23.1.21
freezegun==1.2.2
future==0.18.3
gast==0.4.0
google-api-core==2.11.0
google-api-python-client==2.78.0
google-apitools==0.5.31
google-auth==2.16.0
google-auth-httplib2==0.1.0
google-auth-oauthlib==0.4.6
google-cloud-bigquery==3.5.0
google-cloud-bigquery-storage==2.16.2
google-cloud-bigtable==1.7.3
google-cloud-core==2.3.2
google-cloud-datastore==1.15.5
google-cloud-dlp==3.11.1
google-cloud-language==1.3.2
google-cloud-profiler==3.1.0
google-cloud-pubsub==2.14.1
google-cloud-pubsublite==1.6.0
google-cloud-recommendations-ai==0.7.1
google-cloud-spanner==3.27.1
google-cloud-videointelligence==1.16.3
google-cloud-vision==3.3.1
google-crc32c==1.5.0
google-pasta==0.2.0
google-resumable-media==2.4.1
googleapis-common-protos==1.58.0
greenlet==2.0.2
grpc-google-iam-v1==0.12.6
grpcio==1.51.1
grpcio-status==1.48.2
guppy3==3.1.2
h5py==3.8.0
hdfs==2.7.0
httplib2==0.21.0
hypothesis==6.68.1
idna==3.4
importlib-metadata==6.0.0
iniconfig==2.0.0
joblib==1.2.0
keras==2.11.0
libclang==15.0.6.1
Markdown==3.4.1
MarkupSafe==2.1.2
mmh3==3.0.0
mock==2.0.0
nltk==3.8.1
nose==1.3.7
numpy==1.21.6
oauth2client==4.1.3
oauthlib==3.2.2
objsize==0.6.1
opt-einsum==3.3.0
orjson==3.8.6
overrides==6.5.0
packaging==23.0
pandas==1.3.5
parameterized==0.8.1
pbr==5.11.1
pip==23.0
pluggy==1.0.0
proto-plus==1.22.2
protobuf==3.19.6
psycopg2-binary==2.9.5
py==1.11.0
pyarrow==9.0.0
pyasn1==0.4.8
pyasn1-modules==0.2.8
pycparser==2.21
pydot==1.4.2
PyHamcrest==1.10.1
pymongo==3.13.0
PyMySQL==1.0.2
pyparsing==3.0.9
pytest==7.2.1
pytest-forked==1.6.0
pytest-timeout==2.1.0
pytest-xdist==2.5.0
python-dateutil==2.8.2
python-snappy==0.6.1
pytz==2022.7.1
PyYAML==6.0
regex==2022.10.31
requests==2.28.2
requests-mock==1.10.0
requests-oauthlib==1.3.1
rsa==4.9
scikit-learn==1.0.2
scipy==1.7.3
setuptools==67.3.2
six==1.16.0
sortedcontainers==2.4.0
soupsieve==2.4
SQLAlchemy==1.4.46
sqlparse==0.4.3
tenacity==5.1.5
tensorboard==2.11.2
tensorboard-data-server==0.6.1
tensorboard-plugin-wit==1.8.1
tensorflow==2.11.0
tensorflow-estimator==2.11.0
tensorflow-io-gcs-filesystem==0.30.0
termcolor==2.2.0
testcontainers==3.7.1
threadpoolctl==3.1.0
tomli==2.0.1
tqdm==4.64.1
typing_extensions==4.4.0
uritemplate==4.1.1
urllib3==1.26.14
websocket-client==1.5.1
Werkzeug==2.2.3
wheel==0.38.4
wrapt==1.14.1
zipp==3.13.0
zstandard==0.19.0
Removing intermediate container d06ce0cd7151
---> d342193fcca2
Step 17/32 : COPY target/LICENSE /opt/apache/beam/
---> 016c980de871
Step 18/32 : COPY target/LICENSE.python /opt/apache/beam/
---> f81caf51b395
Step 19/32 : COPY target/NOTICE /opt/apache/beam/
---> de328ff9ddae
Step 20/32 : COPY target/launcher/linux_amd64/boot /opt/apache/beam/
---> 35ce0fc0edb5
Step 21/32 : ENTRYPOINT ["/opt/apache/beam/boot"]
---> Running in 9aa2bca428aa
Removing intermediate container 9aa2bca428aa
---> c130440c56bf
Step 22/32 : FROM beam as third_party_licenses
---> c130440c56bf
Step 23/32 : ARG pull_licenses
---> Running in 73359f794dd5
Removing intermediate container 73359f794dd5
---> 33d183d9827c
Step 24/32 : COPY target/license_scripts /tmp/license_scripts/
---> e2ae36c6f29f
Step 25/32 : COPY target/LICENSE target/go-licenses/* /opt/apache/beam/third_party_licenses/golang/
---> 576a6e4d7f04
Step 26/32 : RUN rm /opt/apache/beam/third_party_licenses/golang/LICENSE
---> Running in 2b1ff103503e
Removing intermediate container 2b1ff103503e
---> 2ef680cb06c2
Step 27/32 : COPY target/license_scripts /tmp/license_scripts/
---> a15397c8a8dc
Step 28/32 : RUN if [ "$pull_licenses" = "true" ] ; then pip install 'pip-licenses<4.0.0' pyyaml tenacity && python /tmp/license_scripts/pull_licenses_py.py ; fi
---> Running in 70864898260c
Collecting pip-licenses<4.0.0
Downloading pip_licenses-3.5.5-py3-none-any.whl (17 kB)
Requirement already satisfied: pyyaml in /usr/local/lib/python3.7/site-packages (6.0)
Requirement already satisfied: tenacity in /usr/local/lib/python3.7/site-packages (5.1.5)
Collecting PTable
Downloading PTable-0.9.2.tar.gz (31 kB)
Preparing metadata (setup.py): started
Preparing metadata (setup.py): finished with status 'done'
Requirement already satisfied: six>=1.9.0 in /usr/local/lib/python3.7/site-packages (from tenacity) (1.16.0)
Building wheels for collected packages: PTable
Building wheel for PTable (setup.py): started
Building wheel for PTable (setup.py): finished with status 'done'
Created wheel for PTable: filename=PTable-0.9.2-py3-none-any.whl size=22908 sha256=2cc39736ce0cda182e9a476ac08efbd682fcf48ffe72d89395152ee6b92fff31
Stored in directory: /root/.cache/pip/wheels/33/df/2f/674985b3f8a2de3f96357d1eadef5110f74fa91b3785e52a54
Successfully built PTable
Installing collected packages: PTable, pip-licenses
Successfully installed PTable-0.9.2 pip-licenses-3.5.5
[91mWARNING: Running pip as the 'root' user can result in broken permissions and conflicting behaviour with the system package manager. It is recommended to use a virtual environment instead: https://pip.pypa.io/warnings/venv
[0mSkip pulling license for bs4
[91mINFO:root:Successfully pulled licenses for 136 dependencies
[0mRemoving intermediate container 70864898260c
---> 61eef272a704
Step 29/32 : FROM beam
---> c130440c56bf
Step 30/32 : ARG pull_licenses
---> Running in fe31adf0386a
Removing intermediate container fe31adf0386a
---> 329bbe189266
Step 31/32 : COPY --from=third_party_licenses /opt/apache/beam/third_party_licenses /opt/apache/beam/third_party_licenses
---> 52dde92a8697
Step 32/32 : RUN if [ "$pull_licenses" != "true" ] ; then rm -rf /opt/apache/beam/third_party_licenses ; fi
---> Running in f57798d56fcf
Removing intermediate container f57798d56fcf
---> 13233be390c5
Successfully built 13233be390c5
Successfully tagged apache/beam_python3.7_sdk:2.46.0.dev
FAILURE: Build failed with an exception.
* What went wrong:
Execution failed for task ':sdks:java:container:pullLicenses'.
> Process 'command './license_scripts/license_script.sh'' finished with non-zero exit value 1
* Try:
> Run with --stacktrace option to get the stack trace.
> Run with --info or --debug option to get more log output.
* Get more help at https://help.gradle.org
Deprecated Gradle features were used in this build, making it incompatible with Gradle 8.0.
You can use '--warning-mode all' to show the individual deprecation warnings and determine if they come from your own scripts or plugins.
See https://docs.gradle.org/7.5.1/userguide/command_line_interface.html#sec:command_line_warnings
Execution optimizations have been disabled for 1 invalid unit(s) of work during this build to ensure correctness.
Please consult deprecation warnings for more details.
BUILD FAILED in 10m 4s
252 actionable tasks: 163 executed, 77 from cache, 12 up-to-date
Publishing build scan...
https://gradle.com/s/rtgbzn6a6orby
Build step 'Invoke Gradle script' changed build result to FAILURE
Build step 'Invoke Gradle script' marked build as failure
---------------------------------------------------------------------
To unsubscribe, e-mail: builds-unsubscribe@beam.apache.org
For additional commands, e-mail: builds-help@beam.apache.org
Build failed in Jenkins: beam_PostCommit_XVR_Samza #2287
Posted by Apache Jenkins Server <je...@builds.apache.org>.
See <https://ci-beam.apache.org/job/beam_PostCommit_XVR_Samza/2287/display/redirect>
Changes:
------------------------------------------
[...truncated 870.00 KB...]
Successfully installed apache-beam-2.46.0.dev0
[91mWARNING: Running pip as the 'root' user can result in broken permissions and conflicting behaviour with the system package manager. It is recommended to use a virtual environment instead: https://pip.pypa.io/warnings/venv
[0mRemoving intermediate container a537386418c6
---> 7148adb29cc9
Step 15/32 : RUN pip check || (echo "Container does not include required Beam dependencies or has conflicting dependencies. If Beam dependencies have changed, you need to regenerate base_image_requirements.txt files. See: https://s.apache.org/beam-python-requirements-generate" && exit 1)
---> Running in 8a552f78d95f
No broken requirements found.
Removing intermediate container 8a552f78d95f
---> d260ef9e518e
Step 16/32 : RUN pip freeze --all
---> Running in 1090f6639d8d
absl-py==1.4.0
apache-beam @ file:///opt/apache/beam/tars/apache-beam.tar.gz
astunparse==1.6.3
attrs==22.2.0
beautifulsoup4==4.11.2
bs4==0.0.1
cachetools==4.2.4
certifi==2022.12.7
cffi==1.15.1
charset-normalizer==3.0.1
click==8.1.3
cloudpickle==2.2.1
crcmod==1.7
cryptography==39.0.1
Cython==0.29.33
deprecation==2.1.0
dill==0.3.1.1
docker==6.0.1
docopt==0.6.2
exceptiongroup==1.1.0
execnet==1.9.0
fastavro==1.7.1
fasteners==0.18
flatbuffers==23.1.21
freezegun==1.2.2
future==0.18.3
gast==0.4.0
google-api-core==2.11.0
google-api-python-client==2.78.0
google-apitools==0.5.31
google-auth==2.16.0
google-auth-httplib2==0.1.0
google-auth-oauthlib==0.4.6
google-cloud-bigquery==3.5.0
google-cloud-bigquery-storage==2.16.2
google-cloud-bigtable==1.7.3
google-cloud-core==2.3.2
google-cloud-datastore==1.15.5
google-cloud-dlp==3.11.1
google-cloud-language==1.3.2
google-cloud-profiler==3.1.0
google-cloud-pubsub==2.14.1
google-cloud-pubsublite==1.6.0
google-cloud-recommendations-ai==0.7.1
google-cloud-spanner==3.27.1
google-cloud-videointelligence==1.16.3
google-cloud-vision==3.3.1
google-crc32c==1.5.0
google-pasta==0.2.0
google-resumable-media==2.4.1
googleapis-common-protos==1.58.0
greenlet==2.0.2
grpc-google-iam-v1==0.12.6
grpcio==1.51.1
grpcio-status==1.48.2
guppy3==3.1.2
h5py==3.8.0
hdfs==2.7.0
httplib2==0.21.0
hypothesis==6.68.1
idna==3.4
importlib-metadata==6.0.0
iniconfig==2.0.0
joblib==1.2.0
keras==2.11.0
libclang==15.0.6.1
Markdown==3.4.1
MarkupSafe==2.1.2
mmh3==3.0.0
mock==2.0.0
nltk==3.8.1
nose==1.3.7
numpy==1.21.6
oauth2client==4.1.3
oauthlib==3.2.2
objsize==0.6.1
opt-einsum==3.3.0
orjson==3.8.6
overrides==6.5.0
packaging==23.0
pandas==1.3.5
parameterized==0.8.1
pbr==5.11.1
pip==23.0
pluggy==1.0.0
proto-plus==1.22.2
protobuf==3.19.6
psycopg2-binary==2.9.5
py==1.11.0
pyarrow==9.0.0
pyasn1==0.4.8
pyasn1-modules==0.2.8
pycparser==2.21
pydot==1.4.2
PyHamcrest==1.10.1
pymongo==3.13.0
PyMySQL==1.0.2
pyparsing==3.0.9
pytest==7.2.1
pytest-forked==1.6.0
pytest-timeout==2.1.0
pytest-xdist==2.5.0
python-dateutil==2.8.2
python-snappy==0.6.1
pytz==2022.7.1
PyYAML==6.0
regex==2022.10.31
requests==2.28.2
requests-mock==1.10.0
requests-oauthlib==1.3.1
rsa==4.9
scikit-learn==1.0.2
scipy==1.7.3
setuptools==67.3.2
six==1.16.0
sortedcontainers==2.4.0
soupsieve==2.4
SQLAlchemy==1.4.46
sqlparse==0.4.3
tenacity==5.1.5
tensorboard==2.11.2
tensorboard-data-server==0.6.1
tensorboard-plugin-wit==1.8.1
tensorflow==2.11.0
tensorflow-estimator==2.11.0
tensorflow-io-gcs-filesystem==0.30.0
termcolor==2.2.0
testcontainers==3.7.1
threadpoolctl==3.1.0
tomli==2.0.1
tqdm==4.64.1
typing_extensions==4.4.0
uritemplate==4.1.1
urllib3==1.26.14
websocket-client==1.5.1
Werkzeug==2.2.3
wheel==0.38.4
wrapt==1.14.1
zipp==3.13.0
zstandard==0.19.0
Removing intermediate container 1090f6639d8d
---> dc3a4ba83949
Step 17/32 : COPY target/LICENSE /opt/apache/beam/
---> 840ee2775c52
Step 18/32 : COPY target/LICENSE.python /opt/apache/beam/
---> 1ca9f5ea704a
Step 19/32 : COPY target/NOTICE /opt/apache/beam/
---> e16efc99408f
Step 20/32 : COPY target/launcher/linux_amd64/boot /opt/apache/beam/
---> 7e26858397e3
Step 21/32 : ENTRYPOINT ["/opt/apache/beam/boot"]
---> Running in 770246da9d6e
Removing intermediate container 770246da9d6e
---> 506f61b5bb75
Step 22/32 : FROM beam as third_party_licenses
---> 506f61b5bb75
Step 23/32 : ARG pull_licenses
---> Running in 45823f185515
Removing intermediate container 45823f185515
---> e1f12a4cb48c
Step 24/32 : COPY target/license_scripts /tmp/license_scripts/
---> ef82e96fef4c
Step 25/32 : COPY target/LICENSE target/go-licenses/* /opt/apache/beam/third_party_licenses/golang/
---> e57347019fe9
Step 26/32 : RUN rm /opt/apache/beam/third_party_licenses/golang/LICENSE
---> Running in d055c31b3c87
Removing intermediate container d055c31b3c87
---> 6f81e595e9c8
Step 27/32 : COPY target/license_scripts /tmp/license_scripts/
---> 9c2617a33f52
Step 28/32 : RUN if [ "$pull_licenses" = "true" ] ; then pip install 'pip-licenses<4.0.0' pyyaml tenacity && python /tmp/license_scripts/pull_licenses_py.py ; fi
---> Running in 47f8eb78fa56
Collecting pip-licenses<4.0.0
Downloading pip_licenses-3.5.5-py3-none-any.whl (17 kB)
Requirement already satisfied: pyyaml in /usr/local/lib/python3.7/site-packages (6.0)
Requirement already satisfied: tenacity in /usr/local/lib/python3.7/site-packages (5.1.5)
Collecting PTable
Downloading PTable-0.9.2.tar.gz (31 kB)
Preparing metadata (setup.py): started
Preparing metadata (setup.py): finished with status 'done'
Requirement already satisfied: six>=1.9.0 in /usr/local/lib/python3.7/site-packages (from tenacity) (1.16.0)
Building wheels for collected packages: PTable
Building wheel for PTable (setup.py): started
Building wheel for PTable (setup.py): finished with status 'done'
Created wheel for PTable: filename=PTable-0.9.2-py3-none-any.whl size=22908 sha256=348a8172ed7c9387a20289dfb42fa1ec3cdcad9bd14e1e9c61aec7d4ddcb2326
Stored in directory: /root/.cache/pip/wheels/33/df/2f/674985b3f8a2de3f96357d1eadef5110f74fa91b3785e52a54
Successfully built PTable
Installing collected packages: PTable, pip-licenses
Successfully installed PTable-0.9.2 pip-licenses-3.5.5
[91mWARNING: Running pip as the 'root' user can result in broken permissions and conflicting behaviour with the system package manager. It is recommended to use a virtual environment instead: https://pip.pypa.io/warnings/venv
[0mSkip pulling license for bs4
[91mINFO:root:Successfully pulled licenses for 136 dependencies
[0mRemoving intermediate container 47f8eb78fa56
---> da88d3887b05
Step 29/32 : FROM beam
---> 506f61b5bb75
Step 30/32 : ARG pull_licenses
---> Running in aab95e0ca78f
Removing intermediate container aab95e0ca78f
---> f7ebbaad62a5
Step 31/32 : COPY --from=third_party_licenses /opt/apache/beam/third_party_licenses /opt/apache/beam/third_party_licenses
---> b27ad90af8fd
Step 32/32 : RUN if [ "$pull_licenses" != "true" ] ; then rm -rf /opt/apache/beam/third_party_licenses ; fi
---> Running in 00f5060760c8
Removing intermediate container 00f5060760c8
---> 6372813fea4a
Successfully built 6372813fea4a
Successfully tagged apache/beam_python3.7_sdk:2.46.0.dev
FAILURE: Build failed with an exception.
* What went wrong:
Execution failed for task ':sdks:java:container:pullLicenses'.
> Process 'command './license_scripts/license_script.sh'' finished with non-zero exit value 1
* Try:
> Run with --stacktrace option to get the stack trace.
> Run with --info or --debug option to get more log output.
* Get more help at https://help.gradle.org
Deprecated Gradle features were used in this build, making it incompatible with Gradle 8.0.
You can use '--warning-mode all' to show the individual deprecation warnings and determine if they come from your own scripts or plugins.
See https://docs.gradle.org/7.5.1/userguide/command_line_interface.html#sec:command_line_warnings
Execution optimizations have been disabled for 1 invalid unit(s) of work during this build to ensure correctness.
Please consult deprecation warnings for more details.
BUILD FAILED in 10m 53s
252 actionable tasks: 164 executed, 76 from cache, 12 up-to-date
Publishing build scan...
https://gradle.com/s/iovjgjntxvuto
Build step 'Invoke Gradle script' changed build result to FAILURE
Build step 'Invoke Gradle script' marked build as failure
---------------------------------------------------------------------
To unsubscribe, e-mail: builds-unsubscribe@beam.apache.org
For additional commands, e-mail: builds-help@beam.apache.org