You are viewing a plain text version of this content. The canonical link for it is here.
Posted to builds@solr.apache.org by Apache Jenkins Server <je...@builds.apache.org> on 2025/08/26 00:43:24 UTC
[JENKINS] Solr » Solr-Test-9.9 - Build # 587 - Still Failing!
Build: https://ci-builds.apache.org/job/Solr/job/Solr-Test-9.9/587/
All tests passed
Build Log:
[...truncated 443 lines...]
BUILD FAILED in 38m 50s
165 actionable tasks: 165 executed
Publishing build scan...
https://develocity.apache.org/s/wqi75aj477olm
Build step 'Invoke Gradle script' changed build result to FAILURE
Build step 'Invoke Gradle script' marked build as failure
Archiving artifacts
Recording test results
[Checks API] No suitable checks publisher found.
Email was triggered for: Failure - Any
Sending email for trigger: Failure - Any
[JENKINS] Solr » Solr-Test-9.9 - Build # 589 - Still Failing!
Posted by Apache Jenkins Server <je...@builds.apache.org>.
Build: https://ci-builds.apache.org/job/Solr/job/Solr-Test-9.9/589/
All tests passed
Build Log:
[...truncated 447 lines...]
BUILD FAILED in 38m 40s
165 actionable tasks: 165 executed
Publishing build scan...
https://develocity.apache.org/s/fojfalam45cro
Build step 'Invoke Gradle script' changed build result to FAILURE
Build step 'Invoke Gradle script' marked build as failure
Archiving artifacts
Recording test results
[Checks API] No suitable checks publisher found.
Email was triggered for: Failure - Any
Sending email for trigger: Failure - Any
[JENKINS] Solr » Solr-Test-9.9 - Build # 588 - Still Failing!
Posted by Apache Jenkins Server <je...@builds.apache.org>.
Build: https://ci-builds.apache.org/job/Solr/job/Solr-Test-9.9/588/
All tests passed
Build Log:
[...truncated 444 lines...]
BUILD FAILED in 38m 25s
165 actionable tasks: 165 executed
Publishing build scan...
https://develocity.apache.org/s/cpsr3cduinzo6
Build step 'Invoke Gradle script' changed build result to FAILURE
Build step 'Invoke Gradle script' marked build as failure
Archiving artifacts
Recording test results
[Checks API] No suitable checks publisher found.
Email was triggered for: Failure - Any
Sending email for trigger: Failure - Any