You are viewing a plain text version of this content. The canonical link for it is here.
Posted to dev@lucene.apache.org by Policeman Jenkins Server <je...@thetaphi.de> on 2013/12/21 02:46:16 UTC
[JENKINS] Lucene-Solr-trunk-Linux (64bit/ibm-j9-jdk7) - Build #
8765 - Failure!
Build: http://jenkins.thetaphi.de/job/Lucene-Solr-trunk-Linux/8765/
Java: 64bit/ibm-j9-jdk7 -Xjit:exclude={org/apache/lucene/util/fst/FST.pack(IIF)Lorg/apache/lucene/util/fst/FST;}
6 tests failed.
REGRESSION: org.apache.solr.analytics.expression.ExpressionTest.absoluteValueTest
Error Message:
Caught exception in getStatResult, xPath = /response/lst[@name='stats']/lst[@name='avr']/double[@name='sum'] raw data: <?xml version="1.0" encoding="UTF-8"?> <response> <lst name="responseHeader"> <int name="status">0</int> <int name="QTime">5</int> </lst> <result name="response" numFound="100" start="0"> </result> <lst name="stats"> <lst name="stats_fields"/> </lst> <lst name="stats"> <lst name="nr"> <double name="c">-100.0</double> <long name="count">100</long> <null name="s"/> <null name="sum"/> </lst> <lst name="dr"> <long name="count">100</long> <null name="mc"/> <null name="mean"/> <null name="su"/> <null name="sum"/> <null name="unique"/> </lst> <lst name="rr"> <str name="max">str9</str> <str name="min">str0</str> <str name="rmax">9rts</str> <str name="rmin">0rts</str> </lst> <lst name="avr"> <double name="c">100.0</double> <long name="count">100</long> <null name="s"/> <null name="sum"/> </lst> <lst name="ar"> <long name="count">100</long> <null name="mcm"/> <null name="mean"/> <null name="median"/> <null name="su"/> <null name="sum"/> <null name="unique"/> </lst> <lst name="csr"> <str name="cs1">this is the first</str> <str name="cs2">this is the second</str> <str name="cs3">this is the third</str> </lst> <lst name="mr"> <long name="count">100</long> <null name="mcm"/> <null name="mean"/> <null name="median"/> <null name="su"/> <null name="sum"/> <null name="unique"/> </lst> <lst name="cr"> <str name="ccmax">this is the secondstr9</str> <str name="ccmin">this is the firststr0</str> <str name="csmax">this is the second</str> <str name="csmin">this is the first</str> <str name="max">str9</str> <str name="min">str0</str> </lst> <lst name="cdr"> <date name="cd1">1800-12-31T23:59:59Z</date> <date name="cd2">1804-06-30T23:59:59Z</date> <str name="cs1">1800-12-31T23:59:59Z</str> <str name="cs2">1804-06-30T23:59:59Z</str> </lst> <lst name="dmr"> <str name="cma">+2MONTHS</str> <str name="cme">+2YEARS</str> <date name="dmma">1812-02-29T23:59:59Z</date> <date name="dmme">1807-12-31T23:59:59Z</date> <date name="max">1811-12-31T23:59:59Z</date> <date name="median">1805-12-31T23:59:59Z</date> </lst> <lst name="pr"> <long name="count">100</long> <double name="mc">1.2729436151389237E146</double> <double name="mean">28.91</double> <double name="su">3.9603293116911423E124</double> <double name="sum">2891.0</double> <long name="unique">36</long> </lst> <lst name="cnr"> <double name="c10">10.0</double> <double name="c8">8.0</double> </lst> </lst> </response>
Stack Trace:
java.lang.AssertionError: Caught exception in getStatResult, xPath = /response/lst[@name='stats']/lst[@name='avr']/double[@name='sum']
raw data: <?xml version="1.0" encoding="UTF-8"?>
<response>
<lst name="responseHeader">
<int name="status">0</int>
<int name="QTime">5</int>
</lst>
<result name="response" numFound="100" start="0">
</result>
<lst name="stats">
<lst name="stats_fields"/>
</lst>
<lst name="stats">
<lst name="nr">
<double name="c">-100.0</double>
<long name="count">100</long>
<null name="s"/>
<null name="sum"/>
</lst>
<lst name="dr">
<long name="count">100</long>
<null name="mc"/>
<null name="mean"/>
<null name="su"/>
<null name="sum"/>
<null name="unique"/>
</lst>
<lst name="rr">
<str name="max">str9</str>
<str name="min">str0</str>
<str name="rmax">9rts</str>
<str name="rmin">0rts</str>
</lst>
<lst name="avr">
<double name="c">100.0</double>
<long name="count">100</long>
<null name="s"/>
<null name="sum"/>
</lst>
<lst name="ar">
<long name="count">100</long>
<null name="mcm"/>
<null name="mean"/>
<null name="median"/>
<null name="su"/>
<null name="sum"/>
<null name="unique"/>
</lst>
<lst name="csr">
<str name="cs1">this is the first</str>
<str name="cs2">this is the second</str>
<str name="cs3">this is the third</str>
</lst>
<lst name="mr">
<long name="count">100</long>
<null name="mcm"/>
<null name="mean"/>
<null name="median"/>
<null name="su"/>
<null name="sum"/>
<null name="unique"/>
</lst>
<lst name="cr">
<str name="ccmax">this is the secondstr9</str>
<str name="ccmin">this is the firststr0</str>
<str name="csmax">this is the second</str>
<str name="csmin">this is the first</str>
<str name="max">str9</str>
<str name="min">str0</str>
</lst>
<lst name="cdr">
<date name="cd1">1800-12-31T23:59:59Z</date>
<date name="cd2">1804-06-30T23:59:59Z</date>
<str name="cs1">1800-12-31T23:59:59Z</str>
<str name="cs2">1804-06-30T23:59:59Z</str>
</lst>
<lst name="dmr">
<str name="cma">+2MONTHS</str>
<str name="cme">+2YEARS</str>
<date name="dmma">1812-02-29T23:59:59Z</date>
<date name="dmme">1807-12-31T23:59:59Z</date>
<date name="max">1811-12-31T23:59:59Z</date>
<date name="median">1805-12-31T23:59:59Z</date>
</lst>
<lst name="pr">
<long name="count">100</long>
<double name="mc">1.2729436151389237E146</double>
<double name="mean">28.91</double>
<double name="su">3.9603293116911423E124</double>
<double name="sum">2891.0</double>
<long name="unique">36</long>
</lst>
<lst name="cnr">
<double name="c10">10.0</double>
<double name="c8">8.0</double>
</lst>
</lst>
</response>
at __randomizedtesting.SeedInfo.seed([F25540B5979677D:2E89741E94E43F1B]:0)
at org.junit.Assert.fail(Assert.java:93)
at org.apache.solr.analytics.AbstractAnalyticsStatsTest.getStatResult(AbstractAnalyticsStatsTest.java:113)
at org.apache.solr.analytics.expression.ExpressionTest.absoluteValueTest(ExpressionTest.java:143)
at sun.reflect.NativeMethodAccessorImpl.invoke0(Native Method)
at sun.reflect.NativeMethodAccessorImpl.invoke(NativeMethodAccessorImpl.java:88)
at sun.reflect.DelegatingMethodAccessorImpl.invoke(DelegatingMethodAccessorImpl.java:55)
at java.lang.reflect.Method.invoke(Method.java:613)
at com.carrotsearch.randomizedtesting.RandomizedRunner.invoke(RandomizedRunner.java:1559)
at com.carrotsearch.randomizedtesting.RandomizedRunner.access$600(RandomizedRunner.java:79)
at com.carrotsearch.randomizedtesting.RandomizedRunner$6.evaluate(RandomizedRunner.java:737)
at com.carrotsearch.randomizedtesting.RandomizedRunner$7.evaluate(RandomizedRunner.java:773)
at com.carrotsearch.randomizedtesting.RandomizedRunner$8.evaluate(RandomizedRunner.java:787)
at com.carrotsearch.randomizedtesting.rules.SystemPropertiesRestoreRule$1.evaluate(SystemPropertiesRestoreRule.java:53)
at org.apache.lucene.util.TestRuleSetupTeardownChained$1.evaluate(TestRuleSetupTeardownChained.java:50)
at org.apache.lucene.util.TestRuleFieldCacheSanity$1.evaluate(TestRuleFieldCacheSanity.java:51)
at org.apache.lucene.util.AbstractBeforeAfterRule$1.evaluate(AbstractBeforeAfterRule.java:46)
at com.carrotsearch.randomizedtesting.rules.SystemPropertiesInvariantRule$1.evaluate(SystemPropertiesInvariantRule.java:55)
at org.apache.lucene.util.TestRuleThreadAndTestName$1.evaluate(TestRuleThreadAndTestName.java:49)
at org.apache.lucene.util.TestRuleIgnoreAfterMaxFailures$1.evaluate(TestRuleIgnoreAfterMaxFailures.java:70)
at org.apache.lucene.util.TestRuleMarkFailure$1.evaluate(TestRuleMarkFailure.java:48)
at com.carrotsearch.randomizedtesting.rules.StatementAdapter.evaluate(StatementAdapter.java:36)
at com.carrotsearch.randomizedtesting.ThreadLeakControl$StatementRunner.run(ThreadLeakControl.java:358)
at com.carrotsearch.randomizedtesting.ThreadLeakControl.forkTimeoutingTask(ThreadLeakControl.java:782)
at com.carrotsearch.randomizedtesting.ThreadLeakControl$3.evaluate(ThreadLeakControl.java:442)
at com.carrotsearch.randomizedtesting.RandomizedRunner.runSingleTest(RandomizedRunner.java:746)
at com.carrotsearch.randomizedtesting.RandomizedRunner$3.evaluate(RandomizedRunner.java:648)
at com.carrotsearch.randomizedtesting.RandomizedRunner$4.evaluate(RandomizedRunner.java:682)
at com.carrotsearch.randomizedtesting.RandomizedRunner$5.evaluate(RandomizedRunner.java:693)
at com.carrotsearch.randomizedtesting.rules.StatementAdapter.evaluate(StatementAdapter.java:36)
at com.carrotsearch.randomizedtesting.rules.SystemPropertiesRestoreRule$1.evaluate(SystemPropertiesRestoreRule.java:53)
at org.apache.lucene.util.AbstractBeforeAfterRule$1.evaluate(AbstractBeforeAfterRule.java:46)
at org.apache.lucene.util.TestRuleStoreClassName$1.evaluate(TestRuleStoreClassName.java:42)
at com.carrotsearch.randomizedtesting.rules.SystemPropertiesInvariantRule$1.evaluate(SystemPropertiesInvariantRule.java:55)
at com.carrotsearch.randomizedtesting.rules.NoShadowingOrOverridesOnMethodsRule$1.evaluate(NoShadowingOrOverridesOnMethodsRule.java:39)
at com.carrotsearch.randomizedtesting.rules.NoShadowingOrOverridesOnMethodsRule$1.evaluate(NoShadowingOrOverridesOnMethodsRule.java:39)
at com.carrotsearch.randomizedtesting.rules.StatementAdapter.evaluate(StatementAdapter.java:36)
at org.apache.lucene.util.TestRuleAssertionsRequired$1.evaluate(TestRuleAssertionsRequired.java:43)
at org.apache.lucene.util.TestRuleMarkFailure$1.evaluate(TestRuleMarkFailure.java:48)
at org.apache.lucene.util.TestRuleIgnoreAfterMaxFailures$1.evaluate(TestRuleIgnoreAfterMaxFailures.java:70)
at org.apache.lucene.util.TestRuleIgnoreTestSuites$1.evaluate(TestRuleIgnoreTestSuites.java:55)
at com.carrotsearch.randomizedtesting.rules.StatementAdapter.evaluate(StatementAdapter.java:36)
at com.carrotsearch.randomizedtesting.ThreadLeakControl$StatementRunner.run(ThreadLeakControl.java:358)
at java.lang.Thread.run(Thread.java:780)
REGRESSION: org.apache.solr.analytics.expression.ExpressionTest.multiplyTest
Error Message:
Caught exception in getStatResult, xPath = /response/lst[@name='stats']/lst[@name='mr']/double[@name='sum'] raw data: <?xml version="1.0" encoding="UTF-8"?> <response> <lst name="responseHeader"> <int name="status">0</int> <int name="QTime">5</int> </lst> <result name="response" numFound="100" start="0"> </result> <lst name="stats"> <lst name="stats_fields"/> </lst> <lst name="stats"> <lst name="nr"> <double name="c">-100.0</double> <long name="count">100</long> <null name="s"/> <null name="sum"/> </lst> <lst name="dr"> <long name="count">100</long> <null name="mc"/> <null name="mean"/> <null name="su"/> <null name="sum"/> <null name="unique"/> </lst> <lst name="rr"> <str name="max">str9</str> <str name="min">str0</str> <str name="rmax">9rts</str> <str name="rmin">0rts</str> </lst> <lst name="avr"> <double name="c">100.0</double> <long name="count">100</long> <null name="s"/> <null name="sum"/> </lst> <lst name="ar"> <long name="count">100</long> <null name="mcm"/> <null name="mean"/> <null name="median"/> <null name="su"/> <null name="sum"/> <null name="unique"/> </lst> <lst name="csr"> <str name="cs1">this is the first</str> <str name="cs2">this is the second</str> <str name="cs3">this is the third</str> </lst> <lst name="mr"> <long name="count">100</long> <null name="mcm"/> <null name="mean"/> <null name="median"/> <null name="su"/> <null name="sum"/> <null name="unique"/> </lst> <lst name="cr"> <str name="ccmax">this is the secondstr9</str> <str name="ccmin">this is the firststr0</str> <str name="csmax">this is the second</str> <str name="csmin">this is the first</str> <str name="max">str9</str> <str name="min">str0</str> </lst> <lst name="cdr"> <date name="cd1">1800-12-31T23:59:59Z</date> <date name="cd2">1804-06-30T23:59:59Z</date> <str name="cs1">1800-12-31T23:59:59Z</str> <str name="cs2">1804-06-30T23:59:59Z</str> </lst> <lst name="dmr"> <str name="cma">+2MONTHS</str> <str name="cme">+2YEARS</str> <date name="dmma">1812-02-29T23:59:59Z</date> <date name="dmme">1807-12-31T23:59:59Z</date> <date name="max">1811-12-31T23:59:59Z</date> <date name="median">1805-12-31T23:59:59Z</date> </lst> <lst name="pr"> <long name="count">100</long> <double name="mc">1.2729436151389237E146</double> <double name="mean">28.91</double> <double name="su">3.9603293116911423E124</double> <double name="sum">2891.0</double> <long name="unique">36</long> </lst> <lst name="cnr"> <double name="c10">10.0</double> <double name="c8">8.0</double> </lst> </lst> </response>
Stack Trace:
java.lang.AssertionError: Caught exception in getStatResult, xPath = /response/lst[@name='stats']/lst[@name='mr']/double[@name='sum']
raw data: <?xml version="1.0" encoding="UTF-8"?>
<response>
<lst name="responseHeader">
<int name="status">0</int>
<int name="QTime">5</int>
</lst>
<result name="response" numFound="100" start="0">
</result>
<lst name="stats">
<lst name="stats_fields"/>
</lst>
<lst name="stats">
<lst name="nr">
<double name="c">-100.0</double>
<long name="count">100</long>
<null name="s"/>
<null name="sum"/>
</lst>
<lst name="dr">
<long name="count">100</long>
<null name="mc"/>
<null name="mean"/>
<null name="su"/>
<null name="sum"/>
<null name="unique"/>
</lst>
<lst name="rr">
<str name="max">str9</str>
<str name="min">str0</str>
<str name="rmax">9rts</str>
<str name="rmin">0rts</str>
</lst>
<lst name="avr">
<double name="c">100.0</double>
<long name="count">100</long>
<null name="s"/>
<null name="sum"/>
</lst>
<lst name="ar">
<long name="count">100</long>
<null name="mcm"/>
<null name="mean"/>
<null name="median"/>
<null name="su"/>
<null name="sum"/>
<null name="unique"/>
</lst>
<lst name="csr">
<str name="cs1">this is the first</str>
<str name="cs2">this is the second</str>
<str name="cs3">this is the third</str>
</lst>
<lst name="mr">
<long name="count">100</long>
<null name="mcm"/>
<null name="mean"/>
<null name="median"/>
<null name="su"/>
<null name="sum"/>
<null name="unique"/>
</lst>
<lst name="cr">
<str name="ccmax">this is the secondstr9</str>
<str name="ccmin">this is the firststr0</str>
<str name="csmax">this is the second</str>
<str name="csmin">this is the first</str>
<str name="max">str9</str>
<str name="min">str0</str>
</lst>
<lst name="cdr">
<date name="cd1">1800-12-31T23:59:59Z</date>
<date name="cd2">1804-06-30T23:59:59Z</date>
<str name="cs1">1800-12-31T23:59:59Z</str>
<str name="cs2">1804-06-30T23:59:59Z</str>
</lst>
<lst name="dmr">
<str name="cma">+2MONTHS</str>
<str name="cme">+2YEARS</str>
<date name="dmma">1812-02-29T23:59:59Z</date>
<date name="dmme">1807-12-31T23:59:59Z</date>
<date name="max">1811-12-31T23:59:59Z</date>
<date name="median">1805-12-31T23:59:59Z</date>
</lst>
<lst name="pr">
<long name="count">100</long>
<double name="mc">1.2729436151389237E146</double>
<double name="mean">28.91</double>
<double name="su">3.9603293116911423E124</double>
<double name="sum">2891.0</double>
<long name="unique">36</long>
</lst>
<lst name="cnr">
<double name="c10">10.0</double>
<double name="c8">8.0</double>
</lst>
</lst>
</response>
at __randomizedtesting.SeedInfo.seed([F25540B5979677D:64A44A756C775113]:0)
at org.junit.Assert.fail(Assert.java:93)
at org.apache.solr.analytics.AbstractAnalyticsStatsTest.getStatResult(AbstractAnalyticsStatsTest.java:113)
at org.apache.solr.analytics.expression.ExpressionTest.multiplyTest(ExpressionTest.java:92)
at sun.reflect.NativeMethodAccessorImpl.invoke0(Native Method)
at sun.reflect.NativeMethodAccessorImpl.invoke(NativeMethodAccessorImpl.java:88)
at sun.reflect.DelegatingMethodAccessorImpl.invoke(DelegatingMethodAccessorImpl.java:55)
at java.lang.reflect.Method.invoke(Method.java:613)
at com.carrotsearch.randomizedtesting.RandomizedRunner.invoke(RandomizedRunner.java:1559)
at com.carrotsearch.randomizedtesting.RandomizedRunner.access$600(RandomizedRunner.java:79)
at com.carrotsearch.randomizedtesting.RandomizedRunner$6.evaluate(RandomizedRunner.java:737)
at com.carrotsearch.randomizedtesting.RandomizedRunner$7.evaluate(RandomizedRunner.java:773)
at com.carrotsearch.randomizedtesting.RandomizedRunner$8.evaluate(RandomizedRunner.java:787)
at com.carrotsearch.randomizedtesting.rules.SystemPropertiesRestoreRule$1.evaluate(SystemPropertiesRestoreRule.java:53)
at org.apache.lucene.util.TestRuleSetupTeardownChained$1.evaluate(TestRuleSetupTeardownChained.java:50)
at org.apache.lucene.util.TestRuleFieldCacheSanity$1.evaluate(TestRuleFieldCacheSanity.java:51)
at org.apache.lucene.util.AbstractBeforeAfterRule$1.evaluate(AbstractBeforeAfterRule.java:46)
at com.carrotsearch.randomizedtesting.rules.SystemPropertiesInvariantRule$1.evaluate(SystemPropertiesInvariantRule.java:55)
at org.apache.lucene.util.TestRuleThreadAndTestName$1.evaluate(TestRuleThreadAndTestName.java:49)
at org.apache.lucene.util.TestRuleIgnoreAfterMaxFailures$1.evaluate(TestRuleIgnoreAfterMaxFailures.java:70)
at org.apache.lucene.util.TestRuleMarkFailure$1.evaluate(TestRuleMarkFailure.java:48)
at com.carrotsearch.randomizedtesting.rules.StatementAdapter.evaluate(StatementAdapter.java:36)
at com.carrotsearch.randomizedtesting.ThreadLeakControl$StatementRunner.run(ThreadLeakControl.java:358)
at com.carrotsearch.randomizedtesting.ThreadLeakControl.forkTimeoutingTask(ThreadLeakControl.java:782)
at com.carrotsearch.randomizedtesting.ThreadLeakControl$3.evaluate(ThreadLeakControl.java:442)
at com.carrotsearch.randomizedtesting.RandomizedRunner.runSingleTest(RandomizedRunner.java:746)
at com.carrotsearch.randomizedtesting.RandomizedRunner$3.evaluate(RandomizedRunner.java:648)
at com.carrotsearch.randomizedtesting.RandomizedRunner$4.evaluate(RandomizedRunner.java:682)
at com.carrotsearch.randomizedtesting.RandomizedRunner$5.evaluate(RandomizedRunner.java:693)
at com.carrotsearch.randomizedtesting.rules.StatementAdapter.evaluate(StatementAdapter.java:36)
at com.carrotsearch.randomizedtesting.rules.SystemPropertiesRestoreRule$1.evaluate(SystemPropertiesRestoreRule.java:53)
at org.apache.lucene.util.AbstractBeforeAfterRule$1.evaluate(AbstractBeforeAfterRule.java:46)
at org.apache.lucene.util.TestRuleStoreClassName$1.evaluate(TestRuleStoreClassName.java:42)
at com.carrotsearch.randomizedtesting.rules.SystemPropertiesInvariantRule$1.evaluate(SystemPropertiesInvariantRule.java:55)
at com.carrotsearch.randomizedtesting.rules.NoShadowingOrOverridesOnMethodsRule$1.evaluate(NoShadowingOrOverridesOnMethodsRule.java:39)
at com.carrotsearch.randomizedtesting.rules.NoShadowingOrOverridesOnMethodsRule$1.evaluate(NoShadowingOrOverridesOnMethodsRule.java:39)
at com.carrotsearch.randomizedtesting.rules.StatementAdapter.evaluate(StatementAdapter.java:36)
at org.apache.lucene.util.TestRuleAssertionsRequired$1.evaluate(TestRuleAssertionsRequired.java:43)
at org.apache.lucene.util.TestRuleMarkFailure$1.evaluate(TestRuleMarkFailure.java:48)
at org.apache.lucene.util.TestRuleIgnoreAfterMaxFailures$1.evaluate(TestRuleIgnoreAfterMaxFailures.java:70)
at org.apache.lucene.util.TestRuleIgnoreTestSuites$1.evaluate(TestRuleIgnoreTestSuites.java:55)
at com.carrotsearch.randomizedtesting.rules.StatementAdapter.evaluate(StatementAdapter.java:36)
at com.carrotsearch.randomizedtesting.ThreadLeakControl$StatementRunner.run(ThreadLeakControl.java:358)
at java.lang.Thread.run(Thread.java:780)
REGRESSION: org.apache.solr.analytics.expression.ExpressionTest.negateTest
Error Message:
Caught exception in getStatResult, xPath = /response/lst[@name='stats']/lst[@name='nr']/double[@name='sum'] raw data: <?xml version="1.0" encoding="UTF-8"?> <response> <lst name="responseHeader"> <int name="status">0</int> <int name="QTime">5</int> </lst> <result name="response" numFound="100" start="0"> </result> <lst name="stats"> <lst name="stats_fields"/> </lst> <lst name="stats"> <lst name="nr"> <double name="c">-100.0</double> <long name="count">100</long> <null name="s"/> <null name="sum"/> </lst> <lst name="dr"> <long name="count">100</long> <null name="mc"/> <null name="mean"/> <null name="su"/> <null name="sum"/> <null name="unique"/> </lst> <lst name="rr"> <str name="max">str9</str> <str name="min">str0</str> <str name="rmax">9rts</str> <str name="rmin">0rts</str> </lst> <lst name="avr"> <double name="c">100.0</double> <long name="count">100</long> <null name="s"/> <null name="sum"/> </lst> <lst name="ar"> <long name="count">100</long> <null name="mcm"/> <null name="mean"/> <null name="median"/> <null name="su"/> <null name="sum"/> <null name="unique"/> </lst> <lst name="csr"> <str name="cs1">this is the first</str> <str name="cs2">this is the second</str> <str name="cs3">this is the third</str> </lst> <lst name="mr"> <long name="count">100</long> <null name="mcm"/> <null name="mean"/> <null name="median"/> <null name="su"/> <null name="sum"/> <null name="unique"/> </lst> <lst name="cr"> <str name="ccmax">this is the secondstr9</str> <str name="ccmin">this is the firststr0</str> <str name="csmax">this is the second</str> <str name="csmin">this is the first</str> <str name="max">str9</str> <str name="min">str0</str> </lst> <lst name="cdr"> <date name="cd1">1800-12-31T23:59:59Z</date> <date name="cd2">1804-06-30T23:59:59Z</date> <str name="cs1">1800-12-31T23:59:59Z</str> <str name="cs2">1804-06-30T23:59:59Z</str> </lst> <lst name="dmr"> <str name="cma">+2MONTHS</str> <str name="cme">+2YEARS</str> <date name="dmma">1812-02-29T23:59:59Z</date> <date name="dmme">1807-12-31T23:59:59Z</date> <date name="max">1811-12-31T23:59:59Z</date> <date name="median">1805-12-31T23:59:59Z</date> </lst> <lst name="pr"> <long name="count">100</long> <double name="mc">1.2729436151389237E146</double> <double name="mean">28.91</double> <double name="su">3.9603293116911423E124</double> <double name="sum">2891.0</double> <long name="unique">36</long> </lst> <lst name="cnr"> <double name="c10">10.0</double> <double name="c8">8.0</double> </lst> </lst> </response>
Stack Trace:
java.lang.AssertionError: Caught exception in getStatResult, xPath = /response/lst[@name='stats']/lst[@name='nr']/double[@name='sum']
raw data: <?xml version="1.0" encoding="UTF-8"?>
<response>
<lst name="responseHeader">
<int name="status">0</int>
<int name="QTime">5</int>
</lst>
<result name="response" numFound="100" start="0">
</result>
<lst name="stats">
<lst name="stats_fields"/>
</lst>
<lst name="stats">
<lst name="nr">
<double name="c">-100.0</double>
<long name="count">100</long>
<null name="s"/>
<null name="sum"/>
</lst>
<lst name="dr">
<long name="count">100</long>
<null name="mc"/>
<null name="mean"/>
<null name="su"/>
<null name="sum"/>
<null name="unique"/>
</lst>
<lst name="rr">
<str name="max">str9</str>
<str name="min">str0</str>
<str name="rmax">9rts</str>
<str name="rmin">0rts</str>
</lst>
<lst name="avr">
<double name="c">100.0</double>
<long name="count">100</long>
<null name="s"/>
<null name="sum"/>
</lst>
<lst name="ar">
<long name="count">100</long>
<null name="mcm"/>
<null name="mean"/>
<null name="median"/>
<null name="su"/>
<null name="sum"/>
<null name="unique"/>
</lst>
<lst name="csr">
<str name="cs1">this is the first</str>
<str name="cs2">this is the second</str>
<str name="cs3">this is the third</str>
</lst>
<lst name="mr">
<long name="count">100</long>
<null name="mcm"/>
<null name="mean"/>
<null name="median"/>
<null name="su"/>
<null name="sum"/>
<null name="unique"/>
</lst>
<lst name="cr">
<str name="ccmax">this is the secondstr9</str>
<str name="ccmin">this is the firststr0</str>
<str name="csmax">this is the second</str>
<str name="csmin">this is the first</str>
<str name="max">str9</str>
<str name="min">str0</str>
</lst>
<lst name="cdr">
<date name="cd1">1800-12-31T23:59:59Z</date>
<date name="cd2">1804-06-30T23:59:59Z</date>
<str name="cs1">1800-12-31T23:59:59Z</str>
<str name="cs2">1804-06-30T23:59:59Z</str>
</lst>
<lst name="dmr">
<str name="cma">+2MONTHS</str>
<str name="cme">+2YEARS</str>
<date name="dmma">1812-02-29T23:59:59Z</date>
<date name="dmme">1807-12-31T23:59:59Z</date>
<date name="max">1811-12-31T23:59:59Z</date>
<date name="median">1805-12-31T23:59:59Z</date>
</lst>
<lst name="pr">
<long name="count">100</long>
<double name="mc">1.2729436151389237E146</double>
<double name="mean">28.91</double>
<double name="su">3.9603293116911423E124</double>
<double name="sum">2891.0</double>
<long name="unique">36</long>
</lst>
<lst name="cnr">
<double name="c10">10.0</double>
<double name="c8">8.0</double>
</lst>
</lst>
</response>
at __randomizedtesting.SeedInfo.seed([F25540B5979677D:72D3CAEFD5437CD]:0)
at org.junit.Assert.fail(Assert.java:93)
at org.apache.solr.analytics.AbstractAnalyticsStatsTest.getStatResult(AbstractAnalyticsStatsTest.java:113)
at org.apache.solr.analytics.expression.ExpressionTest.negateTest(ExpressionTest.java:132)
at sun.reflect.NativeMethodAccessorImpl.invoke0(Native Method)
at sun.reflect.NativeMethodAccessorImpl.invoke(NativeMethodAccessorImpl.java:88)
at sun.reflect.DelegatingMethodAccessorImpl.invoke(DelegatingMethodAccessorImpl.java:55)
at java.lang.reflect.Method.invoke(Method.java:613)
at com.carrotsearch.randomizedtesting.RandomizedRunner.invoke(RandomizedRunner.java:1559)
at com.carrotsearch.randomizedtesting.RandomizedRunner.access$600(RandomizedRunner.java:79)
at com.carrotsearch.randomizedtesting.RandomizedRunner$6.evaluate(RandomizedRunner.java:737)
at com.carrotsearch.randomizedtesting.RandomizedRunner$7.evaluate(RandomizedRunner.java:773)
at com.carrotsearch.randomizedtesting.RandomizedRunner$8.evaluate(RandomizedRunner.java:787)
at com.carrotsearch.randomizedtesting.rules.SystemPropertiesRestoreRule$1.evaluate(SystemPropertiesRestoreRule.java:53)
at org.apache.lucene.util.TestRuleSetupTeardownChained$1.evaluate(TestRuleSetupTeardownChained.java:50)
at org.apache.lucene.util.TestRuleFieldCacheSanity$1.evaluate(TestRuleFieldCacheSanity.java:51)
at org.apache.lucene.util.AbstractBeforeAfterRule$1.evaluate(AbstractBeforeAfterRule.java:46)
at com.carrotsearch.randomizedtesting.rules.SystemPropertiesInvariantRule$1.evaluate(SystemPropertiesInvariantRule.java:55)
at org.apache.lucene.util.TestRuleThreadAndTestName$1.evaluate(TestRuleThreadAndTestName.java:49)
at org.apache.lucene.util.TestRuleIgnoreAfterMaxFailures$1.evaluate(TestRuleIgnoreAfterMaxFailures.java:70)
at org.apache.lucene.util.TestRuleMarkFailure$1.evaluate(TestRuleMarkFailure.java:48)
at com.carrotsearch.randomizedtesting.rules.StatementAdapter.evaluate(StatementAdapter.java:36)
at com.carrotsearch.randomizedtesting.ThreadLeakControl$StatementRunner.run(ThreadLeakControl.java:358)
at com.carrotsearch.randomizedtesting.ThreadLeakControl.forkTimeoutingTask(ThreadLeakControl.java:782)
at com.carrotsearch.randomizedtesting.ThreadLeakControl$3.evaluate(ThreadLeakControl.java:442)
at com.carrotsearch.randomizedtesting.RandomizedRunner.runSingleTest(RandomizedRunner.java:746)
at com.carrotsearch.randomizedtesting.RandomizedRunner$3.evaluate(RandomizedRunner.java:648)
at com.carrotsearch.randomizedtesting.RandomizedRunner$4.evaluate(RandomizedRunner.java:682)
at com.carrotsearch.randomizedtesting.RandomizedRunner$5.evaluate(RandomizedRunner.java:693)
at com.carrotsearch.randomizedtesting.rules.StatementAdapter.evaluate(StatementAdapter.java:36)
at com.carrotsearch.randomizedtesting.rules.SystemPropertiesRestoreRule$1.evaluate(SystemPropertiesRestoreRule.java:53)
at org.apache.lucene.util.AbstractBeforeAfterRule$1.evaluate(AbstractBeforeAfterRule.java:46)
at org.apache.lucene.util.TestRuleStoreClassName$1.evaluate(TestRuleStoreClassName.java:42)
at com.carrotsearch.randomizedtesting.rules.SystemPropertiesInvariantRule$1.evaluate(SystemPropertiesInvariantRule.java:55)
at com.carrotsearch.randomizedtesting.rules.NoShadowingOrOverridesOnMethodsRule$1.evaluate(NoShadowingOrOverridesOnMethodsRule.java:39)
at com.carrotsearch.randomizedtesting.rules.NoShadowingOrOverridesOnMethodsRule$1.evaluate(NoShadowingOrOverridesOnMethodsRule.java:39)
at com.carrotsearch.randomizedtesting.rules.StatementAdapter.evaluate(StatementAdapter.java:36)
at org.apache.lucene.util.TestRuleAssertionsRequired$1.evaluate(TestRuleAssertionsRequired.java:43)
at org.apache.lucene.util.TestRuleMarkFailure$1.evaluate(TestRuleMarkFailure.java:48)
at org.apache.lucene.util.TestRuleIgnoreAfterMaxFailures$1.evaluate(TestRuleIgnoreAfterMaxFailures.java:70)
at org.apache.lucene.util.TestRuleIgnoreTestSuites$1.evaluate(TestRuleIgnoreTestSuites.java:55)
at com.carrotsearch.randomizedtesting.rules.StatementAdapter.evaluate(StatementAdapter.java:36)
at com.carrotsearch.randomizedtesting.ThreadLeakControl$StatementRunner.run(ThreadLeakControl.java:358)
at java.lang.Thread.run(Thread.java:780)
REGRESSION: org.apache.solr.analytics.expression.ExpressionTest.addTest
Error Message:
Caught exception in getStatResult, xPath = /response/lst[@name='stats']/lst[@name='ar']/double[@name='sum'] raw data: <?xml version="1.0" encoding="UTF-8"?> <response> <lst name="responseHeader"> <int name="status">0</int> <int name="QTime">5</int> </lst> <result name="response" numFound="100" start="0"> </result> <lst name="stats"> <lst name="stats_fields"/> </lst> <lst name="stats"> <lst name="nr"> <double name="c">-100.0</double> <long name="count">100</long> <null name="s"/> <null name="sum"/> </lst> <lst name="dr"> <long name="count">100</long> <null name="mc"/> <null name="mean"/> <null name="su"/> <null name="sum"/> <null name="unique"/> </lst> <lst name="rr"> <str name="max">str9</str> <str name="min">str0</str> <str name="rmax">9rts</str> <str name="rmin">0rts</str> </lst> <lst name="avr"> <double name="c">100.0</double> <long name="count">100</long> <null name="s"/> <null name="sum"/> </lst> <lst name="ar"> <long name="count">100</long> <null name="mcm"/> <null name="mean"/> <null name="median"/> <null name="su"/> <null name="sum"/> <null name="unique"/> </lst> <lst name="csr"> <str name="cs1">this is the first</str> <str name="cs2">this is the second</str> <str name="cs3">this is the third</str> </lst> <lst name="mr"> <long name="count">100</long> <null name="mcm"/> <null name="mean"/> <null name="median"/> <null name="su"/> <null name="sum"/> <null name="unique"/> </lst> <lst name="cr"> <str name="ccmax">this is the secondstr9</str> <str name="ccmin">this is the firststr0</str> <str name="csmax">this is the second</str> <str name="csmin">this is the first</str> <str name="max">str9</str> <str name="min">str0</str> </lst> <lst name="cdr"> <date name="cd1">1800-12-31T23:59:59Z</date> <date name="cd2">1804-06-30T23:59:59Z</date> <str name="cs1">1800-12-31T23:59:59Z</str> <str name="cs2">1804-06-30T23:59:59Z</str> </lst> <lst name="dmr"> <str name="cma">+2MONTHS</str> <str name="cme">+2YEARS</str> <date name="dmma">1812-02-29T23:59:59Z</date> <date name="dmme">1807-12-31T23:59:59Z</date> <date name="max">1811-12-31T23:59:59Z</date> <date name="median">1805-12-31T23:59:59Z</date> </lst> <lst name="pr"> <long name="count">100</long> <double name="mc">1.2729436151389237E146</double> <double name="mean">28.91</double> <double name="su">3.9603293116911423E124</double> <double name="sum">2891.0</double> <long name="unique">36</long> </lst> <lst name="cnr"> <double name="c10">10.0</double> <double name="c8">8.0</double> </lst> </lst> </response>
Stack Trace:
java.lang.AssertionError: Caught exception in getStatResult, xPath = /response/lst[@name='stats']/lst[@name='ar']/double[@name='sum']
raw data: <?xml version="1.0" encoding="UTF-8"?>
<response>
<lst name="responseHeader">
<int name="status">0</int>
<int name="QTime">5</int>
</lst>
<result name="response" numFound="100" start="0">
</result>
<lst name="stats">
<lst name="stats_fields"/>
</lst>
<lst name="stats">
<lst name="nr">
<double name="c">-100.0</double>
<long name="count">100</long>
<null name="s"/>
<null name="sum"/>
</lst>
<lst name="dr">
<long name="count">100</long>
<null name="mc"/>
<null name="mean"/>
<null name="su"/>
<null name="sum"/>
<null name="unique"/>
</lst>
<lst name="rr">
<str name="max">str9</str>
<str name="min">str0</str>
<str name="rmax">9rts</str>
<str name="rmin">0rts</str>
</lst>
<lst name="avr">
<double name="c">100.0</double>
<long name="count">100</long>
<null name="s"/>
<null name="sum"/>
</lst>
<lst name="ar">
<long name="count">100</long>
<null name="mcm"/>
<null name="mean"/>
<null name="median"/>
<null name="su"/>
<null name="sum"/>
<null name="unique"/>
</lst>
<lst name="csr">
<str name="cs1">this is the first</str>
<str name="cs2">this is the second</str>
<str name="cs3">this is the third</str>
</lst>
<lst name="mr">
<long name="count">100</long>
<null name="mcm"/>
<null name="mean"/>
<null name="median"/>
<null name="su"/>
<null name="sum"/>
<null name="unique"/>
</lst>
<lst name="cr">
<str name="ccmax">this is the secondstr9</str>
<str name="ccmin">this is the firststr0</str>
<str name="csmax">this is the second</str>
<str name="csmin">this is the first</str>
<str name="max">str9</str>
<str name="min">str0</str>
</lst>
<lst name="cdr">
<date name="cd1">1800-12-31T23:59:59Z</date>
<date name="cd2">1804-06-30T23:59:59Z</date>
<str name="cs1">1800-12-31T23:59:59Z</str>
<str name="cs2">1804-06-30T23:59:59Z</str>
</lst>
<lst name="dmr">
<str name="cma">+2MONTHS</str>
<str name="cme">+2YEARS</str>
<date name="dmma">1812-02-29T23:59:59Z</date>
<date name="dmme">1807-12-31T23:59:59Z</date>
<date name="max">1811-12-31T23:59:59Z</date>
<date name="median">1805-12-31T23:59:59Z</date>
</lst>
<lst name="pr">
<long name="count">100</long>
<double name="mc">1.2729436151389237E146</double>
<double name="mean">28.91</double>
<double name="su">3.9603293116911423E124</double>
<double name="sum">2891.0</double>
<long name="unique">36</long>
</lst>
<lst name="cnr">
<double name="c10">10.0</double>
<double name="c8">8.0</double>
</lst>
</lst>
</response>
at __randomizedtesting.SeedInfo.seed([F25540B5979677D:F909F9D518B6603A]:0)
at org.junit.Assert.fail(Assert.java:93)
at org.apache.solr.analytics.AbstractAnalyticsStatsTest.getStatResult(AbstractAnalyticsStatsTest.java:113)
at org.apache.solr.analytics.expression.ExpressionTest.addTest(ExpressionTest.java:78)
at sun.reflect.NativeMethodAccessorImpl.invoke0(Native Method)
at sun.reflect.NativeMethodAccessorImpl.invoke(NativeMethodAccessorImpl.java:88)
at sun.reflect.DelegatingMethodAccessorImpl.invoke(DelegatingMethodAccessorImpl.java:55)
at java.lang.reflect.Method.invoke(Method.java:613)
at com.carrotsearch.randomizedtesting.RandomizedRunner.invoke(RandomizedRunner.java:1559)
at com.carrotsearch.randomizedtesting.RandomizedRunner.access$600(RandomizedRunner.java:79)
at com.carrotsearch.randomizedtesting.RandomizedRunner$6.evaluate(RandomizedRunner.java:737)
at com.carrotsearch.randomizedtesting.RandomizedRunner$7.evaluate(RandomizedRunner.java:773)
at com.carrotsearch.randomizedtesting.RandomizedRunner$8.evaluate(RandomizedRunner.java:787)
at com.carrotsearch.randomizedtesting.rules.SystemPropertiesRestoreRule$1.evaluate(SystemPropertiesRestoreRule.java:53)
at org.apache.lucene.util.TestRuleSetupTeardownChained$1.evaluate(TestRuleSetupTeardownChained.java:50)
at org.apache.lucene.util.TestRuleFieldCacheSanity$1.evaluate(TestRuleFieldCacheSanity.java:51)
at org.apache.lucene.util.AbstractBeforeAfterRule$1.evaluate(AbstractBeforeAfterRule.java:46)
at com.carrotsearch.randomizedtesting.rules.SystemPropertiesInvariantRule$1.evaluate(SystemPropertiesInvariantRule.java:55)
at org.apache.lucene.util.TestRuleThreadAndTestName$1.evaluate(TestRuleThreadAndTestName.java:49)
at org.apache.lucene.util.TestRuleIgnoreAfterMaxFailures$1.evaluate(TestRuleIgnoreAfterMaxFailures.java:70)
at org.apache.lucene.util.TestRuleMarkFailure$1.evaluate(TestRuleMarkFailure.java:48)
at com.carrotsearch.randomizedtesting.rules.StatementAdapter.evaluate(StatementAdapter.java:36)
at com.carrotsearch.randomizedtesting.ThreadLeakControl$StatementRunner.run(ThreadLeakControl.java:358)
at com.carrotsearch.randomizedtesting.ThreadLeakControl.forkTimeoutingTask(ThreadLeakControl.java:782)
at com.carrotsearch.randomizedtesting.ThreadLeakControl$3.evaluate(ThreadLeakControl.java:442)
at com.carrotsearch.randomizedtesting.RandomizedRunner.runSingleTest(RandomizedRunner.java:746)
at com.carrotsearch.randomizedtesting.RandomizedRunner$3.evaluate(RandomizedRunner.java:648)
at com.carrotsearch.randomizedtesting.RandomizedRunner$4.evaluate(RandomizedRunner.java:682)
at com.carrotsearch.randomizedtesting.RandomizedRunner$5.evaluate(RandomizedRunner.java:693)
at com.carrotsearch.randomizedtesting.rules.StatementAdapter.evaluate(StatementAdapter.java:36)
at com.carrotsearch.randomizedtesting.rules.SystemPropertiesRestoreRule$1.evaluate(SystemPropertiesRestoreRule.java:53)
at org.apache.lucene.util.AbstractBeforeAfterRule$1.evaluate(AbstractBeforeAfterRule.java:46)
at org.apache.lucene.util.TestRuleStoreClassName$1.evaluate(TestRuleStoreClassName.java:42)
at com.carrotsearch.randomizedtesting.rules.SystemPropertiesInvariantRule$1.evaluate(SystemPropertiesInvariantRule.java:55)
at com.carrotsearch.randomizedtesting.rules.NoShadowingOrOverridesOnMethodsRule$1.evaluate(NoShadowingOrOverridesOnMethodsRule.java:39)
at com.carrotsearch.randomizedtesting.rules.NoShadowingOrOverridesOnMethodsRule$1.evaluate(NoShadowingOrOverridesOnMethodsRule.java:39)
at com.carrotsearch.randomizedtesting.rules.StatementAdapter.evaluate(StatementAdapter.java:36)
at org.apache.lucene.util.TestRuleAssertionsRequired$1.evaluate(TestRuleAssertionsRequired.java:43)
at org.apache.lucene.util.TestRuleMarkFailure$1.evaluate(TestRuleMarkFailure.java:48)
at org.apache.lucene.util.TestRuleIgnoreAfterMaxFailures$1.evaluate(TestRuleIgnoreAfterMaxFailures.java:70)
at org.apache.lucene.util.TestRuleIgnoreTestSuites$1.evaluate(TestRuleIgnoreTestSuites.java:55)
at com.carrotsearch.randomizedtesting.rules.StatementAdapter.evaluate(StatementAdapter.java:36)
at com.carrotsearch.randomizedtesting.ThreadLeakControl$StatementRunner.run(ThreadLeakControl.java:358)
at java.lang.Thread.run(Thread.java:780)
REGRESSION: org.apache.solr.analytics.expression.ExpressionTest.divideTest
Error Message:
Caught exception in getStatResult, xPath = /response/lst[@name='stats']/lst[@name='dr']/double[@name='sum'] raw data: <?xml version="1.0" encoding="UTF-8"?> <response> <lst name="responseHeader"> <int name="status">0</int> <int name="QTime">5</int> </lst> <result name="response" numFound="100" start="0"> </result> <lst name="stats"> <lst name="stats_fields"/> </lst> <lst name="stats"> <lst name="nr"> <double name="c">-100.0</double> <long name="count">100</long> <null name="s"/> <null name="sum"/> </lst> <lst name="dr"> <long name="count">100</long> <null name="mc"/> <null name="mean"/> <null name="su"/> <null name="sum"/> <null name="unique"/> </lst> <lst name="rr"> <str name="max">str9</str> <str name="min">str0</str> <str name="rmax">9rts</str> <str name="rmin">0rts</str> </lst> <lst name="avr"> <double name="c">100.0</double> <long name="count">100</long> <null name="s"/> <null name="sum"/> </lst> <lst name="ar"> <long name="count">100</long> <null name="mcm"/> <null name="mean"/> <null name="median"/> <null name="su"/> <null name="sum"/> <null name="unique"/> </lst> <lst name="csr"> <str name="cs1">this is the first</str> <str name="cs2">this is the second</str> <str name="cs3">this is the third</str> </lst> <lst name="mr"> <long name="count">100</long> <null name="mcm"/> <null name="mean"/> <null name="median"/> <null name="su"/> <null name="sum"/> <null name="unique"/> </lst> <lst name="cr"> <str name="ccmax">this is the secondstr9</str> <str name="ccmin">this is the firststr0</str> <str name="csmax">this is the second</str> <str name="csmin">this is the first</str> <str name="max">str9</str> <str name="min">str0</str> </lst> <lst name="cdr"> <date name="cd1">1800-12-31T23:59:59Z</date> <date name="cd2">1804-06-30T23:59:59Z</date> <str name="cs1">1800-12-31T23:59:59Z</str> <str name="cs2">1804-06-30T23:59:59Z</str> </lst> <lst name="dmr"> <str name="cma">+2MONTHS</str> <str name="cme">+2YEARS</str> <date name="dmma">1812-02-29T23:59:59Z</date> <date name="dmme">1807-12-31T23:59:59Z</date> <date name="max">1811-12-31T23:59:59Z</date> <date name="median">1805-12-31T23:59:59Z</date> </lst> <lst name="pr"> <long name="count">100</long> <double name="mc">1.2729436151389237E146</double> <double name="mean">28.91</double> <double name="su">3.9603293116911423E124</double> <double name="sum">2891.0</double> <long name="unique">36</long> </lst> <lst name="cnr"> <double name="c10">10.0</double> <double name="c8">8.0</double> </lst> </lst> </response>
Stack Trace:
java.lang.AssertionError: Caught exception in getStatResult, xPath = /response/lst[@name='stats']/lst[@name='dr']/double[@name='sum']
raw data: <?xml version="1.0" encoding="UTF-8"?>
<response>
<lst name="responseHeader">
<int name="status">0</int>
<int name="QTime">5</int>
</lst>
<result name="response" numFound="100" start="0">
</result>
<lst name="stats">
<lst name="stats_fields"/>
</lst>
<lst name="stats">
<lst name="nr">
<double name="c">-100.0</double>
<long name="count">100</long>
<null name="s"/>
<null name="sum"/>
</lst>
<lst name="dr">
<long name="count">100</long>
<null name="mc"/>
<null name="mean"/>
<null name="su"/>
<null name="sum"/>
<null name="unique"/>
</lst>
<lst name="rr">
<str name="max">str9</str>
<str name="min">str0</str>
<str name="rmax">9rts</str>
<str name="rmin">0rts</str>
</lst>
<lst name="avr">
<double name="c">100.0</double>
<long name="count">100</long>
<null name="s"/>
<null name="sum"/>
</lst>
<lst name="ar">
<long name="count">100</long>
<null name="mcm"/>
<null name="mean"/>
<null name="median"/>
<null name="su"/>
<null name="sum"/>
<null name="unique"/>
</lst>
<lst name="csr">
<str name="cs1">this is the first</str>
<str name="cs2">this is the second</str>
<str name="cs3">this is the third</str>
</lst>
<lst name="mr">
<long name="count">100</long>
<null name="mcm"/>
<null name="mean"/>
<null name="median"/>
<null name="su"/>
<null name="sum"/>
<null name="unique"/>
</lst>
<lst name="cr">
<str name="ccmax">this is the secondstr9</str>
<str name="ccmin">this is the firststr0</str>
<str name="csmax">this is the second</str>
<str name="csmin">this is the first</str>
<str name="max">str9</str>
<str name="min">str0</str>
</lst>
<lst name="cdr">
<date name="cd1">1800-12-31T23:59:59Z</date>
<date name="cd2">1804-06-30T23:59:59Z</date>
<str name="cs1">1800-12-31T23:59:59Z</str>
<str name="cs2">1804-06-30T23:59:59Z</str>
</lst>
<lst name="dmr">
<str name="cma">+2MONTHS</str>
<str name="cme">+2YEARS</str>
<date name="dmma">1812-02-29T23:59:59Z</date>
<date name="dmme">1807-12-31T23:59:59Z</date>
<date name="max">1811-12-31T23:59:59Z</date>
<date name="median">1805-12-31T23:59:59Z</date>
</lst>
<lst name="pr">
<long name="count">100</long>
<double name="mc">1.2729436151389237E146</double>
<double name="mean">28.91</double>
<double name="su">3.9603293116911423E124</double>
<double name="sum">2891.0</double>
<long name="unique">36</long>
</lst>
<lst name="cnr">
<double name="c10">10.0</double>
<double name="c8">8.0</double>
</lst>
</lst>
</response>
at __randomizedtesting.SeedInfo.seed([F25540B5979677D:5728BFFD7DBB05AB]:0)
at org.junit.Assert.fail(Assert.java:93)
at org.apache.solr.analytics.AbstractAnalyticsStatsTest.getStatResult(AbstractAnalyticsStatsTest.java:113)
at org.apache.solr.analytics.expression.ExpressionTest.divideTest(ExpressionTest.java:106)
at sun.reflect.NativeMethodAccessorImpl.invoke0(Native Method)
at sun.reflect.NativeMethodAccessorImpl.invoke(NativeMethodAccessorImpl.java:88)
at sun.reflect.DelegatingMethodAccessorImpl.invoke(DelegatingMethodAccessorImpl.java:55)
at java.lang.reflect.Method.invoke(Method.java:613)
at com.carrotsearch.randomizedtesting.RandomizedRunner.invoke(RandomizedRunner.java:1559)
at com.carrotsearch.randomizedtesting.RandomizedRunner.access$600(RandomizedRunner.java:79)
at com.carrotsearch.randomizedtesting.RandomizedRunner$6.evaluate(RandomizedRunner.java:737)
at com.carrotsearch.randomizedtesting.RandomizedRunner$7.evaluate(RandomizedRunner.java:773)
at com.carrotsearch.randomizedtesting.RandomizedRunner$8.evaluate(RandomizedRunner.java:787)
at com.carrotsearch.randomizedtesting.rules.SystemPropertiesRestoreRule$1.evaluate(SystemPropertiesRestoreRule.java:53)
at org.apache.lucene.util.TestRuleSetupTeardownChained$1.evaluate(TestRuleSetupTeardownChained.java:50)
at org.apache.lucene.util.TestRuleFieldCacheSanity$1.evaluate(TestRuleFieldCacheSanity.java:51)
at org.apache.lucene.util.AbstractBeforeAfterRule$1.evaluate(AbstractBeforeAfterRule.java:46)
at com.carrotsearch.randomizedtesting.rules.SystemPropertiesInvariantRule$1.evaluate(SystemPropertiesInvariantRule.java:55)
at org.apache.lucene.util.TestRuleThreadAndTestName$1.evaluate(TestRuleThreadAndTestName.java:49)
at org.apache.lucene.util.TestRuleIgnoreAfterMaxFailures$1.evaluate(TestRuleIgnoreAfterMaxFailures.java:70)
at org.apache.lucene.util.TestRuleMarkFailure$1.evaluate(TestRuleMarkFailure.java:48)
at com.carrotsearch.randomizedtesting.rules.StatementAdapter.evaluate(StatementAdapter.java:36)
at com.carrotsearch.randomizedtesting.ThreadLeakControl$StatementRunner.run(ThreadLeakControl.java:358)
at com.carrotsearch.randomizedtesting.ThreadLeakControl.forkTimeoutingTask(ThreadLeakControl.java:782)
at com.carrotsearch.randomizedtesting.ThreadLeakControl$3.evaluate(ThreadLeakControl.java:442)
at com.carrotsearch.randomizedtesting.RandomizedRunner.runSingleTest(RandomizedRunner.java:746)
at com.carrotsearch.randomizedtesting.RandomizedRunner$3.evaluate(RandomizedRunner.java:648)
at com.carrotsearch.randomizedtesting.RandomizedRunner$4.evaluate(RandomizedRunner.java:682)
at com.carrotsearch.randomizedtesting.RandomizedRunner$5.evaluate(RandomizedRunner.java:693)
at com.carrotsearch.randomizedtesting.rules.StatementAdapter.evaluate(StatementAdapter.java:36)
at com.carrotsearch.randomizedtesting.rules.SystemPropertiesRestoreRule$1.evaluate(SystemPropertiesRestoreRule.java:53)
at org.apache.lucene.util.AbstractBeforeAfterRule$1.evaluate(AbstractBeforeAfterRule.java:46)
at org.apache.lucene.util.TestRuleStoreClassName$1.evaluate(TestRuleStoreClassName.java:42)
at com.carrotsearch.randomizedtesting.rules.SystemPropertiesInvariantRule$1.evaluate(SystemPropertiesInvariantRule.java:55)
at com.carrotsearch.randomizedtesting.rules.NoShadowingOrOverridesOnMethodsRule$1.evaluate(NoShadowingOrOverridesOnMethodsRule.java:39)
at com.carrotsearch.randomizedtesting.rules.NoShadowingOrOverridesOnMethodsRule$1.evaluate(NoShadowingOrOverridesOnMethodsRule.java:39)
at com.carrotsearch.randomizedtesting.rules.StatementAdapter.evaluate(StatementAdapter.java:36)
at org.apache.lucene.util.TestRuleAssertionsRequired$1.evaluate(TestRuleAssertionsRequired.java:43)
at org.apache.lucene.util.TestRuleMarkFailure$1.evaluate(TestRuleMarkFailure.java:48)
at org.apache.lucene.util.TestRuleIgnoreAfterMaxFailures$1.evaluate(TestRuleIgnoreAfterMaxFailures.java:70)
at org.apache.lucene.util.TestRuleIgnoreTestSuites$1.evaluate(TestRuleIgnoreTestSuites.java:55)
at com.carrotsearch.randomizedtesting.rules.StatementAdapter.evaluate(StatementAdapter.java:36)
at com.carrotsearch.randomizedtesting.ThreadLeakControl$StatementRunner.run(ThreadLeakControl.java:358)
at java.lang.Thread.run(Thread.java:780)
REGRESSION: org.apache.solr.update.processor.SignatureUpdateProcessorFactoryTest.testDupeDetection
Error Message:
expected:<1> but was:<2>
Stack Trace:
java.lang.AssertionError: expected:<1> but was:<2>
at __randomizedtesting.SeedInfo.seed([F25540B5979677D:5415AFC35A3EC401]:0)
at org.junit.Assert.fail(Assert.java:93)
at org.junit.Assert.failNotEquals(Assert.java:647)
at org.junit.Assert.assertEquals(Assert.java:128)
at org.junit.Assert.assertEquals(Assert.java:472)
at org.junit.Assert.assertEquals(Assert.java:456)
at org.apache.solr.update.processor.SignatureUpdateProcessorFactoryTest.checkNumDocs(SignatureUpdateProcessorFactoryTest.java:71)
at org.apache.solr.update.processor.SignatureUpdateProcessorFactoryTest.testDupeDetection(SignatureUpdateProcessorFactoryTest.java:119)
at sun.reflect.NativeMethodAccessorImpl.invoke0(Native Method)
at sun.reflect.NativeMethodAccessorImpl.invoke(NativeMethodAccessorImpl.java:88)
at sun.reflect.DelegatingMethodAccessorImpl.invoke(DelegatingMethodAccessorImpl.java:55)
at java.lang.reflect.Method.invoke(Method.java:613)
at com.carrotsearch.randomizedtesting.RandomizedRunner.invoke(RandomizedRunner.java:1559)
at com.carrotsearch.randomizedtesting.RandomizedRunner.access$600(RandomizedRunner.java:79)
at com.carrotsearch.randomizedtesting.RandomizedRunner$6.evaluate(RandomizedRunner.java:737)
at com.carrotsearch.randomizedtesting.RandomizedRunner$7.evaluate(RandomizedRunner.java:773)
at com.carrotsearch.randomizedtesting.RandomizedRunner$8.evaluate(RandomizedRunner.java:787)
at com.carrotsearch.randomizedtesting.rules.SystemPropertiesRestoreRule$1.evaluate(SystemPropertiesRestoreRule.java:53)
at org.apache.lucene.util.TestRuleSetupTeardownChained$1.evaluate(TestRuleSetupTeardownChained.java:50)
at org.apache.lucene.util.TestRuleFieldCacheSanity$1.evaluate(TestRuleFieldCacheSanity.java:51)
at org.apache.lucene.util.AbstractBeforeAfterRule$1.evaluate(AbstractBeforeAfterRule.java:46)
at com.carrotsearch.randomizedtesting.rules.SystemPropertiesInvariantRule$1.evaluate(SystemPropertiesInvariantRule.java:55)
at org.apache.lucene.util.TestRuleThreadAndTestName$1.evaluate(TestRuleThreadAndTestName.java:49)
at org.apache.lucene.util.TestRuleIgnoreAfterMaxFailures$1.evaluate(TestRuleIgnoreAfterMaxFailures.java:70)
at org.apache.lucene.util.TestRuleMarkFailure$1.evaluate(TestRuleMarkFailure.java:48)
at com.carrotsearch.randomizedtesting.rules.StatementAdapter.evaluate(StatementAdapter.java:36)
at com.carrotsearch.randomizedtesting.ThreadLeakControl$StatementRunner.run(ThreadLeakControl.java:358)
at com.carrotsearch.randomizedtesting.ThreadLeakControl.forkTimeoutingTask(ThreadLeakControl.java:782)
at com.carrotsearch.randomizedtesting.ThreadLeakControl$3.evaluate(ThreadLeakControl.java:442)
at com.carrotsearch.randomizedtesting.RandomizedRunner.runSingleTest(RandomizedRunner.java:746)
at com.carrotsearch.randomizedtesting.RandomizedRunner$3.evaluate(RandomizedRunner.java:648)
at com.carrotsearch.randomizedtesting.RandomizedRunner$4.evaluate(RandomizedRunner.java:682)
at com.carrotsearch.randomizedtesting.RandomizedRunner$5.evaluate(RandomizedRunner.java:693)
at com.carrotsearch.randomizedtesting.rules.StatementAdapter.evaluate(StatementAdapter.java:36)
at com.carrotsearch.randomizedtesting.rules.SystemPropertiesRestoreRule$1.evaluate(SystemPropertiesRestoreRule.java:53)
at org.apache.lucene.util.AbstractBeforeAfterRule$1.evaluate(AbstractBeforeAfterRule.java:46)
at org.apache.lucene.util.TestRuleStoreClassName$1.evaluate(TestRuleStoreClassName.java:42)
at com.carrotsearch.randomizedtesting.rules.SystemPropertiesInvariantRule$1.evaluate(SystemPropertiesInvariantRule.java:55)
at com.carrotsearch.randomizedtesting.rules.NoShadowingOrOverridesOnMethodsRule$1.evaluate(NoShadowingOrOverridesOnMethodsRule.java:39)
at com.carrotsearch.randomizedtesting.rules.NoShadowingOrOverridesOnMethodsRule$1.evaluate(NoShadowingOrOverridesOnMethodsRule.java:39)
at com.carrotsearch.randomizedtesting.rules.StatementAdapter.evaluate(StatementAdapter.java:36)
at org.apache.lucene.util.TestRuleAssertionsRequired$1.evaluate(TestRuleAssertionsRequired.java:43)
at org.apache.lucene.util.TestRuleMarkFailure$1.evaluate(TestRuleMarkFailure.java:48)
at org.apache.lucene.util.TestRuleIgnoreAfterMaxFailures$1.evaluate(TestRuleIgnoreAfterMaxFailures.java:70)
at org.apache.lucene.util.TestRuleIgnoreTestSuites$1.evaluate(TestRuleIgnoreTestSuites.java:55)
at com.carrotsearch.randomizedtesting.rules.StatementAdapter.evaluate(StatementAdapter.java:36)
at com.carrotsearch.randomizedtesting.ThreadLeakControl$StatementRunner.run(ThreadLeakControl.java:358)
at java.lang.Thread.run(Thread.java:780)
Build Log:
[...truncated 10718 lines...]
[junit4] Suite: org.apache.solr.update.processor.SignatureUpdateProcessorFactoryTest
[junit4] 2> 619160 T2768 oas.SolrTestCaseJ4.initCore ####initCore
[junit4] 2> Creating dataDir: /mnt/ssd/jenkins/workspace/Lucene-Solr-trunk-Linux/solr/build/solr-core/test/J0/./solrtest-SignatureUpdateProcessorFactoryTest-1387590270363
[junit4] 2> 619161 T2768 oasc.SolrResourceLoader.<init> new SolrResourceLoader for directory: '/mnt/ssd/jenkins/workspace/Lucene-Solr-trunk-Linux/solr/build/solr-core/test-files/solr/collection1/'
[junit4] 2> 619161 T2768 oasc.SolrResourceLoader.replaceClassLoader Adding 'file:/mnt/ssd/jenkins/workspace/Lucene-Solr-trunk-Linux/solr/build/solr-core/test-files/solr/collection1/lib/classes/' to classloader
[junit4] 2> 619162 T2768 oasc.SolrResourceLoader.replaceClassLoader Adding 'file:/mnt/ssd/jenkins/workspace/Lucene-Solr-trunk-Linux/solr/build/solr-core/test-files/solr/collection1/lib/README' to classloader
[junit4] 2> 619196 T2768 oasc.SolrConfig.<init> Using Lucene MatchVersion: LUCENE_50
[junit4] 2> 619237 T2768 oasc.SolrConfig.<init> Loaded SolrConfig: solrconfig.xml
[junit4] 2> 619237 T2768 oass.IndexSchema.readSchema Reading Solr Schema from schema12.xml
[junit4] 2> 619243 T2768 oass.IndexSchema.readSchema [null] Schema name=test
[junit4] 2> 619286 T9 oasc.CoreContainer.finalize ERROR CoreContainer was not shutdown prior to finalize(), indicates a bug -- POSSIBLE RESOURCE LEAK!!! instance=-526012740
[junit4] 2> 619531 T2768 oass.IndexSchema.readSchema default search field in schema is text
[junit4] 2> 619533 T2768 oass.IndexSchema.readSchema unique key field: id
[junit4] 2> 619535 T2768 oass.IndexSchema.readSchema WARN Field text is not multivalued and destination for multiple copyFields (2)
[junit4] 2> 619541 T2768 oass.FileExchangeRateProvider.reload Reloading exchange rates from file currency.xml
[junit4] 2> 619544 T2768 oass.FileExchangeRateProvider.reload Reloading exchange rates from file currency.xml
[junit4] 2> 619547 T2768 oasc.SolrResourceLoader.locateSolrHome JNDI not configured for solr (NoInitialContextEx)
[junit4] 2> 619548 T2768 oasc.SolrResourceLoader.locateSolrHome using system property solr.solr.home: /mnt/ssd/jenkins/workspace/Lucene-Solr-trunk-Linux/solr/build/solr-core/test-files/solr
[junit4] 2> 619548 T2768 oasc.SolrResourceLoader.<init> new SolrResourceLoader for directory: '/mnt/ssd/jenkins/workspace/Lucene-Solr-trunk-Linux/solr/build/solr-core/test-files/solr/'
[junit4] 2> 619555 T2768 oasc.SolrResourceLoader.locateSolrHome JNDI not configured for solr (NoInitialContextEx)
[junit4] 2> 619556 T2768 oasc.SolrResourceLoader.locateSolrHome using system property solr.solr.home: /mnt/ssd/jenkins/workspace/Lucene-Solr-trunk-Linux/solr/build/solr-core/test-files/solr
[junit4] 2> 619556 T2768 oasc.SolrResourceLoader.<init> new SolrResourceLoader for deduced Solr Home: '/mnt/ssd/jenkins/workspace/Lucene-Solr-trunk-Linux/solr/build/solr-core/test-files/solr/'
[junit4] 2> 619593 T2768 oasc.CoreContainer.<init> New CoreContainer 31204415
[junit4] 2> 619593 T2768 oasc.CoreContainer.load Loading cores into CoreContainer [instanceDir=/mnt/ssd/jenkins/workspace/Lucene-Solr-trunk-Linux/solr/build/solr-core/test-files/solr/]
[junit4] 2> 619594 T2768 oashc.HttpShardHandlerFactory.getParameter Setting socketTimeout to: 0
[junit4] 2> 619594 T2768 oashc.HttpShardHandlerFactory.getParameter Setting urlScheme to: http://
[junit4] 2> 619595 T2768 oashc.HttpShardHandlerFactory.getParameter Setting connTimeout to: 0
[junit4] 2> 619595 T2768 oashc.HttpShardHandlerFactory.getParameter Setting maxConnectionsPerHost to: 20
[junit4] 2> 619595 T2768 oashc.HttpShardHandlerFactory.getParameter Setting corePoolSize to: 0
[junit4] 2> 619595 T2768 oashc.HttpShardHandlerFactory.getParameter Setting maximumPoolSize to: 2147483647
[junit4] 2> 619596 T2768 oashc.HttpShardHandlerFactory.getParameter Setting maxThreadIdleTime to: 5
[junit4] 2> 619596 T2768 oashc.HttpShardHandlerFactory.getParameter Setting sizeOfQueue to: -1
[junit4] 2> 619596 T2768 oashc.HttpShardHandlerFactory.getParameter Setting fairnessPolicy to: false
[junit4] 2> 619601 T2768 oasl.LogWatcher.createWatcher SLF4J impl is org.slf4j.impl.Log4jLoggerFactory
[junit4] 2> 619601 T2768 oasl.LogWatcher.newRegisteredLogWatcher Registering Log Listener [Log4j (org.slf4j.impl.Log4jLoggerFactory)]
[junit4] 2> 619602 T2768 oasc.CoreContainer.load Host Name:
[junit4] 2> 619604 T2769 oasc.CoreContainer.create Creating SolrCore 'collection1' using instanceDir: /mnt/ssd/jenkins/workspace/Lucene-Solr-trunk-Linux/solr/build/solr-core/test-files/solr/collection1
[junit4] 2> 619605 T2769 oasc.SolrResourceLoader.<init> new SolrResourceLoader for directory: '/mnt/ssd/jenkins/workspace/Lucene-Solr-trunk-Linux/solr/build/solr-core/test-files/solr/collection1/'
[junit4] 2> 619605 T2769 oasc.SolrResourceLoader.replaceClassLoader Adding 'file:/mnt/ssd/jenkins/workspace/Lucene-Solr-trunk-Linux/solr/build/solr-core/test-files/solr/collection1/lib/classes/' to classloader
[junit4] 2> 619606 T2769 oasc.SolrResourceLoader.replaceClassLoader Adding 'file:/mnt/ssd/jenkins/workspace/Lucene-Solr-trunk-Linux/solr/build/solr-core/test-files/solr/collection1/lib/README' to classloader
[junit4] 2> 619642 T2769 oasc.SolrConfig.<init> Using Lucene MatchVersion: LUCENE_50
[junit4] 2> 619688 T2769 oasc.SolrConfig.<init> Loaded SolrConfig: solrconfig.xml
[junit4] 2> 619688 T2769 oass.IndexSchema.readSchema Reading Solr Schema from schema12.xml
[junit4] 2> 619694 T2769 oass.IndexSchema.readSchema [collection1] Schema name=test
[junit4] 2> 619972 T2769 oass.IndexSchema.readSchema default search field in schema is text
[junit4] 2> 619975 T2769 oass.IndexSchema.readSchema unique key field: id
[junit4] 2> 619976 T2769 oass.IndexSchema.readSchema WARN Field text is not multivalued and destination for multiple copyFields (2)
[junit4] 2> 619982 T2769 oass.FileExchangeRateProvider.reload Reloading exchange rates from file currency.xml
[junit4] 2> 619987 T2769 oass.FileExchangeRateProvider.reload Reloading exchange rates from file currency.xml
[junit4] 2> 619993 T2769 oasc.SolrCore.initDirectoryFactory org.apache.solr.core.MockDirectoryFactory
[junit4] 2> 619993 T2769 oasc.SolrCore.<init> [collection1] Opening new SolrCore at /mnt/ssd/jenkins/workspace/Lucene-Solr-trunk-Linux/solr/build/solr-core/test-files/solr/collection1/, dataDir=/mnt/ssd/jenkins/workspace/Lucene-Solr-trunk-Linux/solr/build/solr-core/test/J0/./solrtest-SignatureUpdateProcessorFactoryTest-1387590270363/
[junit4] 2> 619994 T2769 oasc.JmxMonitoredMap.<init> JMX monitoring is enabled. Adding Solr mbeans to JMX Server: com.sun.jmx.mbeanserver.JmxMBeanServer@b863ab6e
[junit4] 2> 619995 T2769 oasc.CachingDirectoryFactory.get return new directory for /mnt/ssd/jenkins/workspace/Lucene-Solr-trunk-Linux/solr/build/solr-core/test/J0/./solrtest-SignatureUpdateProcessorFactoryTest-1387590270363
[junit4] 2> 619995 T2769 oasc.SolrCore.getNewIndexDir New index directory detected: old=null new=/mnt/ssd/jenkins/workspace/Lucene-Solr-trunk-Linux/solr/build/solr-core/test/J0/./solrtest-SignatureUpdateProcessorFactoryTest-1387590270363/index/
[junit4] 2> 619996 T2769 oasc.SolrCore.initIndex WARN [collection1] Solr index directory '/mnt/ssd/jenkins/workspace/Lucene-Solr-trunk-Linux/solr/build/solr-core/test/J0/./solrtest-SignatureUpdateProcessorFactoryTest-1387590270363/index' doesn't exist. Creating new index...
[junit4] 2> 619996 T2769 oasc.CachingDirectoryFactory.get return new directory for /mnt/ssd/jenkins/workspace/Lucene-Solr-trunk-Linux/solr/build/solr-core/test/J0/./solrtest-SignatureUpdateProcessorFactoryTest-1387590270363/index
[junit4] 2> 619997 T2769 oasu.RandomMergePolicy.<init> RandomMergePolicy wrapping class org.apache.lucene.index.LogByteSizeMergePolicy: [LogByteSizeMergePolicy: minMergeSize=1677721, mergeFactor=35, maxMergeSize=2147483648, maxMergeSizeForForcedMerge=9223372036854775807, calibrateSizeByDeletes=false, maxMergeDocs=2147483647, maxCFSSegmentSizeMB=8.796093022207999E12, noCFSRatio=0.6166189613121833]
[junit4] 2> 619998 T2769 oasc.SolrDeletionPolicy.onCommit SolrDeletionPolicy.onCommit: commits: num=1
[junit4] 2> commit{dir=RateLimitedDirectoryWrapper(MockDirectoryWrapper(org.apache.lucene.store.RAMDirectory@32a5f852 lockFactory=org.apache.lucene.store.SingleInstanceLockFactory@8712b348)),segFN=segments_1,generation=1}
[junit4] 2> 619998 T2769 oasc.SolrDeletionPolicy.updateCommits newest commit generation = 1
[junit4] 2> 619999 T2769 oasc.SolrCore.initWriters created xml: solr.XMLResponseWriter
[junit4] 2> 620002 T2769 oasup.UpdateRequestProcessorChain.init creating updateRequestProcessorChain "dedupe"
[junit4] 2> 620003 T2769 oasup.UpdateRequestProcessorChain.init inserting DistributedUpdateProcessorFactory into updateRequestProcessorChain "dedupe"
[junit4] 2> 620003 T2769 oasup.UpdateRequestProcessorChain.init creating updateRequestProcessorChain "dedupe-allfields"
[junit4] 2> 620004 T2769 oasup.UpdateRequestProcessorChain.init inserting DistributedUpdateProcessorFactory into updateRequestProcessorChain "dedupe-allfields"
[junit4] 2> 620004 T2769 oasup.UpdateRequestProcessorChain.init creating updateRequestProcessorChain "stored_sig"
[junit4] 2> 620005 T2769 oasup.UpdateRequestProcessorChain.init inserting DistributedUpdateProcessorFactory into updateRequestProcessorChain "stored_sig"
[junit4] 2> 620005 T2769 oasup.UpdateRequestProcessorChain.init creating updateRequestProcessorChain "uniq-fields"
[junit4] 2> 620006 T2769 oasup.UpdateRequestProcessorChain.init inserting DistributedUpdateProcessorFactory into updateRequestProcessorChain "uniq-fields"
[junit4] 2> 620006 T2769 oasup.UpdateRequestProcessorChain.init creating updateRequestProcessorChain "distrib-dup-test-chain-explicit"
[junit4] 2> 620007 T2769 oasup.UpdateRequestProcessorChain.init creating updateRequestProcessorChain "distrib-dup-test-chain-implicit"
[junit4] 2> 620007 T2769 oasup.UpdateRequestProcessorChain.init inserting DistributedUpdateProcessorFactory into updateRequestProcessorChain "distrib-dup-test-chain-implicit"
[junit4] 2> 620008 T2769 oasc.SolrCore.loadUpdateProcessorChains no updateRequestProcessorChain defined as default, creating implicit default
[junit4] 2> 620008 T2769 oasc.RequestHandlers.initHandlersFromConfig adding lazy requestHandler: solr.ReplicationHandler
[junit4] 2> 620009 T2769 oasc.RequestHandlers.initHandlersFromConfig created /replication: solr.ReplicationHandler
[junit4] 2> 620009 T2769 oasc.RequestHandlers.initHandlersFromConfig created standard: solr.StandardRequestHandler
[junit4] 2> 620010 T2769 oasc.RequestHandlers.initHandlersFromConfig created /get: solr.RealTimeGetHandler
[junit4] 2> 620011 T2769 oasc.RequestHandlers.initHandlersFromConfig created dismax: solr.SearchHandler
[junit4] 2> 620011 T2769 oasc.RequestHandlers.initHandlersFromConfig created mock: org.apache.solr.core.MockQuerySenderListenerReqHandler
[junit4] 2> 620012 T2769 oasc.RequestHandlers.initHandlersFromConfig created /admin/: org.apache.solr.handler.admin.AdminHandlers
[junit4] 2> 620012 T2769 oasc.RequestHandlers.initHandlersFromConfig created /admin/file: solr.admin.ShowFileRequestHandler
[junit4] 2> 620013 T2769 oasc.RequestHandlers.initHandlersFromConfig created /admin/fileedit: solr.admin.EditFileRequestHandler
[junit4] 2> 620014 T2769 oasc.RequestHandlers.initHandlersFromConfig created defaults: solr.StandardRequestHandler
[junit4] 2> 620014 T2769 oasc.RequestHandlers.initHandlersFromConfig adding lazy requestHandler: solr.StandardRequestHandler
[junit4] 2> 620015 T2769 oasc.RequestHandlers.initHandlersFromConfig created lazy: solr.StandardRequestHandler
[junit4] 2> 620015 T2769 oasc.RequestHandlers.initHandlersFromConfig created /update: solr.UpdateRequestHandler
[junit4] 2> 620016 T2769 oasc.RequestHandlers.initHandlersFromConfig created /terms: org.apache.solr.handler.component.SearchHandler
[junit4] 2> 620016 T2769 oasc.RequestHandlers.initHandlersFromConfig created spellCheckCompRH: org.apache.solr.handler.component.SearchHandler
[junit4] 2> 620017 T2769 oasc.RequestHandlers.initHandlersFromConfig created spellCheckCompRH_Direct: org.apache.solr.handler.component.SearchHandler
[junit4] 2> 620018 T2769 oasc.RequestHandlers.initHandlersFromConfig created spellCheckWithWordbreak: org.apache.solr.handler.component.SearchHandler
[junit4] 2> 620018 T2769 oasc.RequestHandlers.initHandlersFromConfig created spellCheckWithWordbreak_Direct: org.apache.solr.handler.component.SearchHandler
[junit4] 2> 620019 T2769 oasc.RequestHandlers.initHandlersFromConfig created spellCheckCompRH1: org.apache.solr.handler.component.SearchHandler
[junit4] 2> 620019 T2769 oasc.RequestHandlers.initHandlersFromConfig created mltrh: org.apache.solr.handler.component.SearchHandler
[junit4] 2> 620020 T2769 oasc.RequestHandlers.initHandlersFromConfig created tvrh: org.apache.solr.handler.component.SearchHandler
[junit4] 2> 620021 T2769 oasc.RequestHandlers.initHandlersFromConfig created /mlt: solr.MoreLikeThisHandler
[junit4] 2> 620021 T2769 oasc.RequestHandlers.initHandlersFromConfig created /debug/dump: solr.DumpRequestHandler
[junit4] 2> 620023 T2769 oashl.XMLLoader.init xsltCacheLifetimeSeconds=60
[junit4] 2> 620025 T2769 oasc.SolrCore.initDeprecatedSupport WARN solrconfig.xml uses deprecated <admin/gettableFiles>, Please update your config to use the ShowFileRequestHandler.
[junit4] 2> 620028 T2769 oasu.CommitTracker.<init> Hard AutoCommit: disabled
[junit4] 2> 620028 T2769 oasu.CommitTracker.<init> Soft AutoCommit: disabled
[junit4] 2> 620029 T2769 oasu.RandomMergePolicy.<init> RandomMergePolicy wrapping class org.apache.lucene.index.TieredMergePolicy: [TieredMergePolicy: maxMergeAtOnce=36, maxMergeAtOnceExplicit=19, maxMergedSegmentMB=9.89453125, floorSegmentMB=1.1904296875, forceMergeDeletesPctAllowed=3.504605507404477, segmentsPerTier=35.0, maxCFSSegmentSizeMB=8.796093022207999E12, noCFSRatio=0.15083082244729643
[junit4] 2> 620030 T2769 oasc.SolrDeletionPolicy.onInit SolrDeletionPolicy.onInit: commits: num=1
[junit4] 2> commit{dir=RateLimitedDirectoryWrapper(MockDirectoryWrapper(org.apache.lucene.store.RAMDirectory@32a5f852 lockFactory=org.apache.lucene.store.SingleInstanceLockFactory@8712b348)),segFN=segments_1,generation=1}
[junit4] 2> 620031 T2769 oasc.SolrDeletionPolicy.updateCommits newest commit generation = 1
[junit4] 2> 620031 T2769 oass.SolrIndexSearcher.<init> Opening Searcher@7874fc45 main
[junit4] 2> 620032 T2769 oashc.SpellCheckComponent.inform Initializing spell checkers
[junit4] 2> 620112 T2769 oass.DirectSolrSpellChecker.init init: {name=direct,classname=DirectSolrSpellChecker,field=lowerfilt,minQueryLength=3}
[junit4] 2> 620130 T2770 oasc.SolrCore.registerSearcher [collection1] Registered new searcher Searcher@7874fc45 main{StandardDirectoryReader(segments_1:1:nrt)}
[junit4] 2> 620133 T2769 oasc.CoreContainer.registerCore registering core: collection1
[junit4] 2> 620134 T2768 oas.SolrTestCaseJ4.initCore ####initCore end
[junit4] 2> 620137 T2768 oas.SolrTestCaseJ4.setUp ###Starting testDupeDetection
[junit4] 2> ASYNC NEW_CORE C1179 name=collection1 org.apache.solr.core.SolrCore@aa186639
[junit4] 2> 620142 T2768 C1179 oasu.DirectUpdateHandler2.deleteAll [collection1] REMOVING ALL DOCUMENTS FROM INDEX
[junit4] 2> 620143 T2768 C1179 oasup.LogUpdateProcessor.finish [collection1] webapp=null path=null params={} {deleteByQuery=*:*} 0 1
[junit4] 2> 620150 T2768 C1179 oasu.DirectUpdateHandler2.commit start commit{,optimize=false,openSearcher=true,waitSearcher=true,expungeDeletes=false,softCommit=false,prepareCommit=false}
[junit4] 2> 620151 T2768 C1179 oasc.SolrDeletionPolicy.onCommit SolrDeletionPolicy.onCommit: commits: num=2
[junit4] 2> commit{dir=RateLimitedDirectoryWrapper(MockDirectoryWrapper(org.apache.lucene.store.RAMDirectory@32a5f852 lockFactory=org.apache.lucene.store.SingleInstanceLockFactory@8712b348)),segFN=segments_1,generation=1}
[junit4] 2> commit{dir=RateLimitedDirectoryWrapper(MockDirectoryWrapper(org.apache.lucene.store.RAMDirectory@32a5f852 lockFactory=org.apache.lucene.store.SingleInstanceLockFactory@8712b348)),segFN=segments_2,generation=2}
[junit4] 2> 620152 T2768 C1179 oasc.SolrDeletionPolicy.updateCommits newest commit generation = 2
[junit4] 2> 620152 T2768 C1179 oass.SolrIndexSearcher.<init> Opening Searcher@f270f12c main
[junit4] 2> 620153 T2768 C1179 oasu.DirectUpdateHandler2.commit end_commit_flush
[junit4] 2> 620155 T2770 oasc.SolrCore.registerSearcher [collection1] Registered new searcher Searcher@f270f12c main{StandardDirectoryReader(segments_2:2:nrt)}
[junit4] 2> 620155 T2768 C1179 oasup.LogUpdateProcessor.finish [collection1] webapp=null path=null params={} {commit=} 0 5
[junit4] 2> 620162 T2768 oasu.DirectUpdateHandler2.commit start commit{,optimize=false,openSearcher=true,waitSearcher=true,expungeDeletes=false,softCommit=false,prepareCommit=false}
[junit4] 2> 620164 T2768 oasc.SolrDeletionPolicy.onCommit SolrDeletionPolicy.onCommit: commits: num=2
[junit4] 2> commit{dir=RateLimitedDirectoryWrapper(MockDirectoryWrapper(org.apache.lucene.store.RAMDirectory@32a5f852 lockFactory=org.apache.lucene.store.SingleInstanceLockFactory@8712b348)),segFN=segments_2,generation=2}
[junit4] 2> commit{dir=RateLimitedDirectoryWrapper(MockDirectoryWrapper(org.apache.lucene.store.RAMDirectory@32a5f852 lockFactory=org.apache.lucene.store.SingleInstanceLockFactory@8712b348)),segFN=segments_3,generation=3}
[junit4] 2> 620165 T2768 oasc.SolrDeletionPolicy.updateCommits newest commit generation = 3
[junit4] 2> 620165 T2768 oass.SolrIndexSearcher.<init> Opening Searcher@ae1ad79c main
[junit4] 2> 620166 T2768 oasu.DirectUpdateHandler2.commit end_commit_flush
[junit4] 2> 620168 T2770 oasc.SolrCore.registerSearcher [collection1] Registered new searcher Searcher@ae1ad79c main{StandardDirectoryReader(segments_3:4:nrt _0(5.0):C2)}
[junit4] 2> 620171 T2768 oasu.DirectUpdateHandler2.commit start commit{,optimize=false,openSearcher=true,waitSearcher=true,expungeDeletes=false,softCommit=false,prepareCommit=false}
[junit4] 2> 620172 T2768 oasc.SolrDeletionPolicy.onCommit SolrDeletionPolicy.onCommit: commits: num=2
[junit4] 2> commit{dir=RateLimitedDirectoryWrapper(MockDirectoryWrapper(org.apache.lucene.store.RAMDirectory@32a5f852 lockFactory=org.apache.lucene.store.SingleInstanceLockFactory@8712b348)),segFN=segments_3,generation=3}
[junit4] 2> commit{dir=RateLimitedDirectoryWrapper(MockDirectoryWrapper(org.apache.lucene.store.RAMDirectory@32a5f852 lockFactory=org.apache.lucene.store.SingleInstanceLockFactory@8712b348)),segFN=segments_4,generation=4}
[junit4] 2> 620173 T2768 oasc.SolrDeletionPolicy.updateCommits newest commit generation = 4
[junit4] 2> 620174 T2768 oass.SolrIndexSearcher.<init> Opening Searcher@8b6266dc main
[junit4] 2> 620174 T2768 oasu.DirectUpdateHandler2.commit end_commit_flush
[junit4] 2> 620176 T2770 oasc.SolrCore.registerSearcher [collection1] Registered new searcher Searcher@8b6266dc main{StandardDirectoryReader(segments_4:7:nrt _0(5.0):C2/1:delGen=1 _1(5.0):C1)}
[junit4] 2> 620177 T2768 oas.SolrTestCaseJ4.tearDown ###Ending testDupeDetection
[junit4] 2> NOTE: reproduce with: ant test -Dtestcase=SignatureUpdateProcessorFactoryTest -Dtests.method=testDupeDetection -Dtests.seed=F25540B5979677D -Dtests.multiplier=3 -Dtests.slow=true -Dtests.locale=sv_SE_PREEURO -Dtests.timezone=America/New_York -Dtests.file.encoding=UTF-8
[junit4] FAILURE 0.05s J0 | SignatureUpdateProcessorFactoryTest.testDupeDetection <<<
[junit4] > Throwable #1: java.lang.AssertionError: expected:<1> but was:<2>
[junit4] > at __randomizedtesting.SeedInfo.seed([F25540B5979677D:5415AFC35A3EC401]:0)
[junit4] > at org.apache.solr.update.processor.SignatureUpdateProcessorFactoryTest.checkNumDocs(SignatureUpdateProcessorFactoryTest.java:71)
[junit4] > at org.apache.solr.update.processor.SignatureUpdateProcessorFactoryTest.testDupeDetection(SignatureUpdateProcessorFactoryTest.java:119)
[junit4] > at java.lang.Thread.run(Thread.java:780)
[junit4] 2> 620184 T2768 oas.SolrTestCaseJ4.setUp ###Starting testMultiThreaded
[junit4] 2> ASYNC NEW_CORE C1180 name=collection1 org.apache.solr.core.SolrCore@aa186639
[junit4] 2> 620196 T2768 C1180 oasu.DirectUpdateHandler2.deleteAll [collection1] REMOVING ALL DOCUMENTS FROM INDEX
[junit4] 2> 620197 T2768 C1180 oasup.LogUpdateProcessor.finish [collection1] webapp=null path=null params={} {deleteByQuery=*:*} 0 1
[junit4] 2> 620205 T2768 C1180 oasu.DirectUpdateHandler2.commit start commit{,optimize=false,openSearcher=true,waitSearcher=true,expungeDeletes=false,softCommit=false,prepareCommit=false}
[junit4] 2> 620206 T2768 C1180 oasc.SolrDeletionPolicy.onCommit SolrDeletionPolicy.onCommit: commits: num=2
[junit4] 2> commit{dir=RateLimitedDirectoryWrapper(MockDirectoryWrapper(org.apache.lucene.store.RAMDirectory@32a5f852 lockFactory=org.apache.lucene.store.SingleInstanceLockFactory@8712b348)),segFN=segments_4,generation=4}
[junit4] 2> commit{dir=RateLimitedDirectoryWrapper(MockDirectoryWrapper(org.apache.lucene.store.RAMDirectory@32a5f852 lockFactory=org.apache.lucene.store.SingleInstanceLockFactory@8712b348)),segFN=segments_5,generation=5}
[junit4] 2> 620207 T2768 C1180 oasc.SolrDeletionPolicy.updateCommits newest commit generation = 5
[junit4] 2> 620209 T2768 C1180 oass.SolrIndexSearcher.<init> Opening Searcher@f5022675 main
[junit4] 2> 620210 T2768 C1180 oasu.DirectUpdateHandler2.commit end_commit_flush
[junit4] 2> 620211 T2770 oasc.SolrCore.registerSearcher [collection1] Registered new searcher Searcher@f5022675 main{StandardDirectoryReader(segments_5:8:nrt)}
[junit4] 2> 620211 T2768 C1180 oasup.LogUpdateProcessor.finish [collection1] webapp=null path=null params={} {commit=} 0 6
[junit4] 2> 620228 T2780 oasu.DirectUpdateHandler2.commit start commit{,optimize=false,openSearcher=true,waitSearcher=true,expungeDeletes=false,softCommit=false,prepareCommit=false}
[junit4] 2> 620242 T2780 oasc.SolrDeletionPolicy.onCommit SolrDeletionPolicy.onCommit: commits: num=2
[junit4] 2> commit{dir=RateLimitedDirectoryWrapper(MockDirectoryWrapper(org.apache.lucene.store.RAMDirectory@32a5f852 lockFactory=org.apache.lucene.store.SingleInstanceLockFactory@8712b348)),segFN=segments_5,generation=5}
[junit4] 2> commit{dir=RateLimitedDirectoryWrapper(MockDirectoryWrapper(org.apache.lucene.store.RAMDirectory@32a5f852 lockFactory=org.apache.lucene.store.SingleInstanceLockFactory@8712b348)),segFN=segments_6,generation=6}
[junit4] 2> 620242 T2780 oasc.SolrDeletionPolicy.updateCommits newest commit generation = 6
[junit4] 2> 620252 T2780 oass.SolrIndexSearcher.<init> Opening Searcher@4bae8712 main
[junit4] 2> 620252 T2780 oasu.DirectUpdateHandler2.commit end_commit_flush
[junit4] 2> 620254 T2779 oasu.DirectUpdateHandler2.commit start commit{,optimize=false,openSearcher=true,waitSearcher=true,expungeDeletes=false,softCommit=false,prepareCommit=false}
[junit4] 2> 620254 T2770 oasc.SolrCore.registerSearcher [collection1] Registered new searcher Searcher@4bae8712 main{StandardDirectoryReader(segments_6:24:nrt _6(5.0):C19/17:delGen=1)}
[junit4] 2> 620264 T2779 oasc.SolrDeletionPolicy.onCommit SolrDeletionPolicy.onCommit: commits: num=2
[junit4] 2> commit{dir=RateLimitedDirectoryWrapper(MockDirectoryWrapper(org.apache.lucene.store.RAMDirectory@32a5f852 lockFactory=org.apache.lucene.store.SingleInstanceLockFactory@8712b348)),segFN=segments_6,generation=6}
[junit4] 2> commit{dir=RateLimitedDirectoryWrapper(MockDirectoryWrapper(org.apache.lucene.store.RAMDirectory@32a5f852 lockFactory=org.apache.lucene.store.SingleInstanceLockFactory@8712b348)),segFN=segments_7,generation=7}
[junit4] 2> 620265 T2779 oasc.SolrDeletionPolicy.updateCommits newest commit generation = 7
[junit4] 2> 620279 T2779 oass.SolrIndexSearcher.<init> Opening Searcher@72fb1dd5 main
[junit4] 2> 620284 T2770 oasc.SolrCore.registerSearcher [collection1] Registered new searcher Searcher@72fb1dd5 main{StandardDirectoryReader(segments_7:40:nrt _a(5.0):C18/16:delGen=1)}
[junit4] 2> 620285 T2779 oasu.DirectUpdateHandler2.commit end_commit_flush
[junit4] 2> 620286 T2781 oasu.DirectUpdateHandler2.commit start commit{,optimize=false,openSearcher=true,waitSearcher=true,expungeDeletes=false,softCommit=false,prepareCommit=false}
[junit4] 2> 620322 T2781 oasc.SolrDeletionPolicy.onCommit SolrDeletionPolicy.onCommit: commits: num=2
[junit4] 2> commit{dir=RateLimitedDirectoryWrapper(MockDirectoryWrapper(org.apache.lucene.store.RAMDirectory@32a5f852 lockFactory=org.apache.lucene.store.SingleInstanceLockFactory@8712b348)),segFN=segments_7,generation=7}
[junit4] 2> commit{dir=RateLimitedDirectoryWrapper(MockDirectoryWrapper(org.apache.lucene.store.RAMDirectory@32a5f852 lockFactory=org.apache.lucene.store.SingleInstanceLockFactory@8712b348)),segFN=segments_8,generation=8}
[junit4] 2> 620323 T2781 oasc.SolrDeletionPolicy.updateCommits newest commit generation = 8
[junit4] 2> 620388 T2781 oass.SolrIndexSearcher.<init> Opening Searcher@76e5bee6 main
[junit4] 2> 620389 T2781 oasu.DirectUpdateHandler2.commit end_commit_flush
[junit4] 2> 620390 T2780 oasu.DirectUpdateHandler2.commit start commit{,optimize=false,openSearcher=true,waitSearcher=true,expungeDeletes=false,softCommit=false,prepareCommit=false}
[junit4] 2> 620391 T2770 oasc.SolrCore.registerSearcher [collection1] Registered new searcher Searcher@76e5bee6 main{StandardDirectoryReader(segments_8:55:nrt _g(5.0):C11/10:delGen=1 _h(5.0):C27/26:delGen=1)}
[junit4] 2> 620398 T2780 oasc.SolrDeletionPolicy.onCommit SolrDeletionPolicy.onCommit: commits: num=2
[junit4] 2> commit{dir=RateLimitedDirectoryWrapper(MockDirectoryWrapper(org.apache.lucene.store.RAMDirectory@32a5f852 lockFactory=org.apache.lucene.store.SingleInstanceLockFactory@8712b348)),segFN=segments_8,generation=8}
[junit4] 2> commit{dir=RateLimitedDirectoryWrapper(MockDirectoryWrapper(org.apache.lucene.store.RAMDirectory@32a5f852 lockFactory=org.apache.lucene.store.SingleInstanceLockFactory@8712b348)),segFN=segments_9,generation=9}
[junit4] 2> 620402 T2780 oasc.SolrDeletionPolicy.updateCommits newest commit generation = 9
[junit4] 2> 620405 T2780 oass.SolrIndexSearcher.<init> Opening Searcher@94175c5b main
[junit4] 2> 620406 T2780 oasu.DirectUpdateHandler2.commit end_commit_flush
[junit4] 2> 620407 T2779 oasu.DirectUpdateHandler2.commit start commit{,optimize=false,openSearcher=true,waitSearcher=true,expungeDeletes=false,softCommit=false,prepareCommit=false}
[junit4] 2> 620407 T2770 oasc.SolrCore.registerSearcher [collection1] Registered new searcher Searcher@94175c5b main{StandardDirectoryReader(segments_9:64:nrt _l(5.0):C6/4:delGen=1)}
[junit4] 2> 620409 T2779 oasc.SolrDeletionPolicy.onCommit SolrDeletionPolicy.onCommit: commits: num=2
[junit4] 2> commit{dir=RateLimitedDirectoryWrapper(MockDirectoryWrapper(org.apache.lucene.store.RAMDirectory@32a5f852 lockFactory=org.apache.lucene.store.SingleInstanceLockFactory@8712b348)),segFN=segments_9,generation=9}
[junit4] 2> commit{dir=RateLimitedDirectoryWrapper(MockDirectoryWrapper(org.apache.lucene.store.RAMDirectory@32a5f852 lockFactory=org.apache.lucene.store.SingleInstanceLockFactory@8712b348)),segFN=segments_a,generation=10}
[junit4] 2> 620410 T2779 oasc.SolrDeletionPolicy.updateCommits newest commit generation = 10
[junit4] 2> 620413 T2779 oass.SolrIndexSearcher.<init> Opening Searcher@942d53be main
[junit4] 2> 620414 T2779 oasu.DirectUpdateHandler2.commit end_commit_flush
[junit4] 2> 620414 T2781 oasu.DirectUpdateHandler2.commit start commit{,optimize=false,openSearcher=true,waitSearcher=true,expungeDeletes=false,softCommit=false,prepareCommit=false}
[junit4] 2> 620415 T2770 oasc.SolrCore.registerSearcher [collection1] Registered new searcher Searcher@942d53be main{StandardDirectoryReader(segments_a:70:nrt _m(5.0):C3/2:delGen=1 _n(5.0):C2/1:delGen=1)}
[junit4] 2> 620415 T2781 oasc.SolrDeletionPolicy.onCommit SolrDeletionPolicy.onCommit: commits: num=2
[junit4] 2> commit{dir=RateLimitedDirectoryWrapper(MockDirectoryWrapper(org.apache.lucene.store.RAMDirectory@32a5f852 lockFactory=org.apache.lucene.store.SingleInstanceLockFactory@8712b348)),segFN=segments_a,generation=10}
[junit4] 2> commit{dir=RateLimitedDirectoryWrapper(MockDirectoryWrapper(org.apache.lucene.store.RAMDirectory@32a5f852 lockFactory=org.apache.lucene.store.SingleInstanceLockFactory@8712b348)),segFN=segments_b,generation=11}
[junit4] 2> 620415 T2781 oasc.SolrDeletionPolicy.updateCommits newest commit generation = 11
[junit4] 2> 620416 T2781 oass.SolrIndexSearcher.<init> Opening Searcher@306951ae main
[junit4] 2> 620416 T2781 oasu.DirectUpdateHandler2.commit end_commit_flush
[junit4] 2> 620417 T2780 oasu.DirectUpdateHandler2.commit start commit{,optimize=false,openSearcher=true,waitSearcher=true,expungeDeletes=false,softCommit=false,prepareCommit=false}
[junit4] 2> 620417 T2780 oasu.DirectUpdateHandler2.commit No uncommitted changes. Skipping IW.commit.
[junit4] 2> 620418 T2770 oasc.SolrCore.registerSearcher [collection1] Registered new searcher Searcher@306951ae main{StandardDirectoryReader(segments_a:70:nrt _m(5.0):C3/2:delGen=1 _n(5.0):C2/1:delGen=1)}
[junit4] 2> 620420 T2780 oass.SolrIndexSearcher.<init> Opening Searcher@1fe4c72f main
[junit4] 2> 620421 T2780 oasu.DirectUpdateHandler2.commit end_commit_flush
[junit4] 2> 620422 T2779 oasu.DirectUpdateHandler2.commit start commit{,optimize=false,openSearcher=true,waitSearcher=true,expungeDeletes=false,softCommit=false,prepareCommit=false}
[junit4] 2> 620423 T2770 oasc.SolrCore.registerSearcher [collection1] Registered new searcher Searcher@1fe4c72f main{StandardDirectoryReader(segments_b:75:nrt _m(5.0):C3/2:delGen=1 _o(5.0):C1)}
[junit4] 2> 620424 T2779 oasc.SolrDeletionPolicy.onCommit SolrDeletionPolicy.onCommit: commits: num=2
[junit4] 2> commit{dir=RateLimitedDirectoryWrapper(MockDirectoryWrapper(org.apache.lucene.store.RAMDirectory@32a5f852 lockFactory=org.apache.lucene.store.SingleInstanceLockFactory@8712b348)),segFN=segments_b,generation=11}
[junit4] 2> commit{dir=RateLimitedDirectoryWrapper(MockDirectoryWrapper(org.apache.lucene.store.RAMDirectory@32a5f852 lockFactory=org.apache.lucene.store.SingleInstanceLockFactory@8712b348)),segFN=segments_c,generation=12}
[junit4] 2> 620424 T2779 oasc.SolrDeletionPolicy.updateCommits newest commit generation = 12
[junit4] 2> 620425 T2779 oass.SolrIndexSearcher.<init> Opening Searcher@6ac008ae main
[junit4] 2> 620426 T2779 oasu.DirectUpdateHandler2.commit end_commit_flush
[junit4] 2> 620426 T2781 oasu.DirectUpdateHandler2.commit start commit{,optimize=false,openSearcher=true,waitSearcher=true,expungeDeletes=false,softCommit=false,prepareCommit=false}
[junit4] 2> 620428 T2770 oasc.SolrCore.registerSearcher [collection1] Registered new searcher Searcher@6ac008ae main{StandardDirectoryReader(segments_c:78:nrt _p(5.0):C1)}
[junit4] 2> 620429 T2781 oasc.SolrDeletionPolicy.onCommit SolrDeletionPolicy.onCommit: commits: num=2
[junit4] 2> commit{dir=RateLimitedDirectoryWrapper(MockDirectoryWrapper(org.apache.lucene.store.RAMDirectory@32a5f852 lockFactory=org.apache.lucene.store.SingleInstanceLockFactory@8712b348)),segFN=segments_c,generation=12}
[junit4] 2> commit{dir=RateLimitedDirectoryWrapper(MockDirectoryWrapper(org.apache.lucene.store.RAMDirectory@32a5f852 lockFactory=org.apache.lucene.store.SingleInstanceLockFactory@8712b348)),segFN=segments_d,generation=13}
[junit4] 2> 620429 T2781 oasc.SolrDeletionPolicy.updateCommits newest commit generation = 13
[junit4] 2> 620430 T2781 oass.SolrIndexSearcher.<init> Opening Searcher@12654287 main
[junit4] 2> 620430 T2781 oasu.DirectUpdateHandler2.commit end_commit_flush
[junit4] 2> 620431 T2780 oasu.DirectUpdateHandler2.commit start commit{,optimize=false,openSearcher=true,waitSearcher=true,expungeDeletes=false,softCommit=false,prepareCommit=false}
[junit4] 2> 620431 T2780 oasu.DirectUpdateHandler2.commit No uncommitted changes. Skipping IW.commit.
[junit4] 2> 620432 T2770 oasc.SolrCore.registerSearcher [collection1] Registered new searcher Searcher@12654287 main{StandardDirectoryReader(segments_d:82:nrt _q(5.0):C1)}
[junit4] 2> 620436 T2780 oass.SolrIndexSearcher.<init> Opening Searcher@e48c197 main
[junit4] 2> 620436 T2780 oasu.DirectUpdateHandler2.commit end_commit_flush
[junit4] 2> 620437 T2779 oasu.DirectUpdateHandler2.commit start commit{,optimize=false,openSearcher=true,waitSearcher=true,expungeDeletes=false,softCommit=false,prepareCommit=false}
[junit4] 2> 620438 T2770 oasc.SolrCore.registerSearcher [collection1] Registered new searcher Searcher@e48c197 main{StandardDirectoryReader(segments_d:87:nrt _r(5.0):C1)}
[junit4] 2> 620439 T2779 oasc.SolrDeletionPolicy.onCommit SolrDeletionPolicy.onCommit: commits: num=2
[junit4] 2> commit{dir=RateLimitedDirectoryWrapper(MockDirectoryWrapper(org.apache.lucene.store.RAMDirectory@32a5f852 lockFactory=org.apache.lucene.store.SingleInstanceLockFactory@8712b348)),segFN=segments_d,generation=13}
[junit4] 2> commit{dir=RateLimitedDirectoryWrapper(MockDirectoryWrapper(org.apache.lucene.store.RAMDirectory@32a5f852 lockFactory=org.apache.lucene.store.SingleInstanceLockFactory@8712b348)),segFN=segments_e,generation=14}
[junit4] 2> 620439 T2779 oasc.SolrDeletionPolicy.updateCommits newest commit generation = 14
[junit4] 2> 620440 T2779 oass.SolrIndexSearcher.<init> Opening Searcher@47533b6f main
[junit4] 2> 620440 T2779 oasu.DirectUpdateHandler2.commit end_commit_flush
[junit4] 2> 620442 T2781 oasu.DirectUpdateHandler2.commit start commit{,optimize=false,openSearcher=true,waitSearcher=true,expungeDeletes=false,softCommit=false,prepareCommit=false}
[junit4] 2> 620442 T2770 oasc.SolrCore.registerSearcher [collection1] Registered new searcher Searcher@47533b6f main{StandardDirectoryReader(segments_e:90:nrt _s(5.0):C1)}
[junit4] 2> 620444 T2781 oasc.SolrDeletionPolicy.onCommit SolrDeletionPolicy.onCommit: commits: num=2
[junit4] 2> commit{dir=RateLimitedDirectoryWrapper(MockDirectoryWrapper(org.apache.lucene.store.RAMDirectory@32a5f852 lockFactory=org.apache.lucene.store.SingleInstanceLockFactory@8712b348)),segFN=segments_e,generation=14}
[junit4] 2> commit{dir=RateLimitedDirectoryWrapper(MockDirectoryWrapper(org.apache.lucene
[...truncated too long message...]
="cma">+2MONTHS</str>
[junit4] > <str name="cme">+2YEARS</str>
[junit4] > <date name="dmma">1812-02-29T23:59:59Z</date>
[junit4] > <date name="dmme">1807-12-31T23:59:59Z</date>
[junit4] > <date name="max">1811-12-31T23:59:59Z</date>
[junit4] > <date name="median">1805-12-31T23:59:59Z</date>
[junit4] > </lst>
[junit4] > <lst name="pr">
[junit4] > <long name="count">100</long>
[junit4] > <double name="mc">1.2729436151389237E146</double>
[junit4] > <double name="mean">28.91</double>
[junit4] > <double name="su">3.9603293116911423E124</double>
[junit4] > <double name="sum">2891.0</double>
[junit4] > <long name="unique">36</long>
[junit4] > </lst>
[junit4] > <lst name="cnr">
[junit4] > <double name="c10">10.0</double>
[junit4] > <double name="c8">8.0</double>
[junit4] > </lst>
[junit4] > </lst>
[junit4] > </response>
[junit4] > at __randomizedtesting.SeedInfo.seed([F25540B5979677D:5728BFFD7DBB05AB]:0)
[junit4] > at org.apache.solr.analytics.AbstractAnalyticsStatsTest.getStatResult(AbstractAnalyticsStatsTest.java:113)
[junit4] > at org.apache.solr.analytics.expression.ExpressionTest.divideTest(ExpressionTest.java:106)
[junit4] > at java.lang.Thread.run(Thread.java:780)
[junit4] 2> 670904 T1473 oas.SolrTestCaseJ4.setUp ###Starting concatenateTest
[junit4] 2> 670908 T1473 oas.SolrTestCaseJ4.tearDown ###Ending concatenateTest
[junit4] 2> 670912 T1473 oas.SolrTestCaseJ4.setUp ###Starting powerTest
[junit4] 2> 670917 T1473 oas.SolrTestCaseJ4.tearDown ###Ending powerTest
[junit4] 2> 670918 T1473 oas.SolrTestCaseJ4.deleteCore ###deleteCore
[junit4] 2> 670919 T1473 oasc.CoreContainer.shutdown Shutting down CoreContainer instance=-298552526
[junit4] 2> 670919 T1473 oasc.SolrCore.close [collection1] CLOSING SolrCore org.apache.solr.core.SolrCore@f677a8ce
[junit4] 2> 670919 T1473 oasu.DirectUpdateHandler2.close closing DirectUpdateHandler2{commits=1,autocommits=0,soft autocommits=0,optimizes=0,rollbacks=0,expungeDeletes=0,docsPending=0,adds=0,deletesById=0,deletesByQuery=0,errors=0,cumulative_adds=100,cumulative_deletesById=0,cumulative_deletesByQuery=1,cumulative_errors=0}
[junit4] 2> 670920 T1473 oasu.SolrCoreState.decrefSolrCoreState Closing SolrCoreState
[junit4] 2> 670920 T1473 oasu.DefaultSolrCoreState.closeIndexWriter SolrCoreState ref count has reached 0 - closing IndexWriter
[junit4] 2> 670920 T1473 oasu.DefaultSolrCoreState.closeIndexWriter closing IndexWriter with IndexWriterCloser
[junit4] 2> 670921 T1473 oasc.SolrCore.closeSearcher [collection1] Closing main searcher on request.
[junit4] 2> 670921 T1473 oasc.CachingDirectoryFactory.close Closing MockDirectoryFactory - 2 directories currently being tracked
[junit4] 2> 670921 T1473 oasc.CachingDirectoryFactory.closeCacheValue looking to close /mnt/ssd/jenkins/workspace/Lucene-Solr-trunk-Linux/solr/build/solr-core/test/J1/./solrtest-ExpressionTest-1387590321307 [CachedDir<<refCount=0;path=/mnt/ssd/jenkins/workspace/Lucene-Solr-trunk-Linux/solr/build/solr-core/test/J1/./solrtest-ExpressionTest-1387590321307;done=false>>]
[junit4] 2> 670922 T1473 oasc.CachingDirectoryFactory.close Closing directory: /mnt/ssd/jenkins/workspace/Lucene-Solr-trunk-Linux/solr/build/solr-core/test/J1/./solrtest-ExpressionTest-1387590321307
[junit4] 2> 670922 T1473 oasc.CachingDirectoryFactory.closeCacheValue looking to close /mnt/ssd/jenkins/workspace/Lucene-Solr-trunk-Linux/solr/build/solr-core/test/J1/./solrtest-ExpressionTest-1387590321307/index [CachedDir<<refCount=0;path=/mnt/ssd/jenkins/workspace/Lucene-Solr-trunk-Linux/solr/build/solr-core/test/J1/./solrtest-ExpressionTest-1387590321307/index;done=false>>]
[junit4] 2> 670922 T1473 oasc.CachingDirectoryFactory.close Closing directory: /mnt/ssd/jenkins/workspace/Lucene-Solr-trunk-Linux/solr/build/solr-core/test/J1/./solrtest-ExpressionTest-1387590321307/index
[junit4] 2> NOTE: test params are: codec=Lucene46: {int_id=MockVariableIntBlock(baseBlockSize=72), date_dtd=MockVariableIntBlock(baseBlockSize=72), string_sd=MockVariableIntBlock(baseBlockSize=72), long_ld=MockVariableIntBlock(baseBlockSize=72), double_dd=MockFixedIntBlock(blockSize=1519), id=MockVariableIntBlock(baseBlockSize=72), float_fd=Pulsing41(freqCutoff=7 minBlockSize=90 maxBlockSize=255)}, docValues:{double_dd=DocValuesFormat(name=Memory), float_fd=DocValuesFormat(name=SimpleText), string_sd=DocValuesFormat(name=Lucene45), int_id=DocValuesFormat(name=Lucene45), doubledv=DocValuesFormat(name=Lucene45), date_dtd=DocValuesFormat(name=Lucene45), stringdvm=DocValuesFormat(name=Memory), longdv=DocValuesFormat(name=Memory), intdv=DocValuesFormat(name=SimpleText), long_ld=DocValuesFormat(name=Lucene45), floatdv=DocValuesFormat(name=Memory), datedv=DocValuesFormat(name=Disk), stringdv=DocValuesFormat(name=Lucene45)}, sim=RandomSimilarityProvider(queryNorm=true,coord=crazy): {}, locale=tr_TR, timezone=America/Pangnirtung
[junit4] 2> NOTE: Linux 3.8.0-34-generic amd64/IBM Corporation 1.7.0 (64-bit)/cpus=8,threads=1,free=47260632,total=208732160
[junit4] 2> NOTE: All tests run in this JVM: [OpenCloseCoreStressTest, TestStressRecovery, HighlighterTest, HdfsBasicDistributedZk2Test, TestSolrXml, DirectSolrSpellCheckerTest, BadIndexSchemaTest, TermVectorComponentDistributedTest, ChaosMonkeyNothingIsSafeTest, ZkNodePropsTest, MultiTermTest, HdfsSyncSliceTest, NumericFieldsTest, PathHierarchyTokenizerFactoryTest, TestRecoveryHdfs, TestFastWriter, TestPhraseSuggestions, TestArbitraryIndexDir, TestQueryTypes, SolrXmlInZkTest, SolrCmdDistributorTest, TestIndexSearcher, ParsingFieldUpdateProcessorsTest, TestDefaultSimilarityFactory, SolrCoreCheckLockOnStartupTest, TestBinaryField, TestDynamicFieldCollectionResource, TestComponentsName, BlockCacheTest, TestSolrQueryParserResource, TestCSVLoader, MinimalSchemaTest, TestImplicitCoreProperties, TestDistributedGrouping, StandardRequestHandlerTest, SolrPluginUtilsTest, HdfsCollectionsAPIDistributedZkTest, ZkSolrClientTest, TestSchemaSimilarityResource, TestMaxScoreQueryParser, TestAtomicUpdateErrorCases, TestCSVResponseWriter, CurrencyFieldOpenExchangeTest, PrimUtilsTest, SuggesterWFSTTest, SuggesterTSTTest, TestSchemaNameResource, DirectUpdateHandlerTest, HdfsRecoveryZkTest, OutputWriterTest, FieldFacetTest, HdfsBasicDistributedZkTest, TestDistributedSearch, BasicZkTest, TestIBSimilarityFactory, SolrRequestParserTest, TestDFRSimilarityFactory, EnumFieldTest, TestAnalyzedSuggestions, FieldFacetExtrasTest, AssignTest, TestUpdate, HdfsDirectoryTest, TestSweetSpotSimilarityFactory, QueryResultKeyTest, TestHashPartitioner, CoreMergeIndexesAdminHandlerTest, ConvertedLegacyTest, DefaultValueUpdateProcessorTest, TestPartialUpdateDeduplication, SimplePostToolTest, XsltUpdateRequestHandlerTest, NoFacetTest, TestUtils, TestFuzzyAnalyzedSuggestions, DebugComponentTest, LeaderElectionIntegrationTest, AlternateDirectoryTest, DistanceFunctionTest, OpenExchangeRatesOrgProviderTest, PreAnalyzedFieldTest, TestDistribDocBasedVersion, TestBinaryResponseWriter, DeleteInactiveReplicaTest, TimeZoneUtilsTest, TestQuerySenderListener, IndexBasedSpellCheckerTest, LeaderElectionTest, TestZkChroot, TestRandomDVFaceting, TestJoin, SolrCoreTest, SpellCheckComponentTest, TestFiltering, OverseerCollectionProcessorTest, ShowFileRequestHandlerTest, SolrIndexSplitterTest, TestExtendedDismaxParser, SuggesterFSTTest, TestStressLucene, NoCacheHeaderTest, DocValuesMultiTest, LukeRequestHandlerTest, TestWriterPerf, PrimitiveFieldTypeTest, TestOmitPositions, TermsComponentTest, RequestHandlersTest, TestValueSourceCache, TestIndexingPerformance, FieldAnalysisRequestHandlerTest, LoggingHandlerTest, TestJmxIntegration, UniqFieldsUpdateProcessorFactoryTest, BinaryUpdateRequestHandlerTest, TestPHPSerializedResponseWriter, CSVRequestHandlerTest, HighlighterConfigTest, TestQuerySenderNoQuery, TestMergePolicyConfig, SampleTest, TestElisionMultitermQuery, TestSolrCoreProperties, DirectSolrConnectionTest, TestLuceneMatchVersion, TestCharFilters, SynonymTokenizerTest, EchoParamsTest, TestBM25SimilarityFactory, ScriptEngineTest, TestFastLRUCache, DateFieldTest, DOMUtilTest, ClusterStateTest, TestDocumentBuilder, SystemInfoHandlerTest, UUIDFieldTest, CircularListTest, TestRTGBase, AbstractAnalyticsStatsTest, ExpressionTest]
[junit4] Completed on J1 in 0.88s, 12 tests, 5 failures <<< FAILURES!
[...truncated 147 lines...]
BUILD FAILED
/mnt/ssd/jenkins/workspace/Lucene-Solr-trunk-Linux/build.xml:453: The following error occurred while executing this line:
/mnt/ssd/jenkins/workspace/Lucene-Solr-trunk-Linux/build.xml:446: The following error occurred while executing this line:
/mnt/ssd/jenkins/workspace/Lucene-Solr-trunk-Linux/build.xml:39: The following error occurred while executing this line:
/mnt/ssd/jenkins/workspace/Lucene-Solr-trunk-Linux/extra-targets.xml:37: The following error occurred while executing this line:
/mnt/ssd/jenkins/workspace/Lucene-Solr-trunk-Linux/solr/build.xml:189: The following error occurred while executing this line:
/mnt/ssd/jenkins/workspace/Lucene-Solr-trunk-Linux/solr/common-build.xml:491: The following error occurred while executing this line:
/mnt/ssd/jenkins/workspace/Lucene-Solr-trunk-Linux/lucene/common-build.xml:1304: The following error occurred while executing this line:
/mnt/ssd/jenkins/workspace/Lucene-Solr-trunk-Linux/lucene/common-build.xml:937: There were test failures: 357 suites, 1572 tests, 6 failures, 67 ignored (6 assumptions)
Total time: 36 minutes 34 seconds
Build step 'Invoke Ant' marked build as failure
Description set: Java: 64bit/ibm-j9-jdk7 -Xjit:exclude={org/apache/lucene/util/fst/FST.pack(IIF)Lorg/apache/lucene/util/fst/FST;}
Archiving artifacts
Recording test results
Email was triggered for: Failure
Sending email for trigger: Failure
[JENKINS] Lucene-Solr-trunk-Linux (64bit/ibm-j9-jdk7) - Build #
8766 - Still Failing!
Posted by Policeman Jenkins Server <je...@thetaphi.de>.
Build: http://jenkins.thetaphi.de/job/Lucene-Solr-trunk-Linux/8766/
Java: 64bit/ibm-j9-jdk7 -Xjit:exclude={org/apache/lucene/util/fst/FST.pack(IIF)Lorg/apache/lucene/util/fst/FST;}
4 tests failed.
REGRESSION: org.apache.solr.analytics.expression.ExpressionTest.powerTest
Error Message:
Caught exception in getStatResult, xPath = /response/lst[@name='stats']/lst[@name='pr']/double[@name='sum'] raw data: <?xml version="1.0" encoding="UTF-8"?> <response> <lst name="responseHeader"> <int name="status">0</int> <int name="QTime">76</int> </lst> <result name="response" numFound="100" start="0"> </result> <lst name="stats"> <lst name="stats_fields"/> </lst> <lst name="stats"> <lst name="ar"> <long name="count">100</long> <null name="mcm"/> <null name="mean"/> <null name="median"/> <null name="su"/> <null name="sum"/> <null name="unique"/> </lst> <lst name="csr"> <str name="cs1">this is the first</str> <str name="cs2">this is the second</str> <str name="cs3">this is the third</str> </lst> <lst name="dr"> <long name="count">100</long> <double name="mc">0.2891</double> <double name="mean">28.91</double> <double name="su">80.30555555555556</double> <double name="sum">2891.0</double> <long name="unique">36</long> </lst> <lst name="mr"> <long name="count">100</long> <double name="mcm">70829.5</double> <double name="mean">28.91</double> <double name="median">24.5</double> <double name="su">104076.0</double> <double name="sum">2891.0</double> <long name="unique">36</long> </lst> <lst name="cr"> <str name="ccmax">this is the secondstr9</str> <str name="ccmin">this is the firststr0</str> <str name="csmax">this is the second</str> <str name="csmin">this is the first</str> <str name="max">str9</str> <str name="min">str0</str> </lst> <lst name="cdr"> <date name="cd1">1800-12-31T23:59:59Z</date> <date name="cd2">1804-06-30T23:59:59Z</date> <str name="cs1">1800-12-31T23:59:59Z</str> <str name="cs2">1804-06-30T23:59:59Z</str> </lst> <lst name="pr"> <long name="count">100</long> <null name="mc"/> <null name="mean"/> <null name="su"/> <null name="sum"/> <null name="unique"/> </lst> <lst name="rr"> <str name="max">str9</str> <str name="min">str0</str> <str name="rmax">9rts</str> <str name="rmin">0rts</str> </lst> <lst name="cnr"> <double name="c10">10.0</double> <double name="c8">8.0</double> </lst> <lst name="avr"> <double name="c">100.0</double> <long name="count">100</long> <null name="s"/> <null name="sum"/> </lst> <lst name="dmr"> <str name="cma">+2MONTHS</str> <str name="cme">+2YEARS</str> <date name="dmma">1812-02-29T23:59:59Z</date> <date name="dmme">1807-12-31T23:59:59Z</date> <date name="max">1811-12-31T23:59:59Z</date> <date name="median">1805-12-31T23:59:59Z</date> </lst> <lst name="nr"> <double name="c">-100.0</double> <long name="count">100</long> <double name="s">-2891.0</double> <double name="sum">2891.0</double> </lst> </lst> </response>
Stack Trace:
java.lang.AssertionError: Caught exception in getStatResult, xPath = /response/lst[@name='stats']/lst[@name='pr']/double[@name='sum']
raw data: <?xml version="1.0" encoding="UTF-8"?>
<response>
<lst name="responseHeader">
<int name="status">0</int>
<int name="QTime">76</int>
</lst>
<result name="response" numFound="100" start="0">
</result>
<lst name="stats">
<lst name="stats_fields"/>
</lst>
<lst name="stats">
<lst name="ar">
<long name="count">100</long>
<null name="mcm"/>
<null name="mean"/>
<null name="median"/>
<null name="su"/>
<null name="sum"/>
<null name="unique"/>
</lst>
<lst name="csr">
<str name="cs1">this is the first</str>
<str name="cs2">this is the second</str>
<str name="cs3">this is the third</str>
</lst>
<lst name="dr">
<long name="count">100</long>
<double name="mc">0.2891</double>
<double name="mean">28.91</double>
<double name="su">80.30555555555556</double>
<double name="sum">2891.0</double>
<long name="unique">36</long>
</lst>
<lst name="mr">
<long name="count">100</long>
<double name="mcm">70829.5</double>
<double name="mean">28.91</double>
<double name="median">24.5</double>
<double name="su">104076.0</double>
<double name="sum">2891.0</double>
<long name="unique">36</long>
</lst>
<lst name="cr">
<str name="ccmax">this is the secondstr9</str>
<str name="ccmin">this is the firststr0</str>
<str name="csmax">this is the second</str>
<str name="csmin">this is the first</str>
<str name="max">str9</str>
<str name="min">str0</str>
</lst>
<lst name="cdr">
<date name="cd1">1800-12-31T23:59:59Z</date>
<date name="cd2">1804-06-30T23:59:59Z</date>
<str name="cs1">1800-12-31T23:59:59Z</str>
<str name="cs2">1804-06-30T23:59:59Z</str>
</lst>
<lst name="pr">
<long name="count">100</long>
<null name="mc"/>
<null name="mean"/>
<null name="su"/>
<null name="sum"/>
<null name="unique"/>
</lst>
<lst name="rr">
<str name="max">str9</str>
<str name="min">str0</str>
<str name="rmax">9rts</str>
<str name="rmin">0rts</str>
</lst>
<lst name="cnr">
<double name="c10">10.0</double>
<double name="c8">8.0</double>
</lst>
<lst name="avr">
<double name="c">100.0</double>
<long name="count">100</long>
<null name="s"/>
<null name="sum"/>
</lst>
<lst name="dmr">
<str name="cma">+2MONTHS</str>
<str name="cme">+2YEARS</str>
<date name="dmma">1812-02-29T23:59:59Z</date>
<date name="dmme">1807-12-31T23:59:59Z</date>
<date name="max">1811-12-31T23:59:59Z</date>
<date name="median">1805-12-31T23:59:59Z</date>
</lst>
<lst name="nr">
<double name="c">-100.0</double>
<long name="count">100</long>
<double name="s">-2891.0</double>
<double name="sum">2891.0</double>
</lst>
</lst>
</response>
at __randomizedtesting.SeedInfo.seed([9994E81E0B474651:F7265F1DE3501880]:0)
at org.junit.Assert.fail(Assert.java:93)
at org.apache.solr.analytics.AbstractAnalyticsStatsTest.getStatResult(AbstractAnalyticsStatsTest.java:113)
at org.apache.solr.analytics.expression.ExpressionTest.powerTest(ExpressionTest.java:119)
at sun.reflect.NativeMethodAccessorImpl.invoke0(Native Method)
at sun.reflect.NativeMethodAccessorImpl.invoke(NativeMethodAccessorImpl.java:88)
at sun.reflect.DelegatingMethodAccessorImpl.invoke(DelegatingMethodAccessorImpl.java:55)
at java.lang.reflect.Method.invoke(Method.java:613)
at com.carrotsearch.randomizedtesting.RandomizedRunner.invoke(RandomizedRunner.java:1559)
at com.carrotsearch.randomizedtesting.RandomizedRunner.access$600(RandomizedRunner.java:79)
at com.carrotsearch.randomizedtesting.RandomizedRunner$6.evaluate(RandomizedRunner.java:737)
at com.carrotsearch.randomizedtesting.RandomizedRunner$7.evaluate(RandomizedRunner.java:773)
at com.carrotsearch.randomizedtesting.RandomizedRunner$8.evaluate(RandomizedRunner.java:787)
at com.carrotsearch.randomizedtesting.rules.SystemPropertiesRestoreRule$1.evaluate(SystemPropertiesRestoreRule.java:53)
at org.apache.lucene.util.TestRuleSetupTeardownChained$1.evaluate(TestRuleSetupTeardownChained.java:50)
at org.apache.lucene.util.TestRuleFieldCacheSanity$1.evaluate(TestRuleFieldCacheSanity.java:51)
at org.apache.lucene.util.AbstractBeforeAfterRule$1.evaluate(AbstractBeforeAfterRule.java:46)
at com.carrotsearch.randomizedtesting.rules.SystemPropertiesInvariantRule$1.evaluate(SystemPropertiesInvariantRule.java:55)
at org.apache.lucene.util.TestRuleThreadAndTestName$1.evaluate(TestRuleThreadAndTestName.java:49)
at org.apache.lucene.util.TestRuleIgnoreAfterMaxFailures$1.evaluate(TestRuleIgnoreAfterMaxFailures.java:70)
at org.apache.lucene.util.TestRuleMarkFailure$1.evaluate(TestRuleMarkFailure.java:48)
at com.carrotsearch.randomizedtesting.rules.StatementAdapter.evaluate(StatementAdapter.java:36)
at com.carrotsearch.randomizedtesting.ThreadLeakControl$StatementRunner.run(ThreadLeakControl.java:358)
at com.carrotsearch.randomizedtesting.ThreadLeakControl.forkTimeoutingTask(ThreadLeakControl.java:782)
at com.carrotsearch.randomizedtesting.ThreadLeakControl$3.evaluate(ThreadLeakControl.java:442)
at com.carrotsearch.randomizedtesting.RandomizedRunner.runSingleTest(RandomizedRunner.java:746)
at com.carrotsearch.randomizedtesting.RandomizedRunner$3.evaluate(RandomizedRunner.java:648)
at com.carrotsearch.randomizedtesting.RandomizedRunner$4.evaluate(RandomizedRunner.java:682)
at com.carrotsearch.randomizedtesting.RandomizedRunner$5.evaluate(RandomizedRunner.java:693)
at com.carrotsearch.randomizedtesting.rules.StatementAdapter.evaluate(StatementAdapter.java:36)
at com.carrotsearch.randomizedtesting.rules.SystemPropertiesRestoreRule$1.evaluate(SystemPropertiesRestoreRule.java:53)
at org.apache.lucene.util.AbstractBeforeAfterRule$1.evaluate(AbstractBeforeAfterRule.java:46)
at org.apache.lucene.util.TestRuleStoreClassName$1.evaluate(TestRuleStoreClassName.java:42)
at com.carrotsearch.randomizedtesting.rules.SystemPropertiesInvariantRule$1.evaluate(SystemPropertiesInvariantRule.java:55)
at com.carrotsearch.randomizedtesting.rules.NoShadowingOrOverridesOnMethodsRule$1.evaluate(NoShadowingOrOverridesOnMethodsRule.java:39)
at com.carrotsearch.randomizedtesting.rules.NoShadowingOrOverridesOnMethodsRule$1.evaluate(NoShadowingOrOverridesOnMethodsRule.java:39)
at com.carrotsearch.randomizedtesting.rules.StatementAdapter.evaluate(StatementAdapter.java:36)
at org.apache.lucene.util.TestRuleAssertionsRequired$1.evaluate(TestRuleAssertionsRequired.java:43)
at org.apache.lucene.util.TestRuleMarkFailure$1.evaluate(TestRuleMarkFailure.java:48)
at org.apache.lucene.util.TestRuleIgnoreAfterMaxFailures$1.evaluate(TestRuleIgnoreAfterMaxFailures.java:70)
at org.apache.lucene.util.TestRuleIgnoreTestSuites$1.evaluate(TestRuleIgnoreTestSuites.java:55)
at com.carrotsearch.randomizedtesting.rules.StatementAdapter.evaluate(StatementAdapter.java:36)
at com.carrotsearch.randomizedtesting.ThreadLeakControl$StatementRunner.run(ThreadLeakControl.java:358)
at java.lang.Thread.run(Thread.java:780)
FAILED: org.apache.solr.analytics.expression.ExpressionTest.absoluteValueTest
Error Message:
Caught exception in getStatResult, xPath = /response/lst[@name='stats']/lst[@name='avr']/double[@name='sum'] raw data: <?xml version="1.0" encoding="UTF-8"?> <response> <lst name="responseHeader"> <int name="status">0</int> <int name="QTime">76</int> </lst> <result name="response" numFound="100" start="0"> </result> <lst name="stats"> <lst name="stats_fields"/> </lst> <lst name="stats"> <lst name="ar"> <long name="count">100</long> <null name="mcm"/> <null name="mean"/> <null name="median"/> <null name="su"/> <null name="sum"/> <null name="unique"/> </lst> <lst name="csr"> <str name="cs1">this is the first</str> <str name="cs2">this is the second</str> <str name="cs3">this is the third</str> </lst> <lst name="dr"> <long name="count">100</long> <double name="mc">0.2891</double> <double name="mean">28.91</double> <double name="su">80.30555555555556</double> <double name="sum">2891.0</double> <long name="unique">36</long> </lst> <lst name="mr"> <long name="count">100</long> <double name="mcm">70829.5</double> <double name="mean">28.91</double> <double name="median">24.5</double> <double name="su">104076.0</double> <double name="sum">2891.0</double> <long name="unique">36</long> </lst> <lst name="cr"> <str name="ccmax">this is the secondstr9</str> <str name="ccmin">this is the firststr0</str> <str name="csmax">this is the second</str> <str name="csmin">this is the first</str> <str name="max">str9</str> <str name="min">str0</str> </lst> <lst name="cdr"> <date name="cd1">1800-12-31T23:59:59Z</date> <date name="cd2">1804-06-30T23:59:59Z</date> <str name="cs1">1800-12-31T23:59:59Z</str> <str name="cs2">1804-06-30T23:59:59Z</str> </lst> <lst name="pr"> <long name="count">100</long> <null name="mc"/> <null name="mean"/> <null name="su"/> <null name="sum"/> <null name="unique"/> </lst> <lst name="rr"> <str name="max">str9</str> <str name="min">str0</str> <str name="rmax">9rts</str> <str name="rmin">0rts</str> </lst> <lst name="cnr"> <double name="c10">10.0</double> <double name="c8">8.0</double> </lst> <lst name="avr"> <double name="c">100.0</double> <long name="count">100</long> <null name="s"/> <null name="sum"/> </lst> <lst name="dmr"> <str name="cma">+2MONTHS</str> <str name="cme">+2YEARS</str> <date name="dmma">1812-02-29T23:59:59Z</date> <date name="dmme">1807-12-31T23:59:59Z</date> <date name="max">1811-12-31T23:59:59Z</date> <date name="median">1805-12-31T23:59:59Z</date> </lst> <lst name="nr"> <double name="c">-100.0</double> <long name="count">100</long> <double name="s">-2891.0</double> <double name="sum">2891.0</double> </lst> </lst> </response>
Stack Trace:
java.lang.AssertionError: Caught exception in getStatResult, xPath = /response/lst[@name='stats']/lst[@name='avr']/double[@name='sum']
raw data: <?xml version="1.0" encoding="UTF-8"?>
<response>
<lst name="responseHeader">
<int name="status">0</int>
<int name="QTime">76</int>
</lst>
<result name="response" numFound="100" start="0">
</result>
<lst name="stats">
<lst name="stats_fields"/>
</lst>
<lst name="stats">
<lst name="ar">
<long name="count">100</long>
<null name="mcm"/>
<null name="mean"/>
<null name="median"/>
<null name="su"/>
<null name="sum"/>
<null name="unique"/>
</lst>
<lst name="csr">
<str name="cs1">this is the first</str>
<str name="cs2">this is the second</str>
<str name="cs3">this is the third</str>
</lst>
<lst name="dr">
<long name="count">100</long>
<double name="mc">0.2891</double>
<double name="mean">28.91</double>
<double name="su">80.30555555555556</double>
<double name="sum">2891.0</double>
<long name="unique">36</long>
</lst>
<lst name="mr">
<long name="count">100</long>
<double name="mcm">70829.5</double>
<double name="mean">28.91</double>
<double name="median">24.5</double>
<double name="su">104076.0</double>
<double name="sum">2891.0</double>
<long name="unique">36</long>
</lst>
<lst name="cr">
<str name="ccmax">this is the secondstr9</str>
<str name="ccmin">this is the firststr0</str>
<str name="csmax">this is the second</str>
<str name="csmin">this is the first</str>
<str name="max">str9</str>
<str name="min">str0</str>
</lst>
<lst name="cdr">
<date name="cd1">1800-12-31T23:59:59Z</date>
<date name="cd2">1804-06-30T23:59:59Z</date>
<str name="cs1">1800-12-31T23:59:59Z</str>
<str name="cs2">1804-06-30T23:59:59Z</str>
</lst>
<lst name="pr">
<long name="count">100</long>
<null name="mc"/>
<null name="mean"/>
<null name="su"/>
<null name="sum"/>
<null name="unique"/>
</lst>
<lst name="rr">
<str name="max">str9</str>
<str name="min">str0</str>
<str name="rmax">9rts</str>
<str name="rmin">0rts</str>
</lst>
<lst name="cnr">
<double name="c10">10.0</double>
<double name="c8">8.0</double>
</lst>
<lst name="avr">
<double name="c">100.0</double>
<long name="count">100</long>
<null name="s"/>
<null name="sum"/>
</lst>
<lst name="dmr">
<str name="cma">+2MONTHS</str>
<str name="cme">+2YEARS</str>
<date name="dmma">1812-02-29T23:59:59Z</date>
<date name="dmme">1807-12-31T23:59:59Z</date>
<date name="max">1811-12-31T23:59:59Z</date>
<date name="median">1805-12-31T23:59:59Z</date>
</lst>
<lst name="nr">
<double name="c">-100.0</double>
<long name="count">100</long>
<double name="s">-2891.0</double>
<double name="sum">2891.0</double>
</lst>
</lst>
</response>
at __randomizedtesting.SeedInfo.seed([9994E81E0B474651:B838C80BC6DA1E37]:0)
at org.junit.Assert.fail(Assert.java:93)
at org.apache.solr.analytics.AbstractAnalyticsStatsTest.getStatResult(AbstractAnalyticsStatsTest.java:113)
at org.apache.solr.analytics.expression.ExpressionTest.absoluteValueTest(ExpressionTest.java:143)
at sun.reflect.NativeMethodAccessorImpl.invoke0(Native Method)
at sun.reflect.NativeMethodAccessorImpl.invoke(NativeMethodAccessorImpl.java:88)
at sun.reflect.DelegatingMethodAccessorImpl.invoke(DelegatingMethodAccessorImpl.java:55)
at java.lang.reflect.Method.invoke(Method.java:613)
at com.carrotsearch.randomizedtesting.RandomizedRunner.invoke(RandomizedRunner.java:1559)
at com.carrotsearch.randomizedtesting.RandomizedRunner.access$600(RandomizedRunner.java:79)
at com.carrotsearch.randomizedtesting.RandomizedRunner$6.evaluate(RandomizedRunner.java:737)
at com.carrotsearch.randomizedtesting.RandomizedRunner$7.evaluate(RandomizedRunner.java:773)
at com.carrotsearch.randomizedtesting.RandomizedRunner$8.evaluate(RandomizedRunner.java:787)
at com.carrotsearch.randomizedtesting.rules.SystemPropertiesRestoreRule$1.evaluate(SystemPropertiesRestoreRule.java:53)
at org.apache.lucene.util.TestRuleSetupTeardownChained$1.evaluate(TestRuleSetupTeardownChained.java:50)
at org.apache.lucene.util.TestRuleFieldCacheSanity$1.evaluate(TestRuleFieldCacheSanity.java:51)
at org.apache.lucene.util.AbstractBeforeAfterRule$1.evaluate(AbstractBeforeAfterRule.java:46)
at com.carrotsearch.randomizedtesting.rules.SystemPropertiesInvariantRule$1.evaluate(SystemPropertiesInvariantRule.java:55)
at org.apache.lucene.util.TestRuleThreadAndTestName$1.evaluate(TestRuleThreadAndTestName.java:49)
at org.apache.lucene.util.TestRuleIgnoreAfterMaxFailures$1.evaluate(TestRuleIgnoreAfterMaxFailures.java:70)
at org.apache.lucene.util.TestRuleMarkFailure$1.evaluate(TestRuleMarkFailure.java:48)
at com.carrotsearch.randomizedtesting.rules.StatementAdapter.evaluate(StatementAdapter.java:36)
at com.carrotsearch.randomizedtesting.ThreadLeakControl$StatementRunner.run(ThreadLeakControl.java:358)
at com.carrotsearch.randomizedtesting.ThreadLeakControl.forkTimeoutingTask(ThreadLeakControl.java:782)
at com.carrotsearch.randomizedtesting.ThreadLeakControl$3.evaluate(ThreadLeakControl.java:442)
at com.carrotsearch.randomizedtesting.RandomizedRunner.runSingleTest(RandomizedRunner.java:746)
at com.carrotsearch.randomizedtesting.RandomizedRunner$3.evaluate(RandomizedRunner.java:648)
at com.carrotsearch.randomizedtesting.RandomizedRunner$4.evaluate(RandomizedRunner.java:682)
at com.carrotsearch.randomizedtesting.RandomizedRunner$5.evaluate(RandomizedRunner.java:693)
at com.carrotsearch.randomizedtesting.rules.StatementAdapter.evaluate(StatementAdapter.java:36)
at com.carrotsearch.randomizedtesting.rules.SystemPropertiesRestoreRule$1.evaluate(SystemPropertiesRestoreRule.java:53)
at org.apache.lucene.util.AbstractBeforeAfterRule$1.evaluate(AbstractBeforeAfterRule.java:46)
at org.apache.lucene.util.TestRuleStoreClassName$1.evaluate(TestRuleStoreClassName.java:42)
at com.carrotsearch.randomizedtesting.rules.SystemPropertiesInvariantRule$1.evaluate(SystemPropertiesInvariantRule.java:55)
at com.carrotsearch.randomizedtesting.rules.NoShadowingOrOverridesOnMethodsRule$1.evaluate(NoShadowingOrOverridesOnMethodsRule.java:39)
at com.carrotsearch.randomizedtesting.rules.NoShadowingOrOverridesOnMethodsRule$1.evaluate(NoShadowingOrOverridesOnMethodsRule.java:39)
at com.carrotsearch.randomizedtesting.rules.StatementAdapter.evaluate(StatementAdapter.java:36)
at org.apache.lucene.util.TestRuleAssertionsRequired$1.evaluate(TestRuleAssertionsRequired.java:43)
at org.apache.lucene.util.TestRuleMarkFailure$1.evaluate(TestRuleMarkFailure.java:48)
at org.apache.lucene.util.TestRuleIgnoreAfterMaxFailures$1.evaluate(TestRuleIgnoreAfterMaxFailures.java:70)
at org.apache.lucene.util.TestRuleIgnoreTestSuites$1.evaluate(TestRuleIgnoreTestSuites.java:55)
at com.carrotsearch.randomizedtesting.rules.StatementAdapter.evaluate(StatementAdapter.java:36)
at com.carrotsearch.randomizedtesting.ThreadLeakControl$StatementRunner.run(ThreadLeakControl.java:358)
at java.lang.Thread.run(Thread.java:780)
FAILED: org.apache.solr.analytics.expression.ExpressionTest.addTest
Error Message:
Caught exception in getStatResult, xPath = /response/lst[@name='stats']/lst[@name='ar']/double[@name='sum'] raw data: <?xml version="1.0" encoding="UTF-8"?> <response> <lst name="responseHeader"> <int name="status">0</int> <int name="QTime">76</int> </lst> <result name="response" numFound="100" start="0"> </result> <lst name="stats"> <lst name="stats_fields"/> </lst> <lst name="stats"> <lst name="ar"> <long name="count">100</long> <null name="mcm"/> <null name="mean"/> <null name="median"/> <null name="su"/> <null name="sum"/> <null name="unique"/> </lst> <lst name="csr"> <str name="cs1">this is the first</str> <str name="cs2">this is the second</str> <str name="cs3">this is the third</str> </lst> <lst name="dr"> <long name="count">100</long> <double name="mc">0.2891</double> <double name="mean">28.91</double> <double name="su">80.30555555555556</double> <double name="sum">2891.0</double> <long name="unique">36</long> </lst> <lst name="mr"> <long name="count">100</long> <double name="mcm">70829.5</double> <double name="mean">28.91</double> <double name="median">24.5</double> <double name="su">104076.0</double> <double name="sum">2891.0</double> <long name="unique">36</long> </lst> <lst name="cr"> <str name="ccmax">this is the secondstr9</str> <str name="ccmin">this is the firststr0</str> <str name="csmax">this is the second</str> <str name="csmin">this is the first</str> <str name="max">str9</str> <str name="min">str0</str> </lst> <lst name="cdr"> <date name="cd1">1800-12-31T23:59:59Z</date> <date name="cd2">1804-06-30T23:59:59Z</date> <str name="cs1">1800-12-31T23:59:59Z</str> <str name="cs2">1804-06-30T23:59:59Z</str> </lst> <lst name="pr"> <long name="count">100</long> <null name="mc"/> <null name="mean"/> <null name="su"/> <null name="sum"/> <null name="unique"/> </lst> <lst name="rr"> <str name="max">str9</str> <str name="min">str0</str> <str name="rmax">9rts</str> <str name="rmin">0rts</str> </lst> <lst name="cnr"> <double name="c10">10.0</double> <double name="c8">8.0</double> </lst> <lst name="avr"> <double name="c">100.0</double> <long name="count">100</long> <null name="s"/> <null name="sum"/> </lst> <lst name="dmr"> <str name="cma">+2MONTHS</str> <str name="cme">+2YEARS</str> <date name="dmma">1812-02-29T23:59:59Z</date> <date name="dmme">1807-12-31T23:59:59Z</date> <date name="max">1811-12-31T23:59:59Z</date> <date name="median">1805-12-31T23:59:59Z</date> </lst> <lst name="nr"> <double name="c">-100.0</double> <long name="count">100</long> <double name="s">-2891.0</double> <double name="sum">2891.0</double> </lst> </lst> </response>
Stack Trace:
java.lang.AssertionError: Caught exception in getStatResult, xPath = /response/lst[@name='stats']/lst[@name='ar']/double[@name='sum']
raw data: <?xml version="1.0" encoding="UTF-8"?>
<response>
<lst name="responseHeader">
<int name="status">0</int>
<int name="QTime">76</int>
</lst>
<result name="response" numFound="100" start="0">
</result>
<lst name="stats">
<lst name="stats_fields"/>
</lst>
<lst name="stats">
<lst name="ar">
<long name="count">100</long>
<null name="mcm"/>
<null name="mean"/>
<null name="median"/>
<null name="su"/>
<null name="sum"/>
<null name="unique"/>
</lst>
<lst name="csr">
<str name="cs1">this is the first</str>
<str name="cs2">this is the second</str>
<str name="cs3">this is the third</str>
</lst>
<lst name="dr">
<long name="count">100</long>
<double name="mc">0.2891</double>
<double name="mean">28.91</double>
<double name="su">80.30555555555556</double>
<double name="sum">2891.0</double>
<long name="unique">36</long>
</lst>
<lst name="mr">
<long name="count">100</long>
<double name="mcm">70829.5</double>
<double name="mean">28.91</double>
<double name="median">24.5</double>
<double name="su">104076.0</double>
<double name="sum">2891.0</double>
<long name="unique">36</long>
</lst>
<lst name="cr">
<str name="ccmax">this is the secondstr9</str>
<str name="ccmin">this is the firststr0</str>
<str name="csmax">this is the second</str>
<str name="csmin">this is the first</str>
<str name="max">str9</str>
<str name="min">str0</str>
</lst>
<lst name="cdr">
<date name="cd1">1800-12-31T23:59:59Z</date>
<date name="cd2">1804-06-30T23:59:59Z</date>
<str name="cs1">1800-12-31T23:59:59Z</str>
<str name="cs2">1804-06-30T23:59:59Z</str>
</lst>
<lst name="pr">
<long name="count">100</long>
<null name="mc"/>
<null name="mean"/>
<null name="su"/>
<null name="sum"/>
<null name="unique"/>
</lst>
<lst name="rr">
<str name="max">str9</str>
<str name="min">str0</str>
<str name="rmax">9rts</str>
<str name="rmin">0rts</str>
</lst>
<lst name="cnr">
<double name="c10">10.0</double>
<double name="c8">8.0</double>
</lst>
<lst name="avr">
<double name="c">100.0</double>
<long name="count">100</long>
<null name="s"/>
<null name="sum"/>
</lst>
<lst name="dmr">
<str name="cma">+2MONTHS</str>
<str name="cme">+2YEARS</str>
<date name="dmma">1812-02-29T23:59:59Z</date>
<date name="dmme">1807-12-31T23:59:59Z</date>
<date name="max">1811-12-31T23:59:59Z</date>
<date name="median">1805-12-31T23:59:59Z</date>
</lst>
<lst name="nr">
<double name="c">-100.0</double>
<long name="count">100</long>
<double name="s">-2891.0</double>
<double name="sum">2891.0</double>
</lst>
</lst>
</response>
at __randomizedtesting.SeedInfo.seed([9994E81E0B474651:6FB845C04A884116]:0)
at org.junit.Assert.fail(Assert.java:93)
at org.apache.solr.analytics.AbstractAnalyticsStatsTest.getStatResult(AbstractAnalyticsStatsTest.java:113)
at org.apache.solr.analytics.expression.ExpressionTest.addTest(ExpressionTest.java:78)
at sun.reflect.NativeMethodAccessorImpl.invoke0(Native Method)
at sun.reflect.NativeMethodAccessorImpl.invoke(NativeMethodAccessorImpl.java:88)
at sun.reflect.DelegatingMethodAccessorImpl.invoke(DelegatingMethodAccessorImpl.java:55)
at java.lang.reflect.Method.invoke(Method.java:613)
at com.carrotsearch.randomizedtesting.RandomizedRunner.invoke(RandomizedRunner.java:1559)
at com.carrotsearch.randomizedtesting.RandomizedRunner.access$600(RandomizedRunner.java:79)
at com.carrotsearch.randomizedtesting.RandomizedRunner$6.evaluate(RandomizedRunner.java:737)
at com.carrotsearch.randomizedtesting.RandomizedRunner$7.evaluate(RandomizedRunner.java:773)
at com.carrotsearch.randomizedtesting.RandomizedRunner$8.evaluate(RandomizedRunner.java:787)
at com.carrotsearch.randomizedtesting.rules.SystemPropertiesRestoreRule$1.evaluate(SystemPropertiesRestoreRule.java:53)
at org.apache.lucene.util.TestRuleSetupTeardownChained$1.evaluate(TestRuleSetupTeardownChained.java:50)
at org.apache.lucene.util.TestRuleFieldCacheSanity$1.evaluate(TestRuleFieldCacheSanity.java:51)
at org.apache.lucene.util.AbstractBeforeAfterRule$1.evaluate(AbstractBeforeAfterRule.java:46)
at com.carrotsearch.randomizedtesting.rules.SystemPropertiesInvariantRule$1.evaluate(SystemPropertiesInvariantRule.java:55)
at org.apache.lucene.util.TestRuleThreadAndTestName$1.evaluate(TestRuleThreadAndTestName.java:49)
at org.apache.lucene.util.TestRuleIgnoreAfterMaxFailures$1.evaluate(TestRuleIgnoreAfterMaxFailures.java:70)
at org.apache.lucene.util.TestRuleMarkFailure$1.evaluate(TestRuleMarkFailure.java:48)
at com.carrotsearch.randomizedtesting.rules.StatementAdapter.evaluate(StatementAdapter.java:36)
at com.carrotsearch.randomizedtesting.ThreadLeakControl$StatementRunner.run(ThreadLeakControl.java:358)
at com.carrotsearch.randomizedtesting.ThreadLeakControl.forkTimeoutingTask(ThreadLeakControl.java:782)
at com.carrotsearch.randomizedtesting.ThreadLeakControl$3.evaluate(ThreadLeakControl.java:442)
at com.carrotsearch.randomizedtesting.RandomizedRunner.runSingleTest(RandomizedRunner.java:746)
at com.carrotsearch.randomizedtesting.RandomizedRunner$3.evaluate(RandomizedRunner.java:648)
at com.carrotsearch.randomizedtesting.RandomizedRunner$4.evaluate(RandomizedRunner.java:682)
at com.carrotsearch.randomizedtesting.RandomizedRunner$5.evaluate(RandomizedRunner.java:693)
at com.carrotsearch.randomizedtesting.rules.StatementAdapter.evaluate(StatementAdapter.java:36)
at com.carrotsearch.randomizedtesting.rules.SystemPropertiesRestoreRule$1.evaluate(SystemPropertiesRestoreRule.java:53)
at org.apache.lucene.util.AbstractBeforeAfterRule$1.evaluate(AbstractBeforeAfterRule.java:46)
at org.apache.lucene.util.TestRuleStoreClassName$1.evaluate(TestRuleStoreClassName.java:42)
at com.carrotsearch.randomizedtesting.rules.SystemPropertiesInvariantRule$1.evaluate(SystemPropertiesInvariantRule.java:55)
at com.carrotsearch.randomizedtesting.rules.NoShadowingOrOverridesOnMethodsRule$1.evaluate(NoShadowingOrOverridesOnMethodsRule.java:39)
at com.carrotsearch.randomizedtesting.rules.NoShadowingOrOverridesOnMethodsRule$1.evaluate(NoShadowingOrOverridesOnMethodsRule.java:39)
at com.carrotsearch.randomizedtesting.rules.StatementAdapter.evaluate(StatementAdapter.java:36)
at org.apache.lucene.util.TestRuleAssertionsRequired$1.evaluate(TestRuleAssertionsRequired.java:43)
at org.apache.lucene.util.TestRuleMarkFailure$1.evaluate(TestRuleMarkFailure.java:48)
at org.apache.lucene.util.TestRuleIgnoreAfterMaxFailures$1.evaluate(TestRuleIgnoreAfterMaxFailures.java:70)
at org.apache.lucene.util.TestRuleIgnoreTestSuites$1.evaluate(TestRuleIgnoreTestSuites.java:55)
at com.carrotsearch.randomizedtesting.rules.StatementAdapter.evaluate(StatementAdapter.java:36)
at com.carrotsearch.randomizedtesting.ThreadLeakControl$StatementRunner.run(ThreadLeakControl.java:358)
at java.lang.Thread.run(Thread.java:780)
FAILED: org.apache.solr.update.processor.SignatureUpdateProcessorFactoryTest.testDupeDetection
Error Message:
expected:<1> but was:<2>
Stack Trace:
java.lang.AssertionError: expected:<1> but was:<2>
at __randomizedtesting.SeedInfo.seed([9994E81E0B474651:C2A413D60800E52D]:0)
at org.junit.Assert.fail(Assert.java:93)
at org.junit.Assert.failNotEquals(Assert.java:647)
at org.junit.Assert.assertEquals(Assert.java:128)
at org.junit.Assert.assertEquals(Assert.java:472)
at org.junit.Assert.assertEquals(Assert.java:456)
at org.apache.solr.update.processor.SignatureUpdateProcessorFactoryTest.checkNumDocs(SignatureUpdateProcessorFactoryTest.java:71)
at org.apache.solr.update.processor.SignatureUpdateProcessorFactoryTest.testDupeDetection(SignatureUpdateProcessorFactoryTest.java:119)
at sun.reflect.NativeMethodAccessorImpl.invoke0(Native Method)
at sun.reflect.NativeMethodAccessorImpl.invoke(NativeMethodAccessorImpl.java:88)
at sun.reflect.DelegatingMethodAccessorImpl.invoke(DelegatingMethodAccessorImpl.java:55)
at java.lang.reflect.Method.invoke(Method.java:613)
at com.carrotsearch.randomizedtesting.RandomizedRunner.invoke(RandomizedRunner.java:1559)
at com.carrotsearch.randomizedtesting.RandomizedRunner.access$600(RandomizedRunner.java:79)
at com.carrotsearch.randomizedtesting.RandomizedRunner$6.evaluate(RandomizedRunner.java:737)
at com.carrotsearch.randomizedtesting.RandomizedRunner$7.evaluate(RandomizedRunner.java:773)
at com.carrotsearch.randomizedtesting.RandomizedRunner$8.evaluate(RandomizedRunner.java:787)
at com.carrotsearch.randomizedtesting.rules.SystemPropertiesRestoreRule$1.evaluate(SystemPropertiesRestoreRule.java:53)
at org.apache.lucene.util.TestRuleSetupTeardownChained$1.evaluate(TestRuleSetupTeardownChained.java:50)
at org.apache.lucene.util.TestRuleFieldCacheSanity$1.evaluate(TestRuleFieldCacheSanity.java:51)
at org.apache.lucene.util.AbstractBeforeAfterRule$1.evaluate(AbstractBeforeAfterRule.java:46)
at com.carrotsearch.randomizedtesting.rules.SystemPropertiesInvariantRule$1.evaluate(SystemPropertiesInvariantRule.java:55)
at org.apache.lucene.util.TestRuleThreadAndTestName$1.evaluate(TestRuleThreadAndTestName.java:49)
at org.apache.lucene.util.TestRuleIgnoreAfterMaxFailures$1.evaluate(TestRuleIgnoreAfterMaxFailures.java:70)
at org.apache.lucene.util.TestRuleMarkFailure$1.evaluate(TestRuleMarkFailure.java:48)
at com.carrotsearch.randomizedtesting.rules.StatementAdapter.evaluate(StatementAdapter.java:36)
at com.carrotsearch.randomizedtesting.ThreadLeakControl$StatementRunner.run(ThreadLeakControl.java:358)
at com.carrotsearch.randomizedtesting.ThreadLeakControl.forkTimeoutingTask(ThreadLeakControl.java:782)
at com.carrotsearch.randomizedtesting.ThreadLeakControl$3.evaluate(ThreadLeakControl.java:442)
at com.carrotsearch.randomizedtesting.RandomizedRunner.runSingleTest(RandomizedRunner.java:746)
at com.carrotsearch.randomizedtesting.RandomizedRunner$3.evaluate(RandomizedRunner.java:648)
at com.carrotsearch.randomizedtesting.RandomizedRunner$4.evaluate(RandomizedRunner.java:682)
at com.carrotsearch.randomizedtesting.RandomizedRunner$5.evaluate(RandomizedRunner.java:693)
at com.carrotsearch.randomizedtesting.rules.StatementAdapter.evaluate(StatementAdapter.java:36)
at com.carrotsearch.randomizedtesting.rules.SystemPropertiesRestoreRule$1.evaluate(SystemPropertiesRestoreRule.java:53)
at org.apache.lucene.util.AbstractBeforeAfterRule$1.evaluate(AbstractBeforeAfterRule.java:46)
at org.apache.lucene.util.TestRuleStoreClassName$1.evaluate(TestRuleStoreClassName.java:42)
at com.carrotsearch.randomizedtesting.rules.SystemPropertiesInvariantRule$1.evaluate(SystemPropertiesInvariantRule.java:55)
at com.carrotsearch.randomizedtesting.rules.NoShadowingOrOverridesOnMethodsRule$1.evaluate(NoShadowingOrOverridesOnMethodsRule.java:39)
at com.carrotsearch.randomizedtesting.rules.NoShadowingOrOverridesOnMethodsRule$1.evaluate(NoShadowingOrOverridesOnMethodsRule.java:39)
at com.carrotsearch.randomizedtesting.rules.StatementAdapter.evaluate(StatementAdapter.java:36)
at org.apache.lucene.util.TestRuleAssertionsRequired$1.evaluate(TestRuleAssertionsRequired.java:43)
at org.apache.lucene.util.TestRuleMarkFailure$1.evaluate(TestRuleMarkFailure.java:48)
at org.apache.lucene.util.TestRuleIgnoreAfterMaxFailures$1.evaluate(TestRuleIgnoreAfterMaxFailures.java:70)
at org.apache.lucene.util.TestRuleIgnoreTestSuites$1.evaluate(TestRuleIgnoreTestSuites.java:55)
at com.carrotsearch.randomizedtesting.rules.StatementAdapter.evaluate(StatementAdapter.java:36)
at com.carrotsearch.randomizedtesting.ThreadLeakControl$StatementRunner.run(ThreadLeakControl.java:358)
at java.lang.Thread.run(Thread.java:780)
Build Log:
[...truncated 10099 lines...]
[junit4] Suite: org.apache.solr.analytics.expression.ExpressionTest
[junit4] 2> 203007 T415 oas.SolrTestCaseJ4.initCore ####initCore
[junit4] 2> Creating dataDir: /mnt/ssd/jenkins/workspace/Lucene-Solr-trunk-Linux/solr/build/solr-core/test/J1/./solrtest-ExpressionTest-1387595370152
[junit4] 2> 203008 T415 oasc.SolrResourceLoader.<init> new SolrResourceLoader for directory: '/mnt/ssd/jenkins/workspace/Lucene-Solr-trunk-Linux/solr/build/solr-core/test-files/solr/collection1/'
[junit4] 2> 203008 T415 oasc.SolrResourceLoader.replaceClassLoader Adding 'file:/mnt/ssd/jenkins/workspace/Lucene-Solr-trunk-Linux/solr/build/solr-core/test-files/solr/collection1/lib/classes/' to classloader
[junit4] 2> 203009 T415 oasc.SolrResourceLoader.replaceClassLoader Adding 'file:/mnt/ssd/jenkins/workspace/Lucene-Solr-trunk-Linux/solr/build/solr-core/test-files/solr/collection1/lib/README' to classloader
[junit4] 2> 203035 T415 oasc.SolrConfig.<init> Using Lucene MatchVersion: LUCENE_50
[junit4] 2> 203062 T415 oasc.SolrConfig.<init> Loaded SolrConfig: solrconfig-basic.xml
[junit4] 2> 203063 T415 oass.IndexSchema.readSchema Reading Solr Schema from schema-analytics.xml
[junit4] 2> 203067 T415 oass.IndexSchema.readSchema [null] Schema name=schema-docValues
[junit4] 2> 203091 T415 oass.IndexSchema.readSchema unique key field: id
[junit4] 2> 203092 T415 oasc.SolrResourceLoader.locateSolrHome JNDI not configured for solr (NoInitialContextEx)
[junit4] 2> 203092 T415 oasc.SolrResourceLoader.locateSolrHome using system property solr.solr.home: /mnt/ssd/jenkins/workspace/Lucene-Solr-trunk-Linux/solr/build/solr-core/test-files/solr
[junit4] 2> 203093 T415 oasc.SolrResourceLoader.<init> new SolrResourceLoader for directory: '/mnt/ssd/jenkins/workspace/Lucene-Solr-trunk-Linux/solr/build/solr-core/test-files/solr/'
[junit4] 2> 203100 T415 oasc.SolrResourceLoader.locateSolrHome JNDI not configured for solr (NoInitialContextEx)
[junit4] 2> 203100 T415 oasc.SolrResourceLoader.locateSolrHome using system property solr.solr.home: /mnt/ssd/jenkins/workspace/Lucene-Solr-trunk-Linux/solr/build/solr-core/test-files/solr
[junit4] 2> 203101 T415 oasc.SolrResourceLoader.<init> new SolrResourceLoader for deduced Solr Home: '/mnt/ssd/jenkins/workspace/Lucene-Solr-trunk-Linux/solr/build/solr-core/test-files/solr/'
[junit4] 2> 203138 T415 oasc.CoreContainer.<init> New CoreContainer 1774737323
[junit4] 2> 203139 T415 oasc.CoreContainer.load Loading cores into CoreContainer [instanceDir=/mnt/ssd/jenkins/workspace/Lucene-Solr-trunk-Linux/solr/build/solr-core/test-files/solr/]
[junit4] 2> 203140 T415 oashc.HttpShardHandlerFactory.getParameter Setting socketTimeout to: 0
[junit4] 2> 203140 T415 oashc.HttpShardHandlerFactory.getParameter Setting urlScheme to: http://
[junit4] 2> 203140 T415 oashc.HttpShardHandlerFactory.getParameter Setting connTimeout to: 0
[junit4] 2> 203141 T415 oashc.HttpShardHandlerFactory.getParameter Setting maxConnectionsPerHost to: 20
[junit4] 2> 203141 T415 oashc.HttpShardHandlerFactory.getParameter Setting corePoolSize to: 0
[junit4] 2> 203141 T415 oashc.HttpShardHandlerFactory.getParameter Setting maximumPoolSize to: 2147483647
[junit4] 2> 203142 T415 oashc.HttpShardHandlerFactory.getParameter Setting maxThreadIdleTime to: 5
[junit4] 2> 203142 T415 oashc.HttpShardHandlerFactory.getParameter Setting sizeOfQueue to: -1
[junit4] 2> 203142 T415 oashc.HttpShardHandlerFactory.getParameter Setting fairnessPolicy to: false
[junit4] 2> 203147 T415 oasl.LogWatcher.createWatcher SLF4J impl is org.slf4j.impl.Log4jLoggerFactory
[junit4] 2> 203148 T415 oasl.LogWatcher.newRegisteredLogWatcher Registering Log Listener [Log4j (org.slf4j.impl.Log4jLoggerFactory)]
[junit4] 2> 203148 T415 oasc.CoreContainer.load Host Name:
[junit4] 2> 203152 T416 oasc.CoreContainer.create Creating SolrCore 'collection1' using instanceDir: /mnt/ssd/jenkins/workspace/Lucene-Solr-trunk-Linux/solr/build/solr-core/test-files/solr/collection1
[junit4] 2> 203152 T416 oasc.SolrResourceLoader.<init> new SolrResourceLoader for directory: '/mnt/ssd/jenkins/workspace/Lucene-Solr-trunk-Linux/solr/build/solr-core/test-files/solr/collection1/'
[junit4] 2> 203153 T416 oasc.SolrResourceLoader.replaceClassLoader Adding 'file:/mnt/ssd/jenkins/workspace/Lucene-Solr-trunk-Linux/solr/build/solr-core/test-files/solr/collection1/lib/classes/' to classloader
[junit4] 2> 203153 T416 oasc.SolrResourceLoader.replaceClassLoader Adding 'file:/mnt/ssd/jenkins/workspace/Lucene-Solr-trunk-Linux/solr/build/solr-core/test-files/solr/collection1/lib/README' to classloader
[junit4] 2> 203180 T416 oasc.SolrConfig.<init> Using Lucene MatchVersion: LUCENE_50
[junit4] 2> 203206 T416 oasc.SolrConfig.<init> Loaded SolrConfig: solrconfig-basic.xml
[junit4] 2> 203207 T416 oass.IndexSchema.readSchema Reading Solr Schema from schema-analytics.xml
[junit4] 2> 203210 T416 oass.IndexSchema.readSchema [collection1] Schema name=schema-docValues
[junit4] 2> 203234 T416 oass.IndexSchema.readSchema unique key field: id
[junit4] 2> 203235 T416 oasc.SolrCore.initDirectoryFactory org.apache.solr.core.MockDirectoryFactory
[junit4] 2> 203235 T416 oasc.SolrCore.<init> [collection1] Opening new SolrCore at /mnt/ssd/jenkins/workspace/Lucene-Solr-trunk-Linux/solr/build/solr-core/test-files/solr/collection1/, dataDir=/mnt/ssd/jenkins/workspace/Lucene-Solr-trunk-Linux/solr/build/solr-core/test/J1/./solrtest-ExpressionTest-1387595370152/
[junit4] 2> 203236 T416 oasc.SolrCore.<init> JMX monitoring not detected for core: collection1
[junit4] 2> 203236 T416 oasc.CachingDirectoryFactory.get return new directory for /mnt/ssd/jenkins/workspace/Lucene-Solr-trunk-Linux/solr/build/solr-core/test/J1/./solrtest-ExpressionTest-1387595370152
[junit4] 2> 203237 T416 oasc.SolrCore.getNewIndexDir New index directory detected: old=null new=/mnt/ssd/jenkins/workspace/Lucene-Solr-trunk-Linux/solr/build/solr-core/test/J1/./solrtest-ExpressionTest-1387595370152/index/
[junit4] 2> 203237 T416 oasc.SolrCore.initIndex WARN [collection1] Solr index directory '/mnt/ssd/jenkins/workspace/Lucene-Solr-trunk-Linux/solr/build/solr-core/test/J1/./solrtest-ExpressionTest-1387595370152/index' doesn't exist. Creating new index...
[junit4] 2> 203237 T416 oasc.CachingDirectoryFactory.get return new directory for /mnt/ssd/jenkins/workspace/Lucene-Solr-trunk-Linux/solr/build/solr-core/test/J1/./solrtest-ExpressionTest-1387595370152/index
[junit4] 2> 203238 T416 oasu.RandomMergePolicy.<init> RandomMergePolicy wrapping class org.apache.lucene.index.TieredMergePolicy: [TieredMergePolicy: maxMergeAtOnce=42, maxMergeAtOnceExplicit=45, maxMergedSegmentMB=57.13671875, floorSegmentMB=1.1640625, forceMergeDeletesPctAllowed=3.706159675153091, segmentsPerTier=19.0, maxCFSSegmentSizeMB=8.796093022207999E12, noCFSRatio=1.0
[junit4] 2> 203239 T416 oasc.SolrDeletionPolicy.onCommit SolrDeletionPolicy.onCommit: commits: num=1
[junit4] 2> commit{dir=MockDirectoryWrapper(org.apache.lucene.store.RAMDirectory@6fecf04d lockFactory=org.apache.lucene.store.SingleInstanceLockFactory@989a838b),segFN=segments_1,generation=1}
[junit4] 2> 203239 T416 oasc.SolrDeletionPolicy.updateCommits newest commit generation = 1
[junit4] 2> 203240 T416 oasc.SolrCore.loadUpdateProcessorChains no updateRequestProcessorChain defined as default, creating implicit default
[junit4] 2> 203240 T416 oasc.RequestHandlers.initHandlersFromConfig created standard: solr.StandardRequestHandler
[junit4] 2> 203240 T416 oasc.RequestHandlers.initHandlersFromConfig created /update: solr.UpdateRequestHandler
[junit4] 2> 203242 T416 oashl.XMLLoader.init xsltCacheLifetimeSeconds=60
[junit4] 2> 203244 T416 oasu.CommitTracker.<init> Hard AutoCommit: disabled
[junit4] 2> 203244 T416 oasu.CommitTracker.<init> Soft AutoCommit: disabled
[junit4] 2> 203244 T416 oasu.RandomMergePolicy.<init> RandomMergePolicy wrapping class org.apache.lucene.index.TieredMergePolicy: [TieredMergePolicy: maxMergeAtOnce=48, maxMergeAtOnceExplicit=35, maxMergedSegmentMB=92.283203125, floorSegmentMB=1.294921875, forceMergeDeletesPctAllowed=17.10105742541526, segmentsPerTier=42.0, maxCFSSegmentSizeMB=8.796093022207999E12, noCFSRatio=1.0
[junit4] 2> 203245 T416 oasc.SolrDeletionPolicy.onInit SolrDeletionPolicy.onInit: commits: num=1
[junit4] 2> commit{dir=MockDirectoryWrapper(org.apache.lucene.store.RAMDirectory@6fecf04d lockFactory=org.apache.lucene.store.SingleInstanceLockFactory@989a838b),segFN=segments_1,generation=1}
[junit4] 2> 203245 T416 oasc.SolrDeletionPolicy.updateCommits newest commit generation = 1
[junit4] 2> 203246 T416 oass.SolrIndexSearcher.<init> Opening Searcher@fdc5e560 main
[junit4] 2> 203246 T416 oasc.CoreContainer.registerCore registering core: collection1
[junit4] 2> 203246 T417 oasc.SolrCore.registerSearcher [collection1] Registered new searcher Searcher@fdc5e560 main{StandardDirectoryReader(segments_1:1:nrt)}
[junit4] 2> 203248 T415 oas.SolrTestCaseJ4.initCore ####initCore end
[junit4] 2> ASYNC NEW_CORE C265 name=collection1 org.apache.solr.core.SolrCore@ca1b928a
[junit4] 2> 203252 T415 C265 oasu.DirectUpdateHandler2.deleteAll [collection1] REMOVING ALL DOCUMENTS FROM INDEX
[junit4] 2> 203252 T415 C265 oasup.LogUpdateProcessor.finish [collection1] webapp=null path=null params={} {deleteByQuery=*:*} 0 1
[junit4] 2> 203259 T415 C265 oasup.LogUpdateProcessor.finish [collection1] webapp=null path=null params={} {add=[10000]} 0 3
[junit4] 2> 203266 T415 C265 oasup.LogUpdateProcessor.finish [collection1] webapp=null path=null params={} {add=[10001]} 0 0
[junit4] 2> 203272 T415 C265 oasup.LogUpdateProcessor.finish [collection1] webapp=null path=null params={} {add=[10002]} 0 1
[junit4] 2> 203277 T415 C265 oasup.LogUpdateProcessor.finish [collection1] webapp=null path=null params={} {add=[10003]} 0 1
[junit4] 2> 203282 T415 C265 oasup.LogUpdateProcessor.finish [collection1] webapp=null path=null params={} {add=[10004]} 0 1
[junit4] 2> 203287 T415 C265 oasup.LogUpdateProcessor.finish [collection1] webapp=null path=null params={} {add=[10005]} 0 1
[junit4] 2> 203292 T415 C265 oasup.LogUpdateProcessor.finish [collection1] webapp=null path=null params={} {add=[10006]} 0 1
[junit4] 2> 203297 T415 C265 oasup.LogUpdateProcessor.finish [collection1] webapp=null path=null params={} {add=[10007]} 0 0
[junit4] 2> 203303 T415 C265 oasup.LogUpdateProcessor.finish [collection1] webapp=null path=null params={} {add=[10008]} 0 0
[junit4] 2> 203308 T415 C265 oasup.LogUpdateProcessor.finish [collection1] webapp=null path=null params={} {add=[10009]} 0 1
[junit4] 2> 203313 T415 C265 oasup.LogUpdateProcessor.finish [collection1] webapp=null path=null params={} {add=[100010]} 0 1
[junit4] 2> ASYNC NEW_CORE C266 name=collection1 org.apache.solr.core.SolrCore@ca1b928a
[junit4] 2> 203326 T415 C266 oasup.LogUpdateProcessor.finish [collection1] webapp=null path=null params={} {add=[100011]} 0 1
[junit4] 2> 203331 T415 C266 oasup.LogUpdateProcessor.finish [collection1] webapp=null path=null params={} {add=[100012]} 0 1
[junit4] 2> 203336 T415 C266 oasup.LogUpdateProcessor.finish [collection1] webapp=null path=null params={} {add=[100013]} 0 1
[junit4] 2> 203341 T415 C266 oasup.LogUpdateProcessor.finish [collection1] webapp=null path=null params={} {add=[100014]} 0 1
[junit4] 2> 203346 T415 C266 oasup.LogUpdateProcessor.finish [collection1] webapp=null path=null params={} {add=[100015]} 0 1
[junit4] 2> 203351 T415 C266 oasup.LogUpdateProcessor.finish [collection1] webapp=null path=null params={} {add=[100016]} 0 1
[junit4] 2> 203356 T415 C266 oasup.LogUpdateProcessor.finish [collection1] webapp=null path=null params={} {add=[100017]} 0 0
[junit4] 2> 203361 T415 C266 oasup.LogUpdateProcessor.finish [collection1] webapp=null path=null params={} {add=[100018]} 0 1
[junit4] 2> 203366 T415 C266 oasup.LogUpdateProcessor.finish [collection1] webapp=null path=null params={} {add=[100019]} 0 0
[junit4] 2> 203371 T415 C266 oasup.LogUpdateProcessor.finish [collection1] webapp=null path=null params={} {add=[100020]} 0 1
[junit4] 2> 203376 T415 C266 oasup.LogUpdateProcessor.finish [collection1] webapp=null path=null params={} {add=[100021]} 0 0
[junit4] 2> 203382 T415 C266 oasup.LogUpdateProcessor.finish [collection1] webapp=null path=null params={} {add=[100022]} 0 1
[junit4] 2> 203388 T415 C266 oasup.LogUpdateProcessor.finish [collection1] webapp=null path=null params={} {add=[100023]} 0 1
[junit4] 2> 203394 T415 C266 oasup.LogUpdateProcessor.finish [collection1] webapp=null path=null params={} {add=[100024]} 0 1
[junit4] 2> 203399 T415 C266 oasup.LogUpdateProcessor.finish [collection1] webapp=null path=null params={} {add=[100025]} 0 1
[junit4] 2> 203404 T415 C266 oasup.LogUpdateProcessor.finish [collection1] webapp=null path=null params={} {add=[100026]} 0 1
[junit4] 2> 203409 T415 C266 oasup.LogUpdateProcessor.finish [collection1] webapp=null path=null params={} {add=[100027]} 0 1
[junit4] 2> 203414 T415 C266 oasup.LogUpdateProcessor.finish [collection1] webapp=null path=null params={} {add=[100028]} 0 1
[junit4] 2> 203420 T415 C266 oasup.LogUpdateProcessor.finish [collection1] webapp=null path=null params={} {add=[100029]} 0 1
[junit4] 2> 203424 T415 C266 oasup.LogUpdateProcessor.finish [collection1] webapp=null path=null params={} {add=[100030]} 0 0
[junit4] 2> 203429 T415 C266 oasup.LogUpdateProcessor.finish [collection1] webapp=null path=null params={} {add=[100031]} 0 1
[junit4] 2> 203434 T415 C266 oasup.LogUpdateProcessor.finish [collection1] webapp=null path=null params={} {add=[100032]} 0 1
[junit4] 2> 203438 T415 C266 oasup.LogUpdateProcessor.finish [collection1] webapp=null path=null params={} {add=[100033]} 0 0
[junit4] 2> 203443 T415 C266 oasup.LogUpdateProcessor.finish [collection1] webapp=null path=null params={} {add=[100034]} 0 1
[junit4] 2> 203448 T415 C266 oasup.LogUpdateProcessor.finish [collection1] webapp=null path=null params={} {add=[100035]} 0 1
[junit4] 2> 203452 T415 C266 oasup.LogUpdateProcessor.finish [collection1] webapp=null path=null params={} {add=[100036]} 0 0
[junit4] 2> 203457 T415 C266 oasup.LogUpdateProcessor.finish [collection1] webapp=null path=null params={} {add=[100037]} 0 1
[junit4] 2> 203462 T415 C266 oasup.LogUpdateProcessor.finish [collection1] webapp=null path=null params={} {add=[100038]} 0 1
[junit4] 2> 203466 T415 C266 oasup.LogUpdateProcessor.finish [collection1] webapp=null path=null params={} {add=[100039]} 0 0
[junit4] 2> 203471 T415 C266 oasup.LogUpdateProcessor.finish [collection1] webapp=null path=null params={} {add=[100040]} 0 1
[junit4] 2> 203476 T415 C266 oasup.LogUpdateProcessor.finish [collection1] webapp=null path=null params={} {add=[100041]} 0 1
[junit4] 2> 203481 T415 C266 oasup.LogUpdateProcessor.finish [collection1] webapp=null path=null params={} {add=[100042]} 0 1
[junit4] 2> 203486 T415 C266 oasup.LogUpdateProcessor.finish [collection1] webapp=null path=null params={} {add=[100043]} 0 1
[junit4] 2> 203491 T415 C266 oasup.LogUpdateProcessor.finish [collection1] webapp=null path=null params={} {add=[100044]} 0 1
[junit4] 2> 203495 T415 C266 oasup.LogUpdateProcessor.finish [collection1] webapp=null path=null params={} {add=[100045]} 0 0
[junit4] 2> 203500 T415 C266 oasup.LogUpdateProcessor.finish [collection1] webapp=null path=null params={} {add=[100046]} 0 1
[junit4] 2> 203504 T415 C266 oasup.LogUpdateProcessor.finish [collection1] webapp=null path=null params={} {add=[100047]} 0 0
[junit4] 2> 203510 T415 C266 oasup.LogUpdateProcessor.finish [collection1] webapp=null path=null params={} {add=[100048]} 0 1
[junit4] 2> 203516 T415 C266 oasup.LogUpdateProcessor.finish [collection1] webapp=null path=null params={} {add=[100049]} 0 1
[junit4] 2> 203520 T415 C266 oasup.LogUpdateProcessor.finish [collection1] webapp=null path=null params={} {add=[100050]} 0 1
[junit4] 2> 203524 T415 C266 oasup.LogUpdateProcessor.finish [collection1] webapp=null path=null params={} {add=[100051]} 0 0
[junit4] 2> 203529 T415 C266 oasup.LogUpdateProcessor.finish [collection1] webapp=null path=null params={} {add=[100052]} 0 1
[junit4] 2> 203533 T415 C266 oasup.LogUpdateProcessor.finish [collection1] webapp=null path=null params={} {add=[100053]} 0 1
[junit4] 2> 203537 T415 C266 oasup.LogUpdateProcessor.finish [collection1] webapp=null path=null params={} {add=[100054]} 0 0
[junit4] 2> 203542 T415 C266 oasup.LogUpdateProcessor.finish [collection1] webapp=null path=null params={} {add=[100055]} 0 1
[junit4] 2> 203547 T415 C266 oasup.LogUpdateProcessor.finish [collection1] webapp=null path=null params={} {add=[100056]} 0 1
[junit4] 2> 203552 T415 C266 oasup.LogUpdateProcessor.finish [collection1] webapp=null path=null params={} {add=[100057]} 0 1
[junit4] 2> 203557 T415 C266 oasup.LogUpdateProcessor.finish [collection1] webapp=null path=null params={} {add=[100058]} 0 1
[junit4] 2> 203561 T415 C266 oasup.LogUpdateProcessor.finish [collection1] webapp=null path=null params={} {add=[100059]} 0 0
[junit4] 2> 203566 T415 C266 oasup.LogUpdateProcessor.finish [collection1] webapp=null path=null params={} {add=[100060]} 0 0
[junit4] 2> 203571 T415 C266 oasup.LogUpdateProcessor.finish [collection1] webapp=null path=null params={} {add=[100061]} 0 1
[junit4] 2> 203576 T415 C266 oasup.LogUpdateProcessor.finish [collection1] webapp=null path=null params={} {add=[100062]} 0 1
[junit4] 2> 203581 T415 C266 oasup.LogUpdateProcessor.finish [collection1] webapp=null path=null params={} {add=[100063]} 0 0
[junit4] 2> 203585 T415 C266 oasup.LogUpdateProcessor.finish [collection1] webapp=null path=null params={} {add=[100064]} 0 0
[junit4] 2> 203590 T415 C266 oasup.LogUpdateProcessor.finish [collection1] webapp=null path=null params={} {add=[100065]} 0 0
[junit4] 2> 203596 T415 C266 oasup.LogUpdateProcessor.finish [collection1] webapp=null path=null params={} {add=[100066]} 0 1
[junit4] 2> 203601 T415 C266 oasup.LogUpdateProcessor.finish [collection1] webapp=null path=null params={} {add=[100067]} 0 1
[junit4] 2> 203608 T415 C266 oasup.LogUpdateProcessor.finish [collection1] webapp=null path=null params={} {add=[100068]} 0 1
[junit4] 2> 203613 T415 C266 oasup.LogUpdateProcessor.finish [collection1] webapp=null path=null params={} {add=[100069]} 0 1
[junit4] 2> 203619 T415 C266 oasup.LogUpdateProcessor.finish [collection1] webapp=null path=null params={} {add=[100070]} 0 1
[junit4] 2> 203624 T415 C266 oasup.LogUpdateProcessor.finish [collection1] webapp=null path=null params={} {add=[100071]} 0 1
[junit4] 2> 203630 T415 C266 oasup.LogUpdateProcessor.finish [collection1] webapp=null path=null params={} {add=[100072]} 0 1
[junit4] 2> 203636 T415 C266 oasup.LogUpdateProcessor.finish [collection1] webapp=null path=null params={} {add=[100073]} 0 1
[junit4] 2> 203646 T415 C266 oasup.LogUpdateProcessor.finish [collection1] webapp=null path=null params={} {add=[100074]} 0 3
[junit4] 2> 203654 T415 C266 oasup.LogUpdateProcessor.finish [collection1] webapp=null path=null params={} {add=[100075]} 0 1
[junit4] 2> 203663 T415 C266 oasup.LogUpdateProcessor.finish [collection1] webapp=null path=null params={} {add=[100076]} 0 2
[junit4] 2> 203671 T415 C266 oasup.LogUpdateProcessor.finish [collection1] webapp=null path=null params={} {add=[100077]} 0 2
[junit4] 2> 203679 T415 C266 oasup.LogUpdateProcessor.finish [collection1] webapp=null path=null params={} {add=[100078]} 0 2
[junit4] 2> 203686 T415 C266 oasup.LogUpdateProcessor.finish [collection1] webapp=null path=null params={} {add=[100079]} 0 1
[junit4] 2> 203695 T415 C266 oasup.LogUpdateProcessor.finish [collection1] webapp=null path=null params={} {add=[100080]} 0 1
[junit4] 2> 203702 T415 C266 oasup.LogUpdateProcessor.finish [collection1] webapp=null path=null params={} {add=[100081]} 0 2
[junit4] 2> 203709 T415 C266 oasup.LogUpdateProcessor.finish [collection1] webapp=null path=null params={} {add=[100082]} 0 1
[junit4] 2> 203716 T415 C266 oasup.LogUpdateProcessor.finish [collection1] webapp=null path=null params={} {add=[100083]} 0 1
[junit4] 2> 203724 T415 C266 oasup.LogUpdateProcessor.finish [collection1] webapp=null path=null params={} {add=[100084]} 0 1
[junit4] 2> 203731 T415 C266 oasup.LogUpdateProcessor.finish [collection1] webapp=null path=null params={} {add=[100085]} 0 1
[junit4] 2> 203738 T415 C266 oasup.LogUpdateProcessor.finish [collection1] webapp=null path=null params={} {add=[100086]} 0 1
[junit4] 2> 203750 T415 C266 oasup.LogUpdateProcessor.finish [collection1] webapp=null path=null params={} {add=[100087]} 0 6
[junit4] 2> 203759 T415 C266 oasup.LogUpdateProcessor.finish [collection1] webapp=null path=null params={} {add=[100088]} 0 2
[junit4] 2> 203771 T415 C266 oasup.LogUpdateProcessor.finish [collection1] webapp=null path=null params={} {add=[100089]} 0 4
[junit4] 2> 203779 T415 C266 oasup.LogUpdateProcessor.finish [collection1] webapp=null path=null params={} {add=[100090]} 0 2
[junit4] 2> ASYNC NEW_CORE C267 name=collection1 org.apache.solr.core.SolrCore@ca1b928a
[junit4] 2> 203791 T415 C267 oasup.LogUpdateProcessor.finish [collection1] webapp=null path=null params={} {add=[100091]} 0 0
[junit4] 2> 203796 T415 C267 oasup.LogUpdateProcessor.finish [collection1] webapp=null path=null params={} {add=[100092]} 0 0
[junit4] 2> 203801 T415 C267 oasup.LogUpdateProcessor.finish [collection1] webapp=null path=null params={} {add=[100093]} 0 0
[junit4] 2> 203806 T415 C267 oasup.LogUpdateProcessor.finish [collection1] webapp=null path=null params={} {add=[100094]} 0 0
[junit4] 2> 203812 T415 C267 oasup.LogUpdateProcessor.finish [collection1] webapp=null path=null params={} {add=[100095]} 0 1
[junit4] 2> 203817 T415 C267 oasup.LogUpdateProcessor.finish [collection1] webapp=null path=null params={} {add=[100096]} 0 1
[junit4] 2> 203822 T415 C267 oasup.LogUpdateProcessor.finish [collection1] webapp=null path=null params={} {add=[100097]} 0 1
[junit4] 2> 203827 T415 C267 oasup.LogUpdateProcessor.finish [collection1] webapp=null path=null params={} {add=[100098]} 0 1
[junit4] 2> 203832 T415 C267 oasup.LogUpdateProcessor.finish [collection1] webapp=null path=null params={} {add=[100099]} 0 1
[junit4] 2> 203837 T415 C267 oasu.DirectUpdateHandler2.commit start commit{,optimize=false,openSearcher=true,waitSearcher=true,expungeDeletes=false,softCommit=false,prepareCommit=false}
[junit4] 2> 203867 T415 C267 oasc.SolrDeletionPolicy.onCommit SolrDeletionPolicy.onCommit: commits: num=2
[junit4] 2> commit{dir=MockDirectoryWrapper(org.apache.lucene.store.RAMDirectory@6fecf04d lockFactory=org.apache.lucene.store.SingleInstanceLockFactory@989a838b),segFN=segments_1,generation=1}
[junit4] 2> commit{dir=MockDirectoryWrapper(org.apache.lucene.store.RAMDirectory@6fecf04d lockFactory=org.apache.lucene.store.SingleInstanceLockFactory@989a838b),segFN=segments_2,generation=2}
[junit4] 2> 203867 T415 C267 oasc.SolrDeletionPolicy.updateCommits newest commit generation = 2
[junit4] 2> 203877 T415 C267 oass.SolrIndexSearcher.<init> Opening Searcher@1717259f main
[junit4] 2> 203878 T415 C267 oasu.DirectUpdateHandler2.commit end_commit_flush
[junit4] 2> 203878 T417 oasc.SolrCore.registerSearcher [collection1] Registered new searcher Searcher@1717259f main{StandardDirectoryReader(segments_2:4:nrt _0(5.0):c100)}
[junit4] 2> 203878 T415 C267 oasup.LogUpdateProcessor.finish [collection1] webapp=null path=null params={} {commit=} 0 42
[junit4] 2> 203961 T415 C267 oasc.SolrCore.execute [collection1] webapp=null path=null params={o.dr.s.mc=div(mean(int_id),count(long_ld))&o.nr.s.s=neg(sum(int_id))&o.cdr.s.cs1=const_str(1800-12-31T23:59:59Z)&o.dr.s.sum=sum(int_id)&o.ar.s.sum=sum(int_id)&o.cdr.s.cd2=const_date(1804-06-30T23:59:59Z)&o.rr.s.rmax=rev(max(string_sd))&indent=true&o.cr.s.ccmax=concat(const_str(this+is+the+second),max(string_sd))&o.avr.s.c=abs(neg(count(long_ld)))&o.cr.s.csmax=const_str(this+is+the+second)&o.dr.s.su=div(sum(int_id),unique(long_ld))&q=*:*&o.cnr.s.c10=const_num(10)&o.avr.s.s=abs(neg(sum(int_id)))&o.dr.s.count=count(long_ld)&o.dmr.s.median=median(date_dtd)&o.mr.s.unique=unique(long_ld)&o.cr.s.ccmin=concat(const_str(this+is+the+first),min(string_sd))&o.mr.s.mean=mean(int_id)&o.dmr.s.dmma=date_math(max(date_dtd),const_str(%2B2MONTHS))&o.pr.s.sum=sum(int_id)&o.ar.s.median=median(int_id)&o.cnr.s.c8=const_num(8)&o.mr.s.mcm=mult(mean(int_id),count(long_ld),median(int_id))&o.dr.s.mean=mean(int_id)&o.csr.s.cs2=const_str(this+is+the+second)&o.mr.s.count=count(long_ld)&o.pr.s.mean=mean(int_id)&o.ar.s.mcm=add(mean(int_id),count(long_ld),median(int_id))&o.ar.s.count=count(long_ld)&o.ar.s.su=add(sum(int_id),unique(long_ld))&o.cdr.s.cd1=const_date(1800-12-31T23:59:59Z)&o.pr.s.mc=pow(mean(int_id),count(long_ld))&o.mr.s.sum=sum(int_id)&o.pr.s.unique=unique(long_ld)&stats=true&o.nr.s.c=neg(count(long_ld))&o.nr.s.count=count(long_ld)&o.cr.s.min=min(string_sd)&o.cdr.s.cs2=const_str(1804-06-30T23:59:59Z)&o.cr.s.max=max(string_sd)&o.dr.s.unique=unique(long_ld)&o.dmr.s.dmme=date_math(median(date_dtd),const_str(%2B2YEARS))&o.cr.s.csmin=const_str(this+is+the+first)&o.pr.s.count=count(long_ld)&o.csr.s.cs1=const_str(this+is+the+first)&o.mr.s.median=median(int_id)&rows=0&o.dmr.s.cme=const_str(%2B2YEARS)&o.dmr.s.max=max(date_dtd)&o.avr.s.sum=sum(int_id)&o.rr.s.rmin=rev(min(string_sd))&o.pr.s.su=pow(sum(int_id),unique(long_ld))&olap=true&o.csr.s.cs3=const_str(this+is+the+third)&o.avr.s.count=count(long_ld)&o.mr.s.su=mult(sum(int_id),unique(long_ld))&o.dmr.s.cma=const_str(%2B2MONTHS)&o.nr.s.sum=sum(int_id)&o.rr.s.min=min(string_sd)&o.ar.s.unique=unique(long_ld)&o.rr.s.max=max(string_sd)&o.ar.s.mean=mean(int_id)} hits=100 status=0 QTime=76
[junit4] 2> 203969 T415 oas.SolrTestCaseJ4.setUp ###Starting constantNumberTest
[junit4] 2> 203971 T415 oas.SolrTestCaseJ4.tearDown ###Ending constantNumberTest
[junit4] 2> 203977 T415 oas.SolrTestCaseJ4.setUp ###Starting concatenateTest
[junit4] 2> 203981 T415 oas.SolrTestCaseJ4.tearDown ###Ending concatenateTest
[junit4] 2> 203986 T415 oas.SolrTestCaseJ4.setUp ###Starting divideTest
[junit4] 2> 203991 T415 oas.SolrTestCaseJ4.tearDown ###Ending divideTest
[junit4] 2> 203996 T415 oas.SolrTestCaseJ4.setUp ###Starting reverseTest
[junit4] 2> 203999 T415 oas.SolrTestCaseJ4.tearDown ###Ending reverseTest
[junit4] 2> 204005 T415 oas.SolrTestCaseJ4.setUp ###Starting powerTest
[junit4] 2> 204006 T415 oas.SolrTestCaseJ4.tearDown ###Ending powerTest
[junit4] 2> NOTE: reproduce with: ant test -Dtestcase=ExpressionTest -Dtests.method=powerTest -Dtests.seed=9994E81E0B474651 -Dtests.multiplier=3 -Dtests.slow=true -Dtests.locale=nl_BE -Dtests.timezone=Pacific/Gambier -Dtests.file.encoding=ISO-8859-1
[junit4] FAILURE 0.01s J1 | ExpressionTest.powerTest <<<
[junit4] > Throwable #1: java.lang.AssertionError: Caught exception in getStatResult, xPath = /response/lst[@name='stats']/lst[@name='pr']/double[@name='sum']
[junit4] > raw data: <?xml version="1.0" encoding="UTF-8"?>
[junit4] > <response>
[junit4] > <lst name="responseHeader">
[junit4] > <int name="status">0</int>
[junit4] > <int name="QTime">76</int>
[junit4] > </lst>
[junit4] > <result name="response" numFound="100" start="0">
[junit4] > </result>
[junit4] > <lst name="stats">
[junit4] > <lst name="stats_fields"/>
[junit4] > </lst>
[junit4] > <lst name="stats">
[junit4] > <lst name="ar">
[junit4] > <long name="count">100</long>
[junit4] > <null name="mcm"/>
[junit4] > <null name="mean"/>
[junit4] > <null name="median"/>
[junit4] > <null name="su"/>
[junit4] > <null name="sum"/>
[junit4] > <null name="unique"/>
[junit4] > </lst>
[junit4] > <lst name="csr">
[junit4] > <str name="cs1">this is the first</str>
[junit4] > <str name="cs2">this is the second</str>
[junit4] > <str name="cs3">this is the third</str>
[junit4] > </lst>
[junit4] > <lst name="dr">
[junit4] > <long name="count">100</long>
[junit4] > <double name="mc">0.2891</double>
[junit4] > <double name="mean">28.91</double>
[junit4] > <double name="su">80.30555555555556</double>
[junit4] > <double name="sum">2891.0</double>
[junit4] > <long name="unique">36</long>
[junit4] > </lst>
[junit4] > <lst name="mr">
[junit4] > <long name="count">100</long>
[junit4] > <double name="mcm">70829.5</double>
[junit4] > <double name="mean">28.91</double>
[junit4] > <double name="median">24.5</double>
[junit4] > <double name="su">104076.0</double>
[junit4] > <double name="sum">2891.0</double>
[junit4] > <long name="unique">36</long>
[junit4] > </lst>
[junit4] > <lst name="cr">
[junit4] > <str name="ccmax">this is the secondstr9</str>
[junit4] > <str name="ccmin">this is the firststr0</str>
[junit4] > <str name="csmax">this is the second</str>
[junit4] > <str name="csmin">this is the first</str>
[junit4] > <str name="max">str9</str>
[junit4] > <str name="min">str0</str>
[junit4] > </lst>
[junit4] > <lst name="cdr">
[junit4] > <date name="cd1">1800-12-31T23:59:59Z</date>
[junit4] > <date name="cd2">1804-06-30T23:59:59Z</date>
[junit4] > <str name="cs1">1800-12-31T23:59:59Z</str>
[junit4] > <str name="cs2">1804-06-30T23:59:59Z</str>
[junit4] > </lst>
[junit4] > <lst name="pr">
[junit4] > <long name="count">100</long>
[junit4] > <null name="mc"/>
[junit4] > <null name="mean"/>
[junit4] > <null name="su"/>
[junit4] > <null name="sum"/>
[junit4] > <null name="unique"/>
[junit4] > </lst>
[junit4] > <lst name="rr">
[junit4] > <str name="max">str9</str>
[junit4] > <str name="min">str0</str>
[junit4] > <str name="rmax">9rts</str>
[junit4] > <str name="rmin">0rts</str>
[junit4] > </lst>
[junit4] > <lst name="cnr">
[junit4] > <double name="c10">10.0</double>
[junit4] > <double name="c8">8.0</double>
[junit4] > </lst>
[junit4] > <lst name="avr">
[junit4] > <double name="c">100.0</double>
[junit4] > <long name="count">100</long>
[junit4] > <null name="s"/>
[junit4] > <null name="sum"/>
[junit4] > </lst>
[junit4] > <lst name="dmr">
[junit4] > <str name="cma">+2MONTHS</str>
[junit4] > <str name="cme">+2YEARS</str>
[junit4] > <date name="dmma">1812-02-29T23:59:59Z</date>
[junit4] > <date name="dmme">1807-12-31T23:59:59Z</date>
[junit4] > <date name="max">1811-12-31T23:59:59Z</date>
[junit4] > <date name="median">1805-12-31T23:59:59Z</date>
[junit4] > </lst>
[junit4] > <lst name="nr">
[junit4] > <double name="c">-100.0</double>
[junit4] > <long name="count">100</long>
[junit4] > <double name="s">-2891.0</double>
[junit4] > <double name="sum">2891.0</double>
[junit4] > </lst>
[junit4] > </lst>
[junit4] > </response>
[junit4] > at __randomizedtesting.SeedInfo.seed([9994E81E0B474651:F7265F1DE3501880]:0)
[junit4] > at org.apache.solr.analytics.AbstractAnalyticsStatsTest.getStatResult(AbstractAnalyticsStatsTest.java:113)
[junit4] > at org.apache.solr.analytics.expression.ExpressionTest.powerTest(ExpressionTest.java:119)
[junit4] > at java.lang.Thread.run(Thread.java:780)
[junit4] 2> 204019 T415 oas.SolrTestCaseJ4.setUp ###Starting constantStringTest
[junit4] 2> 204021 T415 oas.SolrTestCaseJ4.tearDown ###Ending constantStringTest
[junit4] 2> 204027 T415 oas.SolrTestCaseJ4.setUp ###Starting negateTest
[junit4] 2> 204030 T415 oas.SolrTestCaseJ4.tearDown ###Ending negateTest
[junit4] 2> 204036 T415 oas.SolrTestCaseJ4.setUp ###Starting absoluteValueTest
[junit4] 2> 204037 T415 oas.SolrTestCaseJ4.tearDown ###Ending absoluteValueTest
[junit4] 2> NOTE: reproduce with: ant test -Dtestcase=ExpressionTest -Dtests.method=absoluteValueTest -Dtests.seed=9994E81E0B474651 -Dtests.multiplier=3 -Dtests.slow=true -Dtests.locale=nl_BE -Dtests.timezone=Pacific/Gambier -Dtests.file.encoding=ISO-8859-1
[junit4] FAILURE 0.01s J1 | ExpressionTest.absoluteValueTest <<<
[junit4] > Throwable #1: java.lang.AssertionError: Caught exception in getStatResult, xPath = /response/lst[@name='stats']/lst[@name='avr']/double[@name='sum']
[junit4] > raw data: <?xml version="1.0" encoding="UTF-8"?>
[junit4] > <response>
[junit4] > <lst name="responseHeader">
[junit4] > <int name="status">0</int>
[junit4] > <int name="QTime">76</int>
[junit4] > </lst>
[junit4] > <result name="response" numFound="100" start="0">
[junit4] > </result>
[junit4] > <lst name="stats">
[junit4] > <lst name="stats_fields"/>
[junit4] > </lst>
[junit4] > <lst name="stats">
[junit4] > <lst name="ar">
[junit4] > <long name="count">100</long>
[junit4] > <null name="mcm"/>
[junit4] > <null name="mean"/>
[junit4] > <null name="median"/>
[junit4] > <null name="su"/>
[junit4] > <null name="sum"/>
[junit4] > <null name="unique"/>
[junit4] > </lst>
[junit4] > <lst name="csr">
[junit4] > <str name="cs1">this is the first</str>
[junit4] > <str name="cs2">this is the second</str>
[junit4] > <str name="cs3">this is the third</str>
[junit4] > </lst>
[junit4] > <lst name="dr">
[junit4] > <long name="count">100</long>
[junit4] > <double name="mc">0.2891</double>
[junit4] > <double name="mean">28.91</double>
[junit4] > <double name="su">80.30555555555556</double>
[junit4] > <double name="sum">2891.0</double>
[junit4] > <long name="unique">36</long>
[junit4] > </lst>
[junit4] > <lst name="mr">
[junit4] > <long name="count">100</long>
[junit4] > <double name="mcm">70829.5</double>
[junit4] > <double name="mean">28.91</double>
[junit4] > <double name="median">24.5</double>
[junit4] > <double name="su">104076.0</double>
[junit4] > <double name="sum">2891.0</double>
[junit4] > <long name="unique">36</long>
[junit4] > </lst>
[junit4] > <lst name="cr">
[junit4] > <str name="ccmax">this is the secondstr9</str>
[junit4] > <str name="ccmin">this is the firststr0</str>
[junit4] > <str name="csmax">this is the second</str>
[junit4] > <str name="csmin">this is the first</str>
[junit4] > <str name="max">str9</str>
[junit4] > <str name="min">str0</str>
[junit4] > </lst>
[junit4] > <lst name="cdr">
[junit4] > <date name="cd1">1800-12-31T23:59:59Z</date>
[junit4] > <date name="cd2">1804-06-30T23:59:59Z</date>
[junit4] > <str name="cs1">1800-12-31T23:59:59Z</str>
[junit4] > <str name="cs2">1804-06-30T23:59:59Z</str>
[junit4] > </lst>
[junit4] > <lst name="pr">
[junit4] > <long name="count">100</long>
[junit4] > <null name="mc"/>
[junit4] > <null name="mean"/>
[junit4] > <null name="su"/>
[junit4] > <null name="sum"/>
[junit4] > <null name="unique"/>
[junit4] > </lst>
[junit4] > <lst name="rr">
[junit4] > <str name="max">str9</str>
[junit4] > <str name="min">str0</str>
[junit4] > <str name="rmax">9rts</str>
[junit4] > <str name="rmin">0rts</str>
[junit4] > </lst>
[junit4] > <lst name="cnr">
[junit4] > <double name="c10">10.0</double>
[junit4] > <double name="c8">8.0</double>
[junit4] > </lst>
[junit4] > <lst name="avr">
[junit4] > <double name="c">100.0</double>
[junit4] > <long name="count">100</long>
[junit4] > <null name="s"/>
[junit4] > <null name="sum"/>
[junit4] > </lst>
[junit4] > <lst name="dmr">
[junit4] > <str name="cma">+2MONTHS</str>
[junit4] > <str name="cme">+2YEARS</str>
[junit4] > <date name="dmma">1812-02-29T23:59:59Z</date>
[junit4] > <date name="dmme">1807-12-31T23:59:59Z</date>
[junit4] > <date name="max">1811-12-31T23:59:59Z</date>
[junit4] > <date name="median">1805-12-31T23:59:59Z</date>
[junit4] > </lst>
[junit4] > <lst name="nr">
[junit4] > <double name="c">-100.0</double>
[junit4] > <long name="count">100</long>
[junit4] > <double name="s">-2891.0</double>
[junit4] > <double name="sum">2891.0</double>
[junit4] > </lst>
[junit4] > </lst>
[junit4] > </response>
[junit4] > at __randomizedtesting.SeedInfo.seed([9994E81E0B474651:B838C80BC6DA1E37]:0)
[junit4] > at org.apache.solr.analytics.AbstractAnalyticsStatsTest.getStatResult(AbstractAnalyticsStatsTest.java:113)
[junit4] > at org.apache.solr.analytics.expression.ExpressionTest.absoluteValueTest(ExpressionTest.java:143)
[junit4] > at java.lang.Thread.run(Thread.java:780)
[junit4] 2> 204049 T415 oas.SolrTestCaseJ4.setUp ###Starting constantDateTest
[junit4] 2> 204052 T415 oas.SolrTestCaseJ4.tearDown ###Ending constantDateTest
[junit4] 2> 204058 T415 oas.SolrTestCaseJ4.setUp ###Starting dateMathTest
[junit4] 2> 204063 T415 oas.SolrTestCaseJ4.tearDown ###Ending dateMathTest
[junit4] 2> 204068 T415 oas.SolrTestCaseJ4.setUp ###Starting addTest
[junit4] 2> 204070 T415 oas.SolrTestCaseJ4.tearDown ###Ending addTest
[junit4] 2> NOTE: reproduce with: ant test -Dtestcase=ExpressionTest -Dtests.method=addTest -Dtests.seed=9994E81E0B474651 -Dtests.multiplier=3 -Dtests.slow=true -Dtests.locale=nl_BE -Dtests.timezone=Pacific/Gambier -Dtests.file.encoding=ISO-8859-1
[junit4] FAILURE 0.01s J1 | ExpressionTest.addTest <<<
[junit4] > Throwable #1: java.lang.AssertionError: Caught exception in getStatResult, xPath = /response/lst[@name='stats']/lst[@name='ar']/double[@name='sum']
[junit4] > raw data: <?xml version="1.0" encoding="UTF-8"?>
[junit4] > <response>
[junit4] > <lst name="responseHeader">
[junit4] > <int name="status">0</int>
[junit4] > <int name="QTime">76</int>
[junit4] > </lst>
[junit4] > <result name="response" numFound="100" start="0">
[junit4] > </result>
[junit4] > <lst name="stats">
[junit4] > <lst name="stats_fields"/>
[junit4] > </lst>
[junit4] > <lst name="stats">
[junit4] > <lst name="ar">
[junit4] > <long name="count">100</long>
[junit4] > <null name="mcm"/>
[junit4] > <null name="mean"/>
[junit4] > <null name="median"/>
[junit4] > <null name="su"/>
[junit4] > <null name="sum"/>
[junit4] > <null name="unique"/>
[junit4] > </lst>
[junit4] > <lst name="csr">
[junit4] > <str name="cs1">this is the first</str>
[junit4] > <str name="cs2">this is the second</str>
[junit4] > <str name="cs3">this is the third</str>
[junit4] > </lst>
[junit4] > <lst name="dr">
[junit4] > <long name="count">100</long>
[junit4] > <double name="mc">0.2891</double>
[junit4] > <double name="mean">28.91</double>
[junit4] > <double name="su">80.30555555555556</double>
[junit4] > <double name="sum">2891.0</double>
[junit4] > <long name="unique">36</long>
[junit4] > </lst>
[junit4] > <lst name="mr">
[junit4] > <long name="count">100</long>
[junit4] > <double name="mcm">70829.5</double>
[junit4] > <double name="mean">28.91</double>
[junit4] > <double name="median">24.5</double>
[junit4] > <double name="su">104076.0</double>
[junit4] > <double name="sum">2891.0</double>
[junit4] > <long name="unique">36</long>
[junit4] > </lst>
[junit4] > <lst name="cr">
[junit4] > <str name="ccmax">this is the secondstr9</str>
[junit4] > <str name="ccmin">this is the firststr0</str>
[junit4] > <str name="csmax">this is the second</str>
[junit4] > <str name="csmin">this is the first</str>
[junit4] > <str name="max">str9</str>
[junit4] > <str name="min">str0</str>
[junit4] > </lst>
[junit4] > <lst name="cdr">
[junit4] > <date name="cd1">1800-12-31T23:59:59Z</date>
[junit4] > <date name="cd2">1804-06-30T23:59:59Z</date>
[junit4] > <str name="cs1">1800-12-31T23:59:59Z</str>
[junit4] > <str name="cs2">1804-06-30T23:59:59Z</str>
[junit4] > </lst>
[junit4] > <lst name="pr">
[junit4] > <long name="count">100</long>
[junit4] > <null name="mc"/>
[junit4] > <null name="mean"/>
[junit4] > <null name="su"/>
[junit4] > <null name="sum"/>
[junit4] > <null name="unique"/>
[junit4] > </lst>
[junit4] > <lst name="rr">
[junit4] > <str name="max">str9</str>
[junit4] > <str name="min">str0</str>
[junit4] > <str name="rmax">9rts</str>
[junit4] > <str name="rmin">0rts</str>
[junit4] > </lst>
[junit4] > <lst name="cnr">
[junit4] > <double name="c10">10.0</double>
[junit4] > <double name="c8">8.0</double>
[junit4] > </lst>
[junit4] > <lst name="avr">
[junit4] > <double name="c">100.0</double>
[junit4] > <long name="count">100</long>
[junit4] > <null name="s"/>
[junit4] > <null name="sum"/>
[junit4] > </lst>
[junit4] > <lst name="dmr">
[junit4] > <str name="cma">+2MONTHS</str>
[junit4] > <str name="cme">+2YEARS</str>
[junit4] > <date name="dmma">1812-02-29T23:59:59Z</date>
[junit4] > <date name="dmme">1807-12-31T23:59:59Z</date>
[junit4] > <date name="max">1811-12-31T23:59:59Z</date>
[junit4] > <date name="median">1805-12-31T23:59:59Z</date>
[junit4] > </lst>
[junit4] > <lst name="nr">
[junit4] > <double name="c">-100.0</double>
[junit4] > <long name="count">100</long>
[junit4] > <double name="s">-2891.0</double>
[junit4] > <double name="sum">2891.0</double>
[junit4] > </lst>
[junit4] > </lst>
[junit4] > </response>
[junit4] > at __randomizedtesting.SeedInfo.seed([9994E81E0B474651:6FB845C04A884116]:0)
[junit4] > at org.apache.solr.analytics.AbstractAnalyticsStatsTest.getStatResult(AbstractAnalyticsStatsTest.java:113)
[junit4] > at org.apache.solr.analytics.expression.ExpressionTest.addTest(ExpressionTest.java:78)
[junit4] > at java.lang.Thread.run(Thread.java:780)
[junit4] 2> 204081 T415 oas.SolrTestCaseJ4.setUp ###Starting multiplyTest
[junit4] 2> 204086 T415 oas.SolrTestCaseJ4.tearDown ###Ending multiplyTest
[junit4] 2> 204089 T415 oas.SolrTestCaseJ4.deleteCore ###deleteCore
[junit4] 2> 204089 T415 oasc.CoreContainer.shutdown Shutting down CoreContainer instance=1774737323
[junit4] 2> 204089 T415 oasc.SolrCore.close [collection1] CLOSING SolrCore org.apache.solr.core.SolrCore@ca1b928a
[junit4] 2> 204090 T415 oasu.DirectUpdateHandler2.close closing DirectUpdateHandler2{commits=1,autocommits=0,soft autocommits=0,optimizes=0,rollbacks=0,expungeDeletes=0,docsPending=0,adds=0,deletesById=0,deletesByQuery=0,errors=0,cumulative_adds=100,cumulative_deletesById=0,cumulative_deletesByQuery=1,cumulative_errors=0}
[junit4] 2> 204090 T415 oasu.SolrCoreState.decrefSolrCoreState Closing SolrCoreState
[junit4] 2> 204090 T415 oasu.DefaultSolrCoreState.closeIndexWriter SolrCoreState ref count has reached 0 - closing IndexWriter
[junit4] 2> 204091 T415 oasu.DefaultSolrCoreState.closeIndexWriter closing IndexWriter with IndexWriterCloser
[junit4] 2> 204091 T415 oasc.SolrCore.closeSearcher [collection1] Closing main searcher on request.
[junit4] 2> 204092 T415 oasc.CachingDirectoryFactory.close Closing MockDirectoryFactory - 2 directories currently being tracked
[junit4] 2> 204092 T415 oasc.CachingDirectoryFactory.closeCacheValue looking to close /mnt/ssd/jenkins/workspace/Lucene-Solr-trunk-Linux/solr/build/solr-core/test/J1/./solrtest-ExpressionTest-1387595370152/index [CachedDir<<refCount=0;path=/mnt/ssd/jenkins/workspace/Lucene-Solr-trunk-Linux/solr/build/solr-core/test/J1/./solrtest-ExpressionTest-1387595370152/index;done=false>>]
[junit4] 2> 204092 T415 oasc.CachingDirectoryFactory.close Closing directory: /mnt/ssd/jenkins/workspace/Lucene-Solr-trunk-Linux/solr/build/solr-core/test/J1/./solrtest-ExpressionTest-1387595370152/index
[junit4] 2> 204093 T415 oasc.CachingDirectoryFactory.closeCacheValue looking to close /mnt/ssd/jenkins/workspace/Lucene-Solr-trunk-Linux/solr/build/solr-core/test/J1/./solrtest-ExpressionTest-1387595370152 [CachedDir<<refCount=0;path=/mnt/ssd/jenkins/workspace/Lucene-Solr-trunk-Linux/solr/build/solr-core/test/J1/./solrtest-ExpressionTest-1387595370152;done=false>>]
[junit4] 2> 204093 T415 oasc.CachingDirectoryFactory.close Closing directory: /mnt/ssd/jenkins/workspace/Lucene-Solr-trunk-Linux/solr/build/solr-core/test/J1/./solrtest-ExpressionTest-1387595370152
[junit4] 2> NOTE: test params are: codec=Lucene46: {double_dd=Pulsing41(freqCutoff=17 minBlockSize=45 maxBlockSize=91), string_sd=PostingsFormat(name=SimpleText), long_ld=PostingsFormat(name=FSTPulsing41), date_dtd=PostingsFormat(name=FSTPulsing41), id=PostingsFormat(name=FSTPulsing41), float_fd=PostingsFormat(name=FSTPulsing41), int_id=PostingsFormat(name=SimpleText)}, docValues:{stringdvm=DocValuesFormat(name=Memory), long_ld=DocValuesFormat(name=Disk), int_id=DocValuesFormat(name=SimpleText), float_fd=DocValuesFormat(name=Disk), string_sd=DocValuesFormat(name=SimpleText), intdv=DocValuesFormat(name=SimpleText), doubledv=DocValuesFormat(name=Disk), double_dd=DocValuesFormat(name=Memory), stringdv=DocValuesFormat(name=Disk), datedv=DocValuesFormat(name=Lucene45), date_dtd=DocValuesFormat(name=Disk), longdv=DocValuesFormat(name=Memory), floatdv=DocValuesFormat(name=Memory)}, sim=DefaultSimilarity, locale=nl_BE, timezone=Pacific/Gambier
[junit4] 2> NOTE: Linux 3.8.0-34-generic amd64/IBM Corporation 1.7.0 (64-bit)/cpus=8,threads=1,free=85666408,total=180027392
[junit4] 2> NOTE: All tests run in this JVM: [TestStressReorder, JSONWriterTest, PingRequestHandlerTest, HdfsChaosMonkeySafeLeaderTest, TestSolrQueryParserResource, TermVectorComponentDistributedTest, AbstractAnalyticsFacetTest, MultiTermTest, TestBinaryField, TestPhraseSuggestions, TestCSVResponseWriter, TestAtomicUpdateErrorCases, AliasIntegrationTest, TestImplicitCoreProperties, PrimUtilsTest, TestIndexSearcher, TestCSVLoader, BadCopyFieldTest, TestSolrXml, BasicZkTest, NumericFieldsTest, SpellCheckComponentTest, TestLazyCores, TestAnalyzedSuggestions, DirectUpdateHandlerTest, SolrCmdDistributorTest, TestSchemaSimilarityResource, FieldAnalysisRequestHandlerTest, DebugComponentTest, TestZkChroot, DateFieldTest, HdfsBasicDistributedZk2Test, SimplePostToolTest, HdfsDirectoryTest, HdfsBasicDistributedZkTest, StatsComponentTest, ExpressionTest]
[junit4] Completed on J1 in 1.12s, 12 tests, 3 failures <<< FAILURES!
[...truncated 421 lines...]
[junit4] Suite: org.apache.solr.update.processor.SignatureUpdateProcessorFactoryTest
[junit4] 2> 605462 T2119 oas.SolrTestCaseJ4.initCore ####initCore
[junit4] 2> Creating dataDir: /mnt/ssd/jenkins/workspace/Lucene-Solr-trunk-Linux/solr/build/solr-core/test/J0/./solrtest-SignatureUpdateProcessorFactoryTest-1387595772590
[junit4] 2> 605462 T2119 oasc.SolrResourceLoader.<init> new SolrResourceLoader for directory: '/mnt/ssd/jenkins/workspace/Lucene-Solr-trunk-Linux/solr/build/solr-core/test-files/solr/collection1/'
[junit4] 2> 605463 T2119 oasc.SolrResourceLoader.replaceClassLoader Adding 'file:/mnt/ssd/jenkins/workspace/Lucene-Solr-trunk-Linux/solr/build/solr-core/test-files/solr/collection1/lib/classes/' to classloader
[junit4] 2> 605463 T2119 oasc.SolrResourceLoader.replaceClassLoader Adding 'file:/mnt/ssd/jenkins/workspace/Lucene-Solr-trunk-Linux/solr/build/solr-core/test-files/solr/collection1/lib/README' to classloader
[junit4] 2> 605496 T2119 oasc.SolrConfig.<init> Using Lucene MatchVersion: LUCENE_50
[junit4] 2> 605537 T9 oasc.CoreContainer.finalize ERROR CoreContainer was not shutdown prior to finalize(), indicates a bug -- POSSIBLE RESOURCE LEAK!!! instance=1771994816
[junit4] 2> 605540 T2119 oasc.SolrConfig.<init> Loaded SolrConfig: solrconfig.xml
[junit4] 2> 605541 T2119 oass.IndexSchema.readSchema Reading Solr Schema from schema12.xml
[junit4] 2> 605546 T2119 oass.IndexSchema.readSchema [null] Schema name=test
[junit4] 2> 605824 T2119 oass.IndexSchema.readSchema default search field in schema is text
[junit4] 2> 605827 T2119 oass.IndexSchema.readSchema unique key field: id
[junit4] 2> 605828 T2119 oass.IndexSchema.readSchema WARN Field text is not multivalued and destination for multiple copyFields (2)
[junit4] 2> 605835 T2119 oass.FileExchangeRateProvider.reload Reloading exchange rates from file currency.xml
[junit4] 2> 605839 T2119 oass.FileExchangeRateProvider.reload Reloading exchange rates from file currency.xml
[junit4] 2> 605843 T2119 oasc.SolrResourceLoader.locateSolrHome JNDI not configured for solr (NoInitialContextEx)
[junit4] 2> 605843 T2119 oasc.SolrResourceLoader.locateSolrHome using system property solr.solr.home: /mnt/ssd/jenkins/workspace/Lucene-Solr-trunk-Linux/solr/build/solr-core/test-files/solr
[junit4] 2> 605843 T2119 oasc.SolrResourceLoader.<init> new SolrResourceLoader for directory: '/mnt/ssd/jenkins/workspace/Lucene-Solr-trunk-Linux/solr/build/solr-core/test-files/solr/'
[junit4] 2> 605851 T2119 oasc.SolrResourceLoader.locateSolrHome JNDI not configured for solr (NoInitialContextEx)
[junit4] 2> 605851 T2119 oasc.SolrResourceLoader.locateSolrHome using system property solr.solr.home: /mnt/ssd/jenkins/workspace/Lucene-Solr-trunk-Linux/solr/build/solr-core/test-files/solr
[junit4] 2> 605851 T2119 oasc.SolrResourceLoader.<init> new SolrResourceLoader for deduced Solr Home: '/mnt/ssd/jenkins/workspace/Lucene-Solr-trunk-Linux/solr/build/solr-core/test-files/solr/'
[junit4] 2> 605889 T2119 oasc.CoreContainer.<init> New CoreContainer 407634520
[junit4] 2> 605890 T2119 oasc.CoreContainer.load Loading cores into CoreContainer [instanceDir=/mnt/ssd/jenkins/workspace/Lucene-Solr-trunk-Linux/solr/build/solr-core/test-files/solr/]
[junit4] 2> 605891 T2119 oashc.HttpShardHandlerFactory.getParameter Setting socketTimeout to: 0
[junit4] 2> 605891 T2119 oashc.HttpShardHandlerFactory.getParameter Setting urlScheme to: http://
[junit4] 2> 605891 T2119 oashc.HttpShardHandlerFactory.getParameter Setting connTimeout to: 0
[junit4] 2> 605892 T2119 oashc.HttpShardHandlerFactory.getParameter Setting maxConnectionsPerHost to: 20
[junit4] 2> 605892 T2119 oashc.HttpShardHandlerFactory.getParameter Setting corePoolSize to: 0
[junit4] 2> 605892 T2119 oashc.HttpShardHandlerFactory.getParameter Setting maximumPoolSize to: 2147483647
[junit4] 2> 605892 T2119 oashc.HttpShardHandlerFactory.getParameter Setting maxThreadIdleTime to: 5
[junit4] 2> 605893 T2119 oashc.HttpShardHandlerFactory.getParameter Setting sizeOfQueue to: -1
[junit4] 2> 605893 T2119 oashc.HttpShardHandlerFactory.getParameter Setting fairnessPolicy to: false
[junit4] 2> 605898 T2119 oasl.LogWatcher.createWatcher SLF4J impl is org.slf4j.impl.Log4jLoggerFactory
[junit4] 2> 605898 T2119 oasl.LogWatcher.newRegisteredLogWatcher Registering Log Listener [Log4j (org.slf4j.impl.Log4jLoggerFactory)]
[junit4] 2> 605898 T2119 oasc.CoreContainer.load Host Name:
[junit4] 2> 605901 T2120 oasc.CoreContainer.create Creating SolrCore 'collection1' using instanceDir: /mnt/ssd/jenkins/workspace/Lucene-Solr-trunk-Linux/solr/build/solr-core/test-files/solr/collection1
[junit4] 2> 605902 T2120 oasc.SolrResourceLoader.<init> new SolrResourceLoader for directory: '/mnt/ssd/jenkins/workspace/Lucene-Solr-trunk-Linux/solr/build/solr-core/test-files/solr/collection1/'
[junit4] 2> 605902 T2120 oasc.SolrResourceLoader.replaceClassLoader Adding 'file:/mnt/ssd/jenkins/workspace/Lucene-Solr-trunk-Linux/solr/build/solr-core/test-files/solr/collection1/lib/classes/' to classloader
[junit4] 2> 605903 T2120 oasc.SolrResourceLoader.replaceClassLoader Adding 'file:/mnt/ssd/jenkins/workspace/Lucene-Solr-trunk-Linux/solr/build/solr-core/test-files/solr/collection1/lib/README' to classloader
[junit4] 2> 605940 T2120 oasc.SolrConfig.<init> Using Lucene MatchVersion: LUCENE_50
[junit4] 2> 605983 T2120 oasc.SolrConfig.<init> Loaded SolrConfig: solrconfig.xml
[junit4] 2> 605984 T2120 oass.IndexSchema.readSchema Reading Solr Schema from schema12.xml
[junit4] 2> 605989 T2120 oass.IndexSchema.readSchema [collection1] Schema name=test
[junit4] 2> 606289 T2120 oass.IndexSchema.readSchema default search field in schema is text
[junit4] 2> 606293 T2120 oass.IndexSchema.readSchema unique key field: id
[junit4] 2> 606295 T2120 oass.IndexSche
[...truncated too long message...]
9 oasu.DirectUpdateHandler2.commit start commit{,optimize=false,openSearcher=true,waitSearcher=true,expungeDeletes=false,softCommit=false,prepareCommit=false}
[junit4] 2> 607563 T2119 oasc.SolrDeletionPolicy.onCommit SolrDeletionPolicy.onCommit: commits: num=2
[junit4] 2> commit{dir=RateLimitedDirectoryWrapper(MockDirectoryWrapper(org.apache.lucene.store.RAMDirectory@cf7ac411 lockFactory=org.apache.lucene.store.SingleInstanceLockFactory@5988fb13)),segFN=segments_y,generation=34}
[junit4] 2> commit{dir=RateLimitedDirectoryWrapper(MockDirectoryWrapper(org.apache.lucene.store.RAMDirectory@cf7ac411 lockFactory=org.apache.lucene.store.SingleInstanceLockFactory@5988fb13)),segFN=segments_z,generation=35}
[junit4] 2> 607564 T2119 oasc.SolrDeletionPolicy.updateCommits newest commit generation = 35
[junit4] 2> 607569 T2119 oass.SolrIndexSearcher.<init> Opening Searcher@e3917ff7 main
[junit4] 2> 607574 T2121 oasc.SolrCore.registerSearcher [collection1] Registered new searcher Searcher@e3917ff7 main{StandardDirectoryReader(segments_z:122:nrt _w(5.0):C5/1:delGen=1)}
[junit4] 2> 607575 T2119 oasu.DirectUpdateHandler2.commit end_commit_flush
[junit4] 2> 607576 T2119 oas.SolrTestCaseJ4.tearDown ###Ending testNonStringFieldsValues
[junit4] 2> 607589 T2119 oas.SolrTestCaseJ4.setUp ###Starting testFailNonIndexedSigWithOverwriteDupes
[junit4] 2> 607599 T2119 C1346 oasu.DirectUpdateHandler2.deleteAll [collection1] REMOVING ALL DOCUMENTS FROM INDEX
[junit4] 2> 607601 T2119 C1346 oasup.LogUpdateProcessor.finish [collection1] webapp=null path=null params={} {deleteByQuery=*:*} 0 3
[junit4] 2> 607612 T2119 C1346 oasu.DirectUpdateHandler2.commit start commit{,optimize=false,openSearcher=true,waitSearcher=true,expungeDeletes=false,softCommit=false,prepareCommit=false}
[junit4] 2> 607613 T2119 C1346 oasc.SolrDeletionPolicy.onCommit SolrDeletionPolicy.onCommit: commits: num=2
[junit4] 2> commit{dir=RateLimitedDirectoryWrapper(MockDirectoryWrapper(org.apache.lucene.store.RAMDirectory@cf7ac411 lockFactory=org.apache.lucene.store.SingleInstanceLockFactory@5988fb13)),segFN=segments_z,generation=35}
[junit4] 2> commit{dir=RateLimitedDirectoryWrapper(MockDirectoryWrapper(org.apache.lucene.store.RAMDirectory@cf7ac411 lockFactory=org.apache.lucene.store.SingleInstanceLockFactory@5988fb13)),segFN=segments_10,generation=36}
[junit4] 2> 607614 T2119 C1346 oasc.SolrDeletionPolicy.updateCommits newest commit generation = 36
[junit4] 2> 607616 T2119 C1346 oass.SolrIndexSearcher.<init> Opening Searcher@3d85ffc7 main
[junit4] 2> 607621 T2121 oasc.SolrCore.registerSearcher [collection1] Registered new searcher Searcher@3d85ffc7 main{StandardDirectoryReader(segments_10:123:nrt)}
[junit4] 2> 607622 T2119 C1346 oasu.DirectUpdateHandler2.commit end_commit_flush
[junit4] 2> 607623 T2119 C1346 oasup.LogUpdateProcessor.finish [collection1] webapp=null path=null params={} {commit=} 0 11
[junit4] 2> 607625 T2119 oas.SolrTestCaseJ4.tearDown ###Ending testFailNonIndexedSigWithOverwriteDupes
[junit4] 2> 607639 T2119 oas.SolrTestCaseJ4.deleteCore ###deleteCore
[junit4] 2> 607639 T2119 oasc.CoreContainer.shutdown Shutting down CoreContainer instance=407634520
[junit4] 2> 607640 T2119 oasc.SolrCore.close [collection1] CLOSING SolrCore org.apache.solr.core.SolrCore@fb975bc
[junit4] 2> 607659 T2119 oasu.DirectUpdateHandler2.close closing DirectUpdateHandler2{commits=42,autocommits=0,soft autocommits=0,optimizes=0,rollbacks=0,expungeDeletes=0,docsPending=0,adds=0,deletesById=0,deletesByQuery=0,errors=0,cumulative_adds=253,cumulative_deletesById=0,cumulative_deletesByQuery=6,cumulative_errors=0}
[junit4] 2> 607660 T2119 oasu.SolrCoreState.decrefSolrCoreState Closing SolrCoreState
[junit4] 2> 607661 T2119 oasu.DefaultSolrCoreState.closeIndexWriter SolrCoreState ref count has reached 0 - closing IndexWriter
[junit4] 2> 607661 T2119 oasu.DefaultSolrCoreState.closeIndexWriter closing IndexWriter with IndexWriterCloser
[junit4] 2> 607664 T2119 oasc.SolrCore.closeSearcher [collection1] Closing main searcher on request.
[junit4] 2> 607664 T2119 oasc.CachingDirectoryFactory.close Closing MockDirectoryFactory - 2 directories currently being tracked
[junit4] 2> 607665 T2119 oasc.CachingDirectoryFactory.closeCacheValue looking to close /mnt/ssd/jenkins/workspace/Lucene-Solr-trunk-Linux/solr/build/solr-core/test/J0/./solrtest-SignatureUpdateProcessorFactoryTest-1387595772590/index [CachedDir<<refCount=0;path=/mnt/ssd/jenkins/workspace/Lucene-Solr-trunk-Linux/solr/build/solr-core/test/J0/./solrtest-SignatureUpdateProcessorFactoryTest-1387595772590/index;done=false>>]
[junit4] 2> 607665 T2119 oasc.CachingDirectoryFactory.close Closing directory: /mnt/ssd/jenkins/workspace/Lucene-Solr-trunk-Linux/solr/build/solr-core/test/J0/./solrtest-SignatureUpdateProcessorFactoryTest-1387595772590/index
[junit4] 2> 607666 T2119 oasc.CachingDirectoryFactory.closeCacheValue looking to close /mnt/ssd/jenkins/workspace/Lucene-Solr-trunk-Linux/solr/build/solr-core/test/J0/./solrtest-SignatureUpdateProcessorFactoryTest-1387595772590 [CachedDir<<refCount=0;path=/mnt/ssd/jenkins/workspace/Lucene-Solr-trunk-Linux/solr/build/solr-core/test/J0/./solrtest-SignatureUpdateProcessorFactoryTest-1387595772590;done=false>>]
[junit4] 2> 607666 T2119 oasc.CachingDirectoryFactory.close Closing directory: /mnt/ssd/jenkins/workspace/Lucene-Solr-trunk-Linux/solr/build/solr-core/test/J0/./solrtest-SignatureUpdateProcessorFactoryTest-1387595772590
[junit4] 2> NOTE: test params are: codec=Lucene46: {id=MockVariableIntBlock(baseBlockSize=29), weight=FST41, signatureField=PostingsFormat(name=MockSep), v_t=MockVariableIntBlock(baseBlockSize=29), ints_is=Lucene41(blocksize=128), name=MockVariableIntBlock(baseBlockSize=29)}, docValues:{}, sim=DefaultSimilarity, locale=nl_NL_PREEURO, timezone=Etc/GMT+6
[junit4] 2> NOTE: Linux 3.8.0-34-generic amd64/IBM Corporation 1.7.0 (64-bit)/cpus=8,threads=1,free=180563256,total=280100864
[junit4] 2> NOTE: All tests run in this JVM: [TestGroupingSearch, ZkControllerTest, DocumentBuilderTest, StressHdfsTest, PrimitiveFieldTypeTest, ReturnFieldsTest, TestRandomMergePolicy, MoreLikeThisHandlerTest, TestSuggestSpellingConverter, AddSchemaFieldsUpdateProcessorFactoryTest, TestSolrXmlPersistor, PeerSyncTest, SliceStateUpdateTest, SpatialFilterTest, DOMUtilTest, TestWriterPerf, ScriptEngineTest, TestJmxMonitoredMap, TestFileDictionaryLookup, LoggingHandlerTest, MBeansHandlerTest, CacheHeaderTest, LegacyHTMLStripCharFilterTest, TestSolrXMLSerializer, TestCollationFieldDocValues, TestSolrXmlPersistence, FileBasedSpellCheckerTest, TestExtendedDismaxParser, CoreAdminHandlerTest, TestSchemaVersionResource, SystemInfoHandlerTest, SynonymTokenizerTest, TestJoin, TestStressUserVersions, CSVRequestHandlerTest, CircularListTest, BJQParserTest, TestSolrIndexConfig, ResourceLoaderTest, DeleteReplicaTest, TestTrie, AnalysisAfterCoreReloadTest, SOLR749Test, SchemaVersionSpecificBehaviorTest, TestLRUCache, DeleteShardTest, TestLMDirichletSimilarityFactory, TestReversedWildcardFilterFactory, HdfsUnloadDistributedZkTest, ResponseLogComponentTest, TestDynamicFieldResource, QueryParsingTest, DistributedTermsComponentTest, WordBreakSolrSpellCheckerTest, AutoCommitTest, URLClassifyProcessorTest, TestLFUCache, SolrCoreTest, TestClassNameShortening, AddBlockUpdateTest, BlockDirectoryTest, TestLuceneMatchVersion, SoftAutoCommitTest, TestCoreContainer, TestDocumentBuilder, SliceStateTest, TestNoOpRegenerator, LeaderElectionTest, TestBadConfig, SyncSliceTest, TestCloudManagedSchema, BasicDistributedZkTest, TestCopyFieldCollectionResource, SolrTestCaseJ4Test, TestNRTOpen, PolyFieldTest, TestCharFilters, SuggesterFSTTest, TestConfig, ZkCLITest, SimpleFacetsTest, PreAnalyzedUpdateProcessorTest, TestCustomSort, SpellPossibilityIteratorTest, ShardRoutingTest, RecoveryZkTest, FullSolrCloudDistribCmdsTest, TestReplicationHandler, ClusterStateUpdateTest, ZkSolrClientTest, TestRandomDVFaceting, TestMultiCoreConfBootstrap, TestReload, HardAutoCommitTest, TestSolr4Spatial, ConvertedLegacyTest, TestSort, TestFunctionQuery, BasicFunctionalityTest, OverseerCollectionProcessorTest, ShowFileRequestHandlerTest, CurrencyFieldOpenExchangeTest, DistributedQueryElevationComponentTest, CurrencyFieldXmlFileTest, SolrIndexSplitterTest, TestCoreDiscovery, SignatureUpdateProcessorFactoryTest]
[junit4] Completed on J0 in 2.23s, 6 tests, 1 failure <<< FAILURES!
[...truncated 439 lines...]
BUILD FAILED
/mnt/ssd/jenkins/workspace/Lucene-Solr-trunk-Linux/build.xml:453: The following error occurred while executing this line:
/mnt/ssd/jenkins/workspace/Lucene-Solr-trunk-Linux/build.xml:446: The following error occurred while executing this line:
/mnt/ssd/jenkins/workspace/Lucene-Solr-trunk-Linux/build.xml:39: The following error occurred while executing this line:
/mnt/ssd/jenkins/workspace/Lucene-Solr-trunk-Linux/extra-targets.xml:37: The following error occurred while executing this line:
/mnt/ssd/jenkins/workspace/Lucene-Solr-trunk-Linux/solr/build.xml:189: The following error occurred while executing this line:
/mnt/ssd/jenkins/workspace/Lucene-Solr-trunk-Linux/solr/common-build.xml:491: The following error occurred while executing this line:
/mnt/ssd/jenkins/workspace/Lucene-Solr-trunk-Linux/lucene/common-build.xml:1304: The following error occurred while executing this line:
/mnt/ssd/jenkins/workspace/Lucene-Solr-trunk-Linux/lucene/common-build.xml:937: There were test failures: 357 suites, 1572 tests, 4 failures, 67 ignored (6 assumptions)
Total time: 34 minutes 45 seconds
Build step 'Invoke Ant' marked build as failure
Description set: Java: 64bit/ibm-j9-jdk7 -Xjit:exclude={org/apache/lucene/util/fst/FST.pack(IIF)Lorg/apache/lucene/util/fst/FST;}
Archiving artifacts
Recording test results
Email was triggered for: Failure
Sending email for trigger: Failure