You are viewing a plain text version of this content. The canonical link for it is here.
Posted to notification@tuscany.apache.org by Apache Jenkins Server <je...@builds.apache.org> on 2013/07/07 03:59:27 UTC
Build failed in Jenkins: Tuscany-2x #1070
See <https://builds.apache.org/job/Tuscany-2x/1070/>
------------------------------------------
[...truncated 47620 lines...]
INFO: Add endpoint - binding.ws - http://localhost:8085/myService
Jul 7, 2013 1:55:01 AM org.apache.tuscany.sca.core.assembly.impl.DomainRegistryImpl addEndpoint
INFO: Add endpoint - binding.sca - HelloWorldComponent/HelloWorld
Jul 7, 2013 1:55:01 AM org.apache.tuscany.sca.node.impl.NodeImpl stop
INFO: Stopping node: http://tuscany.apache.org/sca/1.1/nodes/default0
Jul 7, 2013 1:55:01 AM org.apache.tuscany.sca.core.assembly.impl.DomainRegistryImpl removeEndpoint
INFO: Remove endpoint - binding.ws - http://localhost:8085/myService
Jul 7, 2013 1:55:01 AM org.apache.tuscany.sca.http.jetty.JettyServer removeServletMapping
INFO: Removed Servlet mapping: /myService
Jul 7, 2013 1:55:01 AM org.apache.tuscany.sca.core.assembly.impl.DomainRegistryImpl removeEndpoint
INFO: Remove endpoint - binding.sca - HelloWorldComponent/HelloWorld
Tests run: 1, Failures: 0, Errors: 0, Skipped: 0, Time elapsed: 2.963 sec
Results :
Tests run: 1, Failures: 0, Errors: 0, Skipped: 0
[JENKINS] Recording test results
[INFO] [jar:jar {execution: default-jar}]
[INFO] Building jar: <https://builds.apache.org/job/Tuscany-2x/ws/sca-2x/testing/itest/ws/endpoint-references/target/itest-ws-endpoint-references.jar>
[INFO] [install:install {execution: default-install}]
[INFO] Installing <https://builds.apache.org/job/Tuscany-2x/ws/sca-2x/testing/itest/ws/endpoint-references/target/itest-ws-endpoint-references.jar> to <https://builds.apache.org/job/Tuscany-2x/ws/.repository/org/apache/tuscany/sca/itest-ws-endpoint-references/2.5-SNAPSHOT/itest-ws-endpoint-references-2.5-SNAPSHOT.jar>
[JENKINS] Archiving disabled
[INFO] ------------------------------------------------------------------------
[INFO] Building Apache Tuscany SCA itest WS Holder Input/MultipleOutputs
[INFO] task-segment: [clean, install]
[INFO] ------------------------------------------------------------------------
[INFO] [clean:clean {execution: default-clean}]
[INFO] [enforcer:enforce {execution: enforce-plugin-versions}]
[INFO] [remote-resources:process {execution: default}]
[INFO] [resources:resources {execution: default-resources}]
[INFO] Using 'UTF-8' encoding to copy filtered resources.
[INFO] Copying 2 resources
[INFO] Copying 0 resource
[INFO] Copying 3 resources
[INFO] [compiler:compile {execution: default-compile}]
[INFO] Compiling 8 source files to <https://builds.apache.org/job/Tuscany-2x/ws/sca-2x/testing/itest/ws/holder-ws-service-multiple-outputs/target/classes>
[INFO] [resources:testResources {execution: default-testResources}]
[INFO] Using 'UTF-8' encoding to copy filtered resources.
[INFO] skip non existing resourceDirectory <https://builds.apache.org/job/Tuscany-2x/ws/sca-2x/testing/itest/ws/holder-ws-service-multiple-outputs/src/test/resources>
[INFO] Copying 3 resources
[INFO] [compiler:testCompile {execution: default-testCompile}]
[INFO] Compiling 2 source files to <https://builds.apache.org/job/Tuscany-2x/ws/sca-2x/testing/itest/ws/holder-ws-service-multiple-outputs/target/test-classes>
[INFO] [surefire:test {execution: default-test}]
[INFO] Surefire report directory: <https://builds.apache.org/job/Tuscany-2x/ws/sca-2x/testing/itest/ws/holder-ws-service-multiple-outputs/target/surefire-reports>
-------------------------------------------------------
T E S T S
-------------------------------------------------------
Running org.example.orderservice.OrderServiceTestCase
Jul 7, 2013 1:55:10 AM org.apache.tuscany.sca.node.impl.NodeImpl start
INFO: Starting node: http://tuscany.apache.org/sca/1.1/nodes/default0 domain: default
Jul 7, 2013 1:55:10 AM org.apache.tuscany.sca.node.impl.NodeFactoryImpl loadContributions
INFO: Loading contribution: <https://builds.apache.org/job/Tuscany-2x/ws/sca-2x/testing/itest/ws/holder-ws-service-multiple-outputs/target/classes/>
2013-07-07 01:55:12.631:INFO::Logging to STDERR via org.mortbay.log.StdErrLog
Jul 7, 2013 1:55:12 AM org.apache.tuscany.sca.core.assembly.impl.DomainRegistryImpl addEndpoint
INFO: Add endpoint - binding.sca - OrderServiceComponent/OrderService/sca
Jul 7, 2013 1:55:12 AM org.apache.tuscany.sca.http.jetty.JettyLogger info
INFO: jetty-6.1.26
Jul 7, 2013 1:55:12 AM org.apache.tuscany.sca.http.jetty.JettyLogger info
INFO: Started SelectChannelConnector@0.0.0.0:8080
Jul 7, 2013 1:55:12 AM org.apache.tuscany.sca.http.jetty.JettyServer addServletMapping
INFO: Added Servlet mapping: http://67.195.138.58:8080/OrderServiceComponent/OrderService
Jul 7, 2013 1:55:12 AM org.apache.tuscany.sca.core.assembly.impl.DomainRegistryImpl addEndpoint
INFO: Add endpoint - binding.ws - http://67.195.138.58:8080/OrderServiceComponent/OrderService
Jul 7, 2013 1:55:12 AM org.apache.tuscany.sca.core.assembly.impl.DomainRegistryImpl addEndpoint
INFO: Add endpoint - binding.sca - OrderServiceForwardComponent/OrderService
>>> Order submitted=Order[customerId=cust1234,orderId=0,total=50.0,status=Created]
>>> OrderService.reviewOrder return=Order[customerId=cust1234,orderId=0,total=50.0,status=Approved]
>>> Order returned=Order[customerId=cust1234,orderId=0,total=50.0,status=Approved]
>>> Order submitted=Order[customerId=cust1234,orderId=0,total=50.0,status=Created]
>>> OrderService.reviewOrder return=Order[customerId=cust1234,orderId=0,total=50.0,status=Approved]
>>> Order returned=Order[customerId=cust1234,orderId=0,total=50.0,status=Approved]
>>> Order submitted=Order[customerId=cust2345,orderId=0,total=50000.0,status=Created]
>>> OrderService.reviewOrder return=Order[customerId=cust2345,orderId=0,total=50000.0,status=Rejected]
>>> Order returned=Order[customerId=cust2345,orderId=0,total=50000.0,status=Rejected]
>>> return values: retval1 retval2
>>> Order submitted=Order[customerId=cust2345,orderId=0,total=50000.0,status=Created]
>>> OrderService.reviewOrder return=Order[customerId=cust2345,orderId=0,total=50000.0,status=Rejected]
>>> Order returned=Order[customerId=cust2345,orderId=0,total=50000.0,status=Rejected]
>>> return values: retval1 retval2
>>> Order submitted=Order[customerId=cust3456,orderId=0,total=600.0,status=Created]
>>> OrderService.reviewOrder return=Order[customerId=cust3456,orderId=0,total=600.0,status=Rejected]
>>> Order returned=Order[customerId=cust3456,orderId=0,total=600.0,status=Rejected]
>>> Order submitted=Order[customerId=cust3456,orderId=0,total=600.0,status=Created]
>>> OrderService.reviewOrder return=Order[customerId=cust3456,orderId=0,total=600.0,status=Approved]
>>> Order returned=Order[customerId=cust3456,orderId=0,total=600.0,status=Approved]
>>> Order submitted=Order[customerId=cust1234,orderId=0,total=50.0,status=Created]
>>> OrderService.reviewOrder return=Order[customerId=cust1234,orderId=0,total=50.0,status=Approved]
>>> Order returned=Order[customerId=cust1234,orderId=0,total=50.0,status=Approved]
>>> Order submitted=Order[customerId=cust1234,orderId=0,total=50.0,status=Created]
>>> OrderService.reviewOrder return=Order[customerId=cust1234,orderId=0,total=50.0,status=Approved]
>>> Order returned=Order[customerId=cust1234,orderId=0,total=50.0,status=Approved]
>>> Order submitted=Order[customerId=cust2345,orderId=0,total=50000.0,status=Created]
>>> OrderService.reviewOrder return=Order[customerId=cust2345,orderId=0,total=50000.0,status=Rejected]
>>> Order returned=Order[customerId=cust2345,orderId=0,total=50000.0,status=Rejected]
>>> return values: retval1 retval2
>>> Order submitted=Order[customerId=cust2345,orderId=0,total=50000.0,status=Created]
>>> OrderService.reviewOrder return=Order[customerId=cust2345,orderId=0,total=50000.0,status=Rejected]
>>> Order returned=Order[customerId=cust2345,orderId=0,total=50000.0,status=Rejected]
>>> return values: retval1 retval2
>>> Order submitted=Order[customerId=cust3456,orderId=0,total=600.0,status=Created]
>>> OrderService.reviewOrder return=Order[customerId=cust3456,orderId=0,total=600.0,status=Approved]
>>> Order returned=Order[customerId=cust3456,orderId=0,total=600.0,status=Approved]
>>> Order submitted=Order[customerId=cust3456,orderId=0,total=600.0,status=Created]
>>> OrderService.reviewOrder return=Order[customerId=cust3456,orderId=0,total=600.0,status=Rejected]
>>> Order returned=Order[customerId=cust3456,orderId=0,total=600.0,status=Rejected]
>>> Order submitted=Order[customerId=cust3456,orderId=0,total=600.0,status=Created]
>>> Order returned=Order[customerId=null,orderId=0,total=0.0,status=Rejected]
>>> Order submitted=Order[customerId=cust3456,orderId=0,total=600.0,status=Created]
>>> Order returned=Order[customerId=null,orderId=0,total=0.0,status=Rejected]
>>> Order submitted=Order[customerId=cust1234,orderId=0,total=50.0,status=Created]
>>> Order returned=Order[customerId=cust1234,orderId=0,total=50.0,status=Approved]
>>> Order submitted=Order[customerId=cust1234,orderId=0,total=50.0,status=Created]
>>> Order returned=Order[customerId=cust1234,orderId=0,total=50.0,status=Approved]
>>> Order submitted=Order[customerId=cust1234,orderId=0,total=50.0,status=Created]
>>> Order submitted=Order[customerId=cust1234,orderId=0,total=50.0,status=Created]
>>> Order submitted=Order[customerId=cust2345,orderId=0,total=50000.0,status=Created]
>>> Order submitted=Order[customerId=cust2345,orderId=0,total=50000.0,status=Created]
>>> Order submitted=Order[customerId=cust1234,orderId=0,total=50.0,status=Created]
>>> OrderService.reviewOrder return=Order[customerId=cust1234,orderId=0,total=50.0,status=Approved]
Jul 7, 2013 1:55:13 AM org.apache.tuscany.sca.node.impl.NodeImpl stop
INFO: Stopping node: http://tuscany.apache.org/sca/1.1/nodes/default0
Jul 7, 2013 1:55:13 AM org.apache.tuscany.sca.core.assembly.impl.DomainRegistryImpl removeEndpoint
INFO: Remove endpoint - binding.sca - OrderServiceComponent/OrderService/sca
Jul 7, 2013 1:55:13 AM org.apache.tuscany.sca.core.assembly.impl.DomainRegistryImpl removeEndpoint
INFO: Remove endpoint - binding.ws - http://67.195.138.58:8080/OrderServiceComponent/OrderService
Jul 7, 2013 1:55:13 AM org.apache.tuscany.sca.http.jetty.JettyServer removeServletMapping
INFO: Removed Servlet mapping: /OrderServiceComponent/OrderService
Jul 7, 2013 1:55:13 AM org.apache.tuscany.sca.http.jetty.JettyLogger info
INFO: Stopped SelectChannelConnector@0.0.0.0:8080
Jul 7, 2013 1:55:13 AM org.apache.tuscany.sca.core.assembly.impl.DomainRegistryImpl removeEndpoint
INFO: Remove endpoint - binding.sca - OrderServiceForwardComponent/OrderService
Tests run: 21, Failures: 0, Errors: 0, Skipped: 0, Time elapsed: 6.301 sec
Running org.example.orderservice.OrderServiceBareTestCase
Jul 7, 2013 1:55:13 AM org.apache.tuscany.sca.node.impl.NodeImpl start
INFO: Starting node: http://tuscany.apache.org/sca/1.1/nodes/default0 domain: default
Jul 7, 2013 1:55:13 AM org.apache.tuscany.sca.node.impl.NodeFactoryImpl loadContributions
INFO: Loading contribution: <https://builds.apache.org/job/Tuscany-2x/ws/sca-2x/testing/itest/ws/holder-ws-service-multiple-outputs/target/classes/>
Jul 7, 2013 1:55:13 AM org.apache.tuscany.sca.http.jetty.JettyLogger info
INFO: jetty-6.1.26
Jul 7, 2013 1:55:13 AM org.apache.tuscany.sca.http.jetty.JettyLogger info
INFO: Started SelectChannelConnector@0.0.0.0:8080
Jul 7, 2013 1:55:13 AM org.apache.tuscany.sca.http.jetty.JettyServer addServletMapping
INFO: Added Servlet mapping: http://67.195.138.58:8080/OrderServiceBareComponent/OrderServiceBare
Jul 7, 2013 1:55:13 AM org.apache.tuscany.sca.core.assembly.impl.DomainRegistryImpl addEndpoint
INFO: Add endpoint - binding.ws - http://67.195.138.58:8080/OrderServiceBareComponent/OrderServiceBare
Jul 7, 2013 1:55:13 AM org.apache.tuscany.sca.http.jetty.JettyServer addServletMapping
INFO: Added Servlet mapping: http://67.195.138.58:8080/OrderServiceBareForwardComponent/OrderServiceBare
Jul 7, 2013 1:55:13 AM org.apache.tuscany.sca.core.assembly.impl.DomainRegistryImpl addEndpoint
INFO: Add endpoint - binding.ws - http://67.195.138.58:8080/OrderServiceBareForwardComponent/OrderServiceBare
Jul 7, 2013 1:55:14 AM org.apache.tuscany.sca.node.impl.NodeImpl stop
INFO: Stopping node: http://tuscany.apache.org/sca/1.1/nodes/default0
Jul 7, 2013 1:55:14 AM org.apache.tuscany.sca.core.assembly.impl.DomainRegistryImpl removeEndpoint
INFO: Remove endpoint - binding.ws - http://67.195.138.58:8080/OrderServiceBareComponent/OrderServiceBare
Jul 7, 2013 1:55:14 AM org.apache.tuscany.sca.http.jetty.JettyServer removeServletMapping
INFO: Removed Servlet mapping: /OrderServiceBareComponent/OrderServiceBare
Jul 7, 2013 1:55:14 AM org.apache.tuscany.sca.core.assembly.impl.DomainRegistryImpl removeEndpoint
INFO: Remove endpoint - binding.ws - http://67.195.138.58:8080/OrderServiceBareForwardComponent/OrderServiceBare
Jul 7, 2013 1:55:14 AM org.apache.tuscany.sca.http.jetty.JettyServer removeServletMapping
INFO: Removed Servlet mapping: /OrderServiceBareForwardComponent/OrderServiceBare
Jul 7, 2013 1:55:14 AM org.apache.tuscany.sca.http.jetty.JettyLogger info
INFO: Stopped SelectChannelConnector@0.0.0.0:8080
Tests run: 10, Failures: 0, Errors: 0, Skipped: 0, Time elapsed: 0.566 sec
Results :
Tests run: 31, Failures: 0, Errors: 0, Skipped: 0
[JENKINS] Recording test results
[INFO] [jar:jar {execution: default-jar}]
[INFO] Building jar: <https://builds.apache.org/job/Tuscany-2x/ws/sca-2x/testing/itest/ws/holder-ws-service-multiple-outputs/target/itest-holder-ws-service-multiple-outputs.jar>
[INFO] [install:install {execution: default-install}]
[INFO] Installing <https://builds.apache.org/job/Tuscany-2x/ws/sca-2x/testing/itest/ws/holder-ws-service-multiple-outputs/target/itest-holder-ws-service-multiple-outputs.jar> to <https://builds.apache.org/job/Tuscany-2x/ws/.repository/org/apache/tuscany/sca/itest-holder-ws-service-multiple-outputs/2.5-SNAPSHOT/itest-holder-ws-service-multiple-outputs-2.5-SNAPSHOT.jar>
[JENKINS] Archiving disabled
[INFO] ------------------------------------------------------------------------
[INFO] Building Apache Tuscany SCA iTest WS with WSPolicy
[INFO] task-segment: [clean, install]
[INFO] ------------------------------------------------------------------------
[INFO] [clean:clean {execution: default-clean}]
[INFO] [enforcer:enforce {execution: enforce-plugin-versions}]
[INFO] [remote-resources:process {execution: default}]
[INFO] [resources:resources {execution: default-resources}]
[INFO] Using 'UTF-8' encoding to copy filtered resources.
[INFO] Copying 6 resources
[INFO] Copying 1 resource
[INFO] Copying 3 resources
[INFO] [compiler:compile {execution: default-compile}]
[INFO] Compiling 4 source files to <https://builds.apache.org/job/Tuscany-2x/ws/sca-2x/testing/itest/ws/wspolicy/target/classes>
[INFO] -------------------------------------------------------------
[ERROR] COMPILATION ERROR :
[INFO] -------------------------------------------------------------
[ERROR] <https://builds.apache.org/job/Tuscany-2x/ws/sca-2x/testing/itest/ws/wspolicy/src/main/java/org/apache/tuscany/sca/binding/ws/axis2/helloworld/ServerPWCBHandler.java>:[27,29] package org.apache.ws.security does not exist
[ERROR] <https://builds.apache.org/job/Tuscany-2x/ws/sca-2x/testing/itest/ws/wspolicy/src/main/java/org/apache/tuscany/sca/binding/ws/axis2/helloworld/ServerPWCBHandler.java>:[38,12] cannot find symbol
symbol : class WSPasswordCallback
location: class org.apache.tuscany.sca.binding.ws.axis2.helloworld.ServerPWCBHandler
[ERROR] <https://builds.apache.org/job/Tuscany-2x/ws/sca-2x/testing/itest/ws/wspolicy/src/main/java/org/apache/tuscany/sca/binding/ws/axis2/helloworld/ServerPWCBHandler.java>:[38,39] cannot find symbol
symbol : class WSPasswordCallback
location: class org.apache.tuscany.sca.binding.ws.axis2.helloworld.ServerPWCBHandler
[ERROR] <https://builds.apache.org/job/Tuscany-2x/ws/sca-2x/testing/itest/ws/wspolicy/src/main/java/org/apache/tuscany/sca/binding/ws/axis2/helloworld/ServerPWCBHandler.java>:[42,36] cannot find symbol
symbol : variable WSPasswordCallback
location: class org.apache.tuscany.sca.binding.ws.axis2.helloworld.ServerPWCBHandler
[ERROR] <https://builds.apache.org/job/Tuscany-2x/ws/sca-2x/testing/itest/ws/wspolicy/src/main/java/org/apache/tuscany/sca/binding/ws/axis2/helloworld/ServerPWCBHandler.java>:[49,43] cannot find symbol
symbol : variable WSPasswordCallback
location: class org.apache.tuscany.sca.binding.ws.axis2.helloworld.ServerPWCBHandler
[INFO] 5 errors
[INFO] -------------------------------------------------------------
[JENKINS] Archiving disabled
[INFO] ------------------------------------------------------------------------
[ERROR] BUILD FAILURE
[INFO] ------------------------------------------------------------------------
[INFO] Compilation failure
<https://builds.apache.org/job/Tuscany-2x/ws/sca-2x/testing/itest/ws/wspolicy/src/main/java/org/apache/tuscany/sca/binding/ws/axis2/helloworld/ServerPWCBHandler.java>:[27,29] package org.apache.ws.security does not exist
<https://builds.apache.org/job/Tuscany-2x/ws/sca-2x/testing/itest/ws/wspolicy/src/main/java/org/apache/tuscany/sca/binding/ws/axis2/helloworld/ServerPWCBHandler.java>:[38,12] cannot find symbol
symbol : class WSPasswordCallback
location: class org.apache.tuscany.sca.binding.ws.axis2.helloworld.ServerPWCBHandler
<https://builds.apache.org/job/Tuscany-2x/ws/sca-2x/testing/itest/ws/wspolicy/src/main/java/org/apache/tuscany/sca/binding/ws/axis2/helloworld/ServerPWCBHandler.java>:[38,39] cannot find symbol
symbol : class WSPasswordCallback
location: class org.apache.tuscany.sca.binding.ws.axis2.helloworld.ServerPWCBHandler
<https://builds.apache.org/job/Tuscany-2x/ws/sca-2x/testing/itest/ws/wspolicy/src/main/java/org/apache/tuscany/sca/binding/ws/axis2/helloworld/ServerPWCBHandler.java>:[42,36] cannot find symbol
symbol : variable WSPasswordCallback
location: class org.apache.tuscany.sca.binding.ws.axis2.helloworld.ServerPWCBHandler
<https://builds.apache.org/job/Tuscany-2x/ws/sca-2x/testing/itest/ws/wspolicy/src/main/java/org/apache/tuscany/sca/binding/ws/axis2/helloworld/ServerPWCBHandler.java>:[49,43] cannot find symbol
symbol : variable WSPasswordCallback
location: class org.apache.tuscany.sca.binding.ws.axis2.helloworld.ServerPWCBHandler
[INFO] ------------------------------------------------------------------------
[INFO] For more information, run Maven with the -e switch
[INFO] ------------------------------------------------------------------------
[INFO] Total time: 34 minutes 2 seconds
[INFO] Finished at: Sun Jul 07 01:55:18 UTC 2013
[INFO] Final Memory: 735M/910M
[INFO] ------------------------------------------------------------------------
Maven failed with error.
Sending e-mails to: notification@tuscany.apache.org
channel stopped
2013-07-07 01:59:22.578:INFO::Shutdown hook executing
2013-07-07 01:59:22.578:INFO::Shutdown hook complete
Build failed in Jenkins: Tuscany-2x #1075
Posted by Apache Jenkins Server <je...@builds.apache.org>.
See <https://builds.apache.org/job/Tuscany-2x/1075/>
------------------------------------------
[...truncated 57011 lines...]
INFO: Add endpoint - binding.sca - HelloWorldComponent/HelloWorld
Jul 14, 2013 2:16:22 AM org.apache.tuscany.sca.node.impl.NodeImpl stop
INFO: Stopping node: http://tuscany.apache.org/sca/1.1/nodes/default0
Jul 14, 2013 2:16:22 AM org.apache.tuscany.sca.core.assembly.impl.DomainRegistryImpl removeEndpoint
INFO: Remove endpoint - binding.ws - http://localhost:8085/myService
Jul 14, 2013 2:16:22 AM org.apache.tuscany.sca.http.jetty.JettyServer removeServletMapping
INFO: Removed Servlet mapping: /myService
Jul 14, 2013 2:16:22 AM org.apache.tuscany.sca.core.assembly.impl.DomainRegistryImpl removeEndpoint
INFO: Remove endpoint - binding.sca - HelloWorldComponent/HelloWorld
Tests run: 1, Failures: 0, Errors: 0, Skipped: 0, Time elapsed: 2.4 sec
Results :
Tests run: 1, Failures: 0, Errors: 0, Skipped: 0
[JENKINS] Recording test results
[INFO] [jar:jar {execution: default-jar}]
[INFO] Building jar: <https://builds.apache.org/job/Tuscany-2x/ws/sca-2x/testing/itest/ws/endpoint-references/target/itest-ws-endpoint-references.jar>
[INFO] [install:install {execution: default-install}]
[INFO] Installing <https://builds.apache.org/job/Tuscany-2x/ws/sca-2x/testing/itest/ws/endpoint-references/target/itest-ws-endpoint-references.jar> to <https://builds.apache.org/job/Tuscany-2x/ws/.repository/org/apache/tuscany/sca/itest-ws-endpoint-references/2.5-SNAPSHOT/itest-ws-endpoint-references-2.5-SNAPSHOT.jar>
[JENKINS] Archiving disabled
[INFO] ------------------------------------------------------------------------
[INFO] Building Apache Tuscany SCA itest WS Holder Input/MultipleOutputs
[INFO] task-segment: [clean, install]
[INFO] ------------------------------------------------------------------------
[INFO] [clean:clean {execution: default-clean}]
[INFO] [enforcer:enforce {execution: enforce-plugin-versions}]
[INFO] [remote-resources:process {execution: default}]
[INFO] [resources:resources {execution: default-resources}]
[INFO] Using 'UTF-8' encoding to copy filtered resources.
[INFO] Copying 2 resources
[INFO] Copying 0 resource
[INFO] Copying 3 resources
[INFO] [compiler:compile {execution: default-compile}]
[INFO] Compiling 8 source files to <https://builds.apache.org/job/Tuscany-2x/ws/sca-2x/testing/itest/ws/holder-ws-service-multiple-outputs/target/classes>
[INFO] [resources:testResources {execution: default-testResources}]
[INFO] Using 'UTF-8' encoding to copy filtered resources.
[INFO] skip non existing resourceDirectory <https://builds.apache.org/job/Tuscany-2x/ws/sca-2x/testing/itest/ws/holder-ws-service-multiple-outputs/src/test/resources>
[INFO] Copying 3 resources
[INFO] [compiler:testCompile {execution: default-testCompile}]
[INFO] Compiling 2 source files to <https://builds.apache.org/job/Tuscany-2x/ws/sca-2x/testing/itest/ws/holder-ws-service-multiple-outputs/target/test-classes>
[INFO] [surefire:test {execution: default-test}]
[INFO] Surefire report directory: <https://builds.apache.org/job/Tuscany-2x/ws/sca-2x/testing/itest/ws/holder-ws-service-multiple-outputs/target/surefire-reports>
-------------------------------------------------------
T E S T S
-------------------------------------------------------
Running org.example.orderservice.OrderServiceTestCase
Jul 14, 2013 2:16:27 AM org.apache.tuscany.sca.node.impl.NodeImpl start
INFO: Starting node: http://tuscany.apache.org/sca/1.1/nodes/default0 domain: default
Jul 14, 2013 2:16:27 AM org.apache.tuscany.sca.node.impl.NodeFactoryImpl loadContributions
INFO: Loading contribution: <https://builds.apache.org/job/Tuscany-2x/ws/sca-2x/testing/itest/ws/holder-ws-service-multiple-outputs/target/classes/>
2013-07-14 02:16:28.826:INFO::Logging to STDERR via org.mortbay.log.StdErrLog
Jul 14, 2013 2:16:28 AM org.apache.tuscany.sca.core.assembly.impl.DomainRegistryImpl addEndpoint
INFO: Add endpoint - binding.sca - OrderServiceComponent/OrderService/sca
Jul 14, 2013 2:16:28 AM org.apache.tuscany.sca.http.jetty.JettyLogger info
INFO: jetty-6.1.26
Jul 14, 2013 2:16:29 AM org.apache.tuscany.sca.http.jetty.JettyLogger info
INFO: Started SelectChannelConnector@0.0.0.0:8080
Jul 14, 2013 2:16:29 AM org.apache.tuscany.sca.http.jetty.JettyServer addServletMapping
INFO: Added Servlet mapping: http://67.195.138.58:8080/OrderServiceComponent/OrderService
Jul 14, 2013 2:16:29 AM org.apache.tuscany.sca.core.assembly.impl.DomainRegistryImpl addEndpoint
INFO: Add endpoint - binding.ws - http://67.195.138.58:8080/OrderServiceComponent/OrderService
Jul 14, 2013 2:16:29 AM org.apache.tuscany.sca.core.assembly.impl.DomainRegistryImpl addEndpoint
INFO: Add endpoint - binding.sca - OrderServiceForwardComponent/OrderService
>>> Order submitted=Order[customerId=cust1234,orderId=0,total=50.0,status=Created]
>>> OrderService.reviewOrder return=Order[customerId=cust1234,orderId=0,total=50.0,status=Approved]
>>> Order returned=Order[customerId=cust1234,orderId=0,total=50.0,status=Approved]
>>> Order submitted=Order[customerId=cust1234,orderId=0,total=50.0,status=Created]
>>> OrderService.reviewOrder return=Order[customerId=cust1234,orderId=0,total=50.0,status=Approved]
>>> Order returned=Order[customerId=cust1234,orderId=0,total=50.0,status=Approved]
>>> Order submitted=Order[customerId=cust2345,orderId=0,total=50000.0,status=Created]
>>> OrderService.reviewOrder return=Order[customerId=cust2345,orderId=0,total=50000.0,status=Rejected]
>>> Order returned=Order[customerId=cust2345,orderId=0,total=50000.0,status=Rejected]
>>> return values: retval1 retval2
>>> Order submitted=Order[customerId=cust2345,orderId=0,total=50000.0,status=Created]
>>> OrderService.reviewOrder return=Order[customerId=cust2345,orderId=0,total=50000.0,status=Rejected]
>>> Order returned=Order[customerId=cust2345,orderId=0,total=50000.0,status=Rejected]
>>> return values: retval1 retval2
>>> Order submitted=Order[customerId=cust3456,orderId=0,total=600.0,status=Created]
>>> OrderService.reviewOrder return=Order[customerId=cust3456,orderId=0,total=600.0,status=Rejected]
>>> Order returned=Order[customerId=cust3456,orderId=0,total=600.0,status=Rejected]
>>> Order submitted=Order[customerId=cust3456,orderId=0,total=600.0,status=Created]
>>> OrderService.reviewOrder return=Order[customerId=cust3456,orderId=0,total=600.0,status=Rejected]
>>> Order returned=Order[customerId=cust3456,orderId=0,total=600.0,status=Rejected]
>>> Order submitted=Order[customerId=cust1234,orderId=0,total=50.0,status=Created]
>>> OrderService.reviewOrder return=Order[customerId=cust1234,orderId=0,total=50.0,status=Approved]
>>> Order returned=Order[customerId=cust1234,orderId=0,total=50.0,status=Approved]
>>> Order submitted=Order[customerId=cust1234,orderId=0,total=50.0,status=Created]
>>> OrderService.reviewOrder return=Order[customerId=cust1234,orderId=0,total=50.0,status=Approved]
>>> Order returned=Order[customerId=cust1234,orderId=0,total=50.0,status=Approved]
>>> Order submitted=Order[customerId=cust2345,orderId=0,total=50000.0,status=Created]
>>> OrderService.reviewOrder return=Order[customerId=cust2345,orderId=0,total=50000.0,status=Rejected]
>>> Order returned=Order[customerId=cust2345,orderId=0,total=50000.0,status=Rejected]
>>> return values: retval1 retval2
>>> Order submitted=Order[customerId=cust2345,orderId=0,total=50000.0,status=Created]
>>> OrderService.reviewOrder return=Order[customerId=cust2345,orderId=0,total=50000.0,status=Rejected]
>>> Order returned=Order[customerId=cust2345,orderId=0,total=50000.0,status=Rejected]
>>> return values: retval1 retval2
>>> Order submitted=Order[customerId=cust3456,orderId=0,total=600.0,status=Created]
>>> OrderService.reviewOrder return=Order[customerId=cust3456,orderId=0,total=600.0,status=Approved]
>>> Order returned=Order[customerId=cust3456,orderId=0,total=600.0,status=Approved]
>>> Order submitted=Order[customerId=cust3456,orderId=0,total=600.0,status=Created]
>>> OrderService.reviewOrder return=Order[customerId=cust3456,orderId=0,total=600.0,status=Rejected]
>>> Order returned=Order[customerId=cust3456,orderId=0,total=600.0,status=Rejected]
>>> Order submitted=Order[customerId=cust3456,orderId=0,total=600.0,status=Created]
>>> Order returned=Order[customerId=null,orderId=0,total=0.0,status=Rejected]
>>> Order submitted=Order[customerId=cust3456,orderId=0,total=600.0,status=Created]
>>> Order returned=Order[customerId=null,orderId=0,total=0.0,status=Rejected]
>>> Order submitted=Order[customerId=cust1234,orderId=0,total=50.0,status=Created]
>>> Order returned=Order[customerId=cust1234,orderId=0,total=50.0,status=Approved]
>>> Order submitted=Order[customerId=cust1234,orderId=0,total=50.0,status=Created]
>>> Order returned=Order[customerId=cust1234,orderId=0,total=50.0,status=Approved]
>>> Order submitted=Order[customerId=cust1234,orderId=0,total=50.0,status=Created]
>>> Order submitted=Order[customerId=cust1234,orderId=0,total=50.0,status=Created]
>>> Order submitted=Order[customerId=cust2345,orderId=0,total=50000.0,status=Created]
>>> Order submitted=Order[customerId=cust2345,orderId=0,total=50000.0,status=Created]
>>> Order submitted=Order[customerId=cust1234,orderId=0,total=50.0,status=Created]
>>> OrderService.reviewOrder return=Order[customerId=cust1234,orderId=0,total=50.0,status=Approved]
Jul 14, 2013 2:16:29 AM org.apache.tuscany.sca.node.impl.NodeImpl stop
INFO: Stopping node: http://tuscany.apache.org/sca/1.1/nodes/default0
Jul 14, 2013 2:16:29 AM org.apache.tuscany.sca.core.assembly.impl.DomainRegistryImpl removeEndpoint
INFO: Remove endpoint - binding.sca - OrderServiceComponent/OrderService/sca
Jul 14, 2013 2:16:29 AM org.apache.tuscany.sca.core.assembly.impl.DomainRegistryImpl removeEndpoint
INFO: Remove endpoint - binding.ws - http://67.195.138.58:8080/OrderServiceComponent/OrderService
Jul 14, 2013 2:16:29 AM org.apache.tuscany.sca.http.jetty.JettyServer removeServletMapping
INFO: Removed Servlet mapping: /OrderServiceComponent/OrderService
Jul 14, 2013 2:16:29 AM org.apache.tuscany.sca.http.jetty.JettyLogger info
INFO: Stopped SelectChannelConnector@0.0.0.0:8080
Jul 14, 2013 2:16:29 AM org.apache.tuscany.sca.core.assembly.impl.DomainRegistryImpl removeEndpoint
INFO: Remove endpoint - binding.sca - OrderServiceForwardComponent/OrderService
Tests run: 21, Failures: 0, Errors: 0, Skipped: 0, Time elapsed: 2.795 sec
Running org.example.orderservice.OrderServiceBareTestCase
Jul 14, 2013 2:16:29 AM org.apache.tuscany.sca.node.impl.NodeImpl start
INFO: Starting node: http://tuscany.apache.org/sca/1.1/nodes/default0 domain: default
Jul 14, 2013 2:16:29 AM org.apache.tuscany.sca.node.impl.NodeFactoryImpl loadContributions
INFO: Loading contribution: <https://builds.apache.org/job/Tuscany-2x/ws/sca-2x/testing/itest/ws/holder-ws-service-multiple-outputs/target/classes/>
Jul 14, 2013 2:16:30 AM org.apache.tuscany.sca.http.jetty.JettyLogger info
INFO: jetty-6.1.26
Jul 14, 2013 2:16:30 AM org.apache.tuscany.sca.http.jetty.JettyLogger info
INFO: Started SelectChannelConnector@0.0.0.0:8080
Jul 14, 2013 2:16:30 AM org.apache.tuscany.sca.http.jetty.JettyServer addServletMapping
INFO: Added Servlet mapping: http://67.195.138.58:8080/OrderServiceBareComponent/OrderServiceBare
Jul 14, 2013 2:16:30 AM org.apache.tuscany.sca.core.assembly.impl.DomainRegistryImpl addEndpoint
INFO: Add endpoint - binding.ws - http://67.195.138.58:8080/OrderServiceBareComponent/OrderServiceBare
Jul 14, 2013 2:16:30 AM org.apache.tuscany.sca.http.jetty.JettyServer addServletMapping
INFO: Added Servlet mapping: http://67.195.138.58:8080/OrderServiceBareForwardComponent/OrderServiceBare
Jul 14, 2013 2:16:30 AM org.apache.tuscany.sca.core.assembly.impl.DomainRegistryImpl addEndpoint
INFO: Add endpoint - binding.ws - http://67.195.138.58:8080/OrderServiceBareForwardComponent/OrderServiceBare
Jul 14, 2013 2:16:30 AM org.apache.tuscany.sca.node.impl.NodeImpl stop
INFO: Stopping node: http://tuscany.apache.org/sca/1.1/nodes/default0
Jul 14, 2013 2:16:30 AM org.apache.tuscany.sca.core.assembly.impl.DomainRegistryImpl removeEndpoint
INFO: Remove endpoint - binding.ws - http://67.195.138.58:8080/OrderServiceBareComponent/OrderServiceBare
Jul 14, 2013 2:16:30 AM org.apache.tuscany.sca.http.jetty.JettyServer removeServletMapping
INFO: Removed Servlet mapping: /OrderServiceBareComponent/OrderServiceBare
Jul 14, 2013 2:16:30 AM org.apache.tuscany.sca.core.assembly.impl.DomainRegistryImpl removeEndpoint
INFO: Remove endpoint - binding.ws - http://67.195.138.58:8080/OrderServiceBareForwardComponent/OrderServiceBare
Jul 14, 2013 2:16:30 AM org.apache.tuscany.sca.http.jetty.JettyServer removeServletMapping
INFO: Removed Servlet mapping: /OrderServiceBareForwardComponent/OrderServiceBare
Jul 14, 2013 2:16:30 AM org.apache.tuscany.sca.http.jetty.JettyLogger info
INFO: Stopped SelectChannelConnector@0.0.0.0:8080
Tests run: 10, Failures: 0, Errors: 0, Skipped: 0, Time elapsed: 0.525 sec
Results :
Tests run: 31, Failures: 0, Errors: 0, Skipped: 0
[JENKINS] Recording test results
[INFO] [jar:jar {execution: default-jar}]
[INFO] Building jar: <https://builds.apache.org/job/Tuscany-2x/ws/sca-2x/testing/itest/ws/holder-ws-service-multiple-outputs/target/itest-holder-ws-service-multiple-outputs.jar>
[INFO] [install:install {execution: default-install}]
[INFO] Installing <https://builds.apache.org/job/Tuscany-2x/ws/sca-2x/testing/itest/ws/holder-ws-service-multiple-outputs/target/itest-holder-ws-service-multiple-outputs.jar> to <https://builds.apache.org/job/Tuscany-2x/ws/.repository/org/apache/tuscany/sca/itest-holder-ws-service-multiple-outputs/2.5-SNAPSHOT/itest-holder-ws-service-multiple-outputs-2.5-SNAPSHOT.jar>
[JENKINS] Archiving disabled
[INFO] ------------------------------------------------------------------------
[INFO] Building Apache Tuscany SCA iTest WS with WSPolicy
[INFO] task-segment: [clean, install]
[INFO] ------------------------------------------------------------------------
[INFO] [clean:clean {execution: default-clean}]
[INFO] [enforcer:enforce {execution: enforce-plugin-versions}]
[INFO] [remote-resources:process {execution: default}]
[INFO] [resources:resources {execution: default-resources}]
[INFO] Using 'UTF-8' encoding to copy filtered resources.
[INFO] Copying 6 resources
[INFO] Copying 1 resource
[INFO] Copying 3 resources
[INFO] [compiler:compile {execution: default-compile}]
[INFO] Compiling 4 source files to <https://builds.apache.org/job/Tuscany-2x/ws/sca-2x/testing/itest/ws/wspolicy/target/classes>
[INFO] -------------------------------------------------------------
[ERROR] COMPILATION ERROR :
[INFO] -------------------------------------------------------------
[ERROR] <https://builds.apache.org/job/Tuscany-2x/ws/sca-2x/testing/itest/ws/wspolicy/src/main/java/org/apache/tuscany/sca/binding/ws/axis2/helloworld/ServerPWCBHandler.java>:[27,29] package org.apache.ws.security does not exist
[ERROR] <https://builds.apache.org/job/Tuscany-2x/ws/sca-2x/testing/itest/ws/wspolicy/src/main/java/org/apache/tuscany/sca/binding/ws/axis2/helloworld/ServerPWCBHandler.java>:[38,12] cannot find symbol
symbol : class WSPasswordCallback
location: class org.apache.tuscany.sca.binding.ws.axis2.helloworld.ServerPWCBHandler
[ERROR] <https://builds.apache.org/job/Tuscany-2x/ws/sca-2x/testing/itest/ws/wspolicy/src/main/java/org/apache/tuscany/sca/binding/ws/axis2/helloworld/ServerPWCBHandler.java>:[38,39] cannot find symbol
symbol : class WSPasswordCallback
location: class org.apache.tuscany.sca.binding.ws.axis2.helloworld.ServerPWCBHandler
[ERROR] <https://builds.apache.org/job/Tuscany-2x/ws/sca-2x/testing/itest/ws/wspolicy/src/main/java/org/apache/tuscany/sca/binding/ws/axis2/helloworld/ServerPWCBHandler.java>:[42,36] cannot find symbol
symbol : variable WSPasswordCallback
location: class org.apache.tuscany.sca.binding.ws.axis2.helloworld.ServerPWCBHandler
[ERROR] <https://builds.apache.org/job/Tuscany-2x/ws/sca-2x/testing/itest/ws/wspolicy/src/main/java/org/apache/tuscany/sca/binding/ws/axis2/helloworld/ServerPWCBHandler.java>:[49,43] cannot find symbol
symbol : variable WSPasswordCallback
location: class org.apache.tuscany.sca.binding.ws.axis2.helloworld.ServerPWCBHandler
[INFO] 5 errors
[INFO] -------------------------------------------------------------
[JENKINS] Archiving disabled
[INFO] ------------------------------------------------------------------------
[ERROR] BUILD FAILURE
[INFO] ------------------------------------------------------------------------
[INFO] Compilation failure
<https://builds.apache.org/job/Tuscany-2x/ws/sca-2x/testing/itest/ws/wspolicy/src/main/java/org/apache/tuscany/sca/binding/ws/axis2/helloworld/ServerPWCBHandler.java>:[27,29] package org.apache.ws.security does not exist
<https://builds.apache.org/job/Tuscany-2x/ws/sca-2x/testing/itest/ws/wspolicy/src/main/java/org/apache/tuscany/sca/binding/ws/axis2/helloworld/ServerPWCBHandler.java>:[38,12] cannot find symbol
symbol : class WSPasswordCallback
location: class org.apache.tuscany.sca.binding.ws.axis2.helloworld.ServerPWCBHandler
<https://builds.apache.org/job/Tuscany-2x/ws/sca-2x/testing/itest/ws/wspolicy/src/main/java/org/apache/tuscany/sca/binding/ws/axis2/helloworld/ServerPWCBHandler.java>:[38,39] cannot find symbol
symbol : class WSPasswordCallback
location: class org.apache.tuscany.sca.binding.ws.axis2.helloworld.ServerPWCBHandler
<https://builds.apache.org/job/Tuscany-2x/ws/sca-2x/testing/itest/ws/wspolicy/src/main/java/org/apache/tuscany/sca/binding/ws/axis2/helloworld/ServerPWCBHandler.java>:[42,36] cannot find symbol
symbol : variable WSPasswordCallback
location: class org.apache.tuscany.sca.binding.ws.axis2.helloworld.ServerPWCBHandler
<https://builds.apache.org/job/Tuscany-2x/ws/sca-2x/testing/itest/ws/wspolicy/src/main/java/org/apache/tuscany/sca/binding/ws/axis2/helloworld/ServerPWCBHandler.java>:[49,43] cannot find symbol
symbol : variable WSPasswordCallback
location: class org.apache.tuscany.sca.binding.ws.axis2.helloworld.ServerPWCBHandler
[INFO] ------------------------------------------------------------------------
[INFO] For more information, run Maven with the -e switch
[INFO] ------------------------------------------------------------------------
[INFO] Total time: 40 minutes 46 seconds
[INFO] Finished at: Sun Jul 14 02:16:33 UTC 2013
[INFO] Final Memory: 730M/910M
[INFO] ------------------------------------------------------------------------
Maven failed with error.
Sending e-mails to: notification@tuscany.apache.org
Sending e-mails to: notification@tuscany.apache.org
Sending e-mails to: notification@tuscany.apache.org
channel stopped
2013-07-14 02:20:56.722:INFO::Shutdown hook executing
2013-07-14 02:20:56.723:INFO::Shutdown hook complete
Build failed in Jenkins: Tuscany-2x #1074
Posted by Apache Jenkins Server <je...@builds.apache.org>.
See <https://builds.apache.org/job/Tuscany-2x/1074/>
------------------------------------------
[...truncated 55530 lines...]
[INFO] Installing <https://builds.apache.org/job/Tuscany-2x/ws/sca-2x/testing/itest/ws/endpoint-references/target/itest-ws-endpoint-references.jar> to <https://builds.apache.org/job/Tuscany-2x/ws/.repository/org/apache/tuscany/sca/itest-ws-endpoint-references/2.5-SNAPSHOT/itest-ws-endpoint-references-2.5-SNAPSHOT.jar>
[JENKINS] Archiving disabled
[INFO] ------------------------------------------------------------------------
[INFO] Building Apache Tuscany SCA itest WS Holder Input/MultipleOutputs
[INFO] task-segment: [clean, install]
[INFO] ------------------------------------------------------------------------
[INFO] [clean:clean {execution: default-clean}]
[INFO] [enforcer:enforce {execution: enforce-plugin-versions}]
[INFO] [remote-resources:process {execution: default}]
[INFO] [resources:resources {execution: default-resources}]
[INFO] Using 'UTF-8' encoding to copy filtered resources.
[INFO] Copying 2 resources
[INFO] Copying 0 resource
[INFO] Copying 3 resources
[INFO] [compiler:compile {execution: default-compile}]
[INFO] Compiling 8 source files to <https://builds.apache.org/job/Tuscany-2x/ws/sca-2x/testing/itest/ws/holder-ws-service-multiple-outputs/target/classes>
[INFO] [resources:testResources {execution: default-testResources}]
[INFO] Using 'UTF-8' encoding to copy filtered resources.
[INFO] skip non existing resourceDirectory <https://builds.apache.org/job/Tuscany-2x/ws/sca-2x/testing/itest/ws/holder-ws-service-multiple-outputs/src/test/resources>
[INFO] Copying 3 resources
[INFO] [compiler:testCompile {execution: default-testCompile}]
[INFO] Compiling 2 source files to <https://builds.apache.org/job/Tuscany-2x/ws/sca-2x/testing/itest/ws/holder-ws-service-multiple-outputs/target/test-classes>
[INFO] [surefire:test {execution: default-test}]
[INFO] Surefire report directory: <https://builds.apache.org/job/Tuscany-2x/ws/sca-2x/testing/itest/ws/holder-ws-service-multiple-outputs/target/surefire-reports>
-------------------------------------------------------
T E S T S
-------------------------------------------------------
Running org.example.orderservice.OrderServiceTestCase
Jul 11, 2013 2:15:17 AM org.apache.tuscany.sca.node.impl.NodeImpl start
INFO: Starting node: http://tuscany.apache.org/sca/1.1/nodes/default0 domain: default
Jul 11, 2013 2:15:17 AM org.apache.tuscany.sca.node.impl.NodeFactoryImpl loadContributions
INFO: Loading contribution: <https://builds.apache.org/job/Tuscany-2x/ws/sca-2x/testing/itest/ws/holder-ws-service-multiple-outputs/target/classes/>
2013-07-11 02:15:18.897:INFO::Logging to STDERR via org.mortbay.log.StdErrLog
Jul 11, 2013 2:15:18 AM org.apache.tuscany.sca.core.assembly.impl.DomainRegistryImpl addEndpoint
INFO: Add endpoint - binding.sca - OrderServiceComponent/OrderService/sca
Jul 11, 2013 2:15:19 AM org.apache.tuscany.sca.http.jetty.JettyLogger info
INFO: jetty-6.1.26
Jul 11, 2013 2:15:19 AM org.apache.tuscany.sca.http.jetty.JettyLogger info
INFO: Started SelectChannelConnector@0.0.0.0:8080
Jul 11, 2013 2:15:19 AM org.apache.tuscany.sca.http.jetty.JettyServer addServletMapping
INFO: Added Servlet mapping: http://67.195.138.58:8080/OrderServiceComponent/OrderService
Jul 11, 2013 2:15:19 AM org.apache.tuscany.sca.core.assembly.impl.DomainRegistryImpl addEndpoint
INFO: Add endpoint - binding.ws - http://67.195.138.58:8080/OrderServiceComponent/OrderService
Jul 11, 2013 2:15:19 AM org.apache.tuscany.sca.core.assembly.impl.DomainRegistryImpl addEndpoint
INFO: Add endpoint - binding.sca - OrderServiceForwardComponent/OrderService
>>> Order submitted=Order[customerId=cust1234,orderId=0,total=50.0,status=Created]
>>> OrderService.reviewOrder return=Order[customerId=cust1234,orderId=0,total=50.0,status=Approved]
>>> Order returned=Order[customerId=cust1234,orderId=0,total=50.0,status=Approved]
>>> Order submitted=Order[customerId=cust1234,orderId=0,total=50.0,status=Created]
>>> OrderService.reviewOrder return=Order[customerId=cust1234,orderId=0,total=50.0,status=Approved]
>>> Order returned=Order[customerId=cust1234,orderId=0,total=50.0,status=Approved]
>>> Order submitted=Order[customerId=cust2345,orderId=0,total=50000.0,status=Created]
>>> OrderService.reviewOrder return=Order[customerId=cust2345,orderId=0,total=50000.0,status=Rejected]
>>> Order returned=Order[customerId=cust2345,orderId=0,total=50000.0,status=Rejected]
>>> return values: retval1 retval2
>>> Order submitted=Order[customerId=cust2345,orderId=0,total=50000.0,status=Created]
>>> OrderService.reviewOrder return=Order[customerId=cust2345,orderId=0,total=50000.0,status=Rejected]
>>> Order returned=Order[customerId=cust2345,orderId=0,total=50000.0,status=Rejected]
>>> return values: retval1 retval2
>>> Order submitted=Order[customerId=cust3456,orderId=0,total=600.0,status=Created]
>>> OrderService.reviewOrder return=Order[customerId=cust3456,orderId=0,total=600.0,status=Approved]
>>> Order returned=Order[customerId=cust3456,orderId=0,total=600.0,status=Approved]
>>> Order submitted=Order[customerId=cust3456,orderId=0,total=600.0,status=Created]
>>> OrderService.reviewOrder return=Order[customerId=cust3456,orderId=0,total=600.0,status=Approved]
>>> Order returned=Order[customerId=cust3456,orderId=0,total=600.0,status=Approved]
>>> Order submitted=Order[customerId=cust1234,orderId=0,total=50.0,status=Created]
>>> OrderService.reviewOrder return=Order[customerId=cust1234,orderId=0,total=50.0,status=Approved]
>>> Order returned=Order[customerId=cust1234,orderId=0,total=50.0,status=Approved]
>>> Order submitted=Order[customerId=cust1234,orderId=0,total=50.0,status=Created]
>>> OrderService.reviewOrder return=Order[customerId=cust1234,orderId=0,total=50.0,status=Approved]
>>> Order returned=Order[customerId=cust1234,orderId=0,total=50.0,status=Approved]
>>> Order submitted=Order[customerId=cust2345,orderId=0,total=50000.0,status=Created]
>>> OrderService.reviewOrder return=Order[customerId=cust2345,orderId=0,total=50000.0,status=Rejected]
>>> Order returned=Order[customerId=cust2345,orderId=0,total=50000.0,status=Rejected]
>>> return values: retval1 retval2
>>> Order submitted=Order[customerId=cust2345,orderId=0,total=50000.0,status=Created]
>>> OrderService.reviewOrder return=Order[customerId=cust2345,orderId=0,total=50000.0,status=Rejected]
>>> Order returned=Order[customerId=cust2345,orderId=0,total=50000.0,status=Rejected]
>>> return values: retval1 retval2
>>> Order submitted=Order[customerId=cust3456,orderId=0,total=600.0,status=Created]
>>> OrderService.reviewOrder return=Order[customerId=cust3456,orderId=0,total=600.0,status=Rejected]
>>> Order returned=Order[customerId=cust3456,orderId=0,total=600.0,status=Rejected]
>>> Order submitted=Order[customerId=cust3456,orderId=0,total=600.0,status=Created]
>>> OrderService.reviewOrder return=Order[customerId=cust3456,orderId=0,total=600.0,status=Approved]
>>> Order returned=Order[customerId=cust3456,orderId=0,total=600.0,status=Approved]
>>> Order submitted=Order[customerId=cust3456,orderId=0,total=600.0,status=Created]
>>> Order returned=Order[customerId=null,orderId=0,total=0.0,status=Rejected]
>>> Order submitted=Order[customerId=cust3456,orderId=0,total=600.0,status=Created]
>>> Order returned=Order[customerId=null,orderId=0,total=0.0,status=Rejected]
>>> Order submitted=Order[customerId=cust1234,orderId=0,total=50.0,status=Created]
>>> Order returned=Order[customerId=cust1234,orderId=0,total=50.0,status=Approved]
>>> Order submitted=Order[customerId=cust1234,orderId=0,total=50.0,status=Created]
>>> Order returned=Order[customerId=cust1234,orderId=0,total=50.0,status=Approved]
>>> Order submitted=Order[customerId=cust1234,orderId=0,total=50.0,status=Created]
>>> Order submitted=Order[customerId=cust1234,orderId=0,total=50.0,status=Created]
>>> Order submitted=Order[customerId=cust2345,orderId=0,total=50000.0,status=Created]
>>> Order submitted=Order[customerId=cust2345,orderId=0,total=50000.0,status=Created]
>>> Order submitted=Order[customerId=cust1234,orderId=0,total=50.0,status=Created]
>>> OrderService.reviewOrder return=Order[customerId=cust1234,orderId=0,total=50.0,status=Approved]
Jul 11, 2013 2:15:19 AM org.apache.tuscany.sca.node.impl.NodeImpl stop
INFO: Stopping node: http://tuscany.apache.org/sca/1.1/nodes/default0
Jul 11, 2013 2:15:19 AM org.apache.tuscany.sca.core.assembly.impl.DomainRegistryImpl removeEndpoint
INFO: Remove endpoint - binding.sca - OrderServiceComponent/OrderService/sca
Jul 11, 2013 2:15:19 AM org.apache.tuscany.sca.core.assembly.impl.DomainRegistryImpl removeEndpoint
INFO: Remove endpoint - binding.ws - http://67.195.138.58:8080/OrderServiceComponent/OrderService
Jul 11, 2013 2:15:19 AM org.apache.tuscany.sca.http.jetty.JettyServer removeServletMapping
INFO: Removed Servlet mapping: /OrderServiceComponent/OrderService
Jul 11, 2013 2:15:19 AM org.apache.tuscany.sca.http.jetty.JettyLogger info
INFO: Stopped SelectChannelConnector@0.0.0.0:8080
Jul 11, 2013 2:15:19 AM org.apache.tuscany.sca.core.assembly.impl.DomainRegistryImpl removeEndpoint
INFO: Remove endpoint - binding.sca - OrderServiceForwardComponent/OrderService
Tests run: 21, Failures: 0, Errors: 0, Skipped: 0, Time elapsed: 2.882 sec
Running org.example.orderservice.OrderServiceBareTestCase
Jul 11, 2013 2:15:19 AM org.apache.tuscany.sca.node.impl.NodeImpl start
INFO: Starting node: http://tuscany.apache.org/sca/1.1/nodes/default0 domain: default
Jul 11, 2013 2:15:19 AM org.apache.tuscany.sca.node.impl.NodeFactoryImpl loadContributions
INFO: Loading contribution: <https://builds.apache.org/job/Tuscany-2x/ws/sca-2x/testing/itest/ws/holder-ws-service-multiple-outputs/target/classes/>
Jul 11, 2013 2:15:20 AM org.apache.tuscany.sca.http.jetty.JettyLogger info
INFO: jetty-6.1.26
Jul 11, 2013 2:15:20 AM org.apache.tuscany.sca.http.jetty.JettyLogger info
INFO: Started SelectChannelConnector@0.0.0.0:8080
Jul 11, 2013 2:15:20 AM org.apache.tuscany.sca.http.jetty.JettyServer addServletMapping
INFO: Added Servlet mapping: http://67.195.138.58:8080/OrderServiceBareComponent/OrderServiceBare
Jul 11, 2013 2:15:20 AM org.apache.tuscany.sca.core.assembly.impl.DomainRegistryImpl addEndpoint
INFO: Add endpoint - binding.ws - http://67.195.138.58:8080/OrderServiceBareComponent/OrderServiceBare
Jul 11, 2013 2:15:20 AM org.apache.tuscany.sca.http.jetty.JettyServer addServletMapping
INFO: Added Servlet mapping: http://67.195.138.58:8080/OrderServiceBareForwardComponent/OrderServiceBare
Jul 11, 2013 2:15:20 AM org.apache.tuscany.sca.core.assembly.impl.DomainRegistryImpl addEndpoint
INFO: Add endpoint - binding.ws - http://67.195.138.58:8080/OrderServiceBareForwardComponent/OrderServiceBare
Jul 11, 2013 2:15:20 AM org.apache.tuscany.sca.node.impl.NodeImpl stop
INFO: Stopping node: http://tuscany.apache.org/sca/1.1/nodes/default0
Jul 11, 2013 2:15:20 AM org.apache.tuscany.sca.core.assembly.impl.DomainRegistryImpl removeEndpoint
INFO: Remove endpoint - binding.ws - http://67.195.138.58:8080/OrderServiceBareComponent/OrderServiceBare
Jul 11, 2013 2:15:20 AM org.apache.tuscany.sca.http.jetty.JettyServer removeServletMapping
INFO: Removed Servlet mapping: /OrderServiceBareComponent/OrderServiceBare
Jul 11, 2013 2:15:20 AM org.apache.tuscany.sca.core.assembly.impl.DomainRegistryImpl removeEndpoint
INFO: Remove endpoint - binding.ws - http://67.195.138.58:8080/OrderServiceBareForwardComponent/OrderServiceBare
Jul 11, 2013 2:15:20 AM org.apache.tuscany.sca.http.jetty.JettyServer removeServletMapping
INFO: Removed Servlet mapping: /OrderServiceBareForwardComponent/OrderServiceBare
Jul 11, 2013 2:15:20 AM org.apache.tuscany.sca.http.jetty.JettyLogger info
INFO: Stopped SelectChannelConnector@0.0.0.0:8080
Tests run: 10, Failures: 0, Errors: 0, Skipped: 0, Time elapsed: 0.545 sec
Results :
Tests run: 31, Failures: 0, Errors: 0, Skipped: 0
[JENKINS] Recording test results
[INFO] [jar:jar {execution: default-jar}]
[INFO] Building jar: <https://builds.apache.org/job/Tuscany-2x/ws/sca-2x/testing/itest/ws/holder-ws-service-multiple-outputs/target/itest-holder-ws-service-multiple-outputs.jar>
[INFO] [install:install {execution: default-install}]
[INFO] Installing <https://builds.apache.org/job/Tuscany-2x/ws/sca-2x/testing/itest/ws/holder-ws-service-multiple-outputs/target/itest-holder-ws-service-multiple-outputs.jar> to <https://builds.apache.org/job/Tuscany-2x/ws/.repository/org/apache/tuscany/sca/itest-holder-ws-service-multiple-outputs/2.5-SNAPSHOT/itest-holder-ws-service-multiple-outputs-2.5-SNAPSHOT.jar>
[JENKINS] Archiving disabled
[INFO] ------------------------------------------------------------------------
[INFO] Building Apache Tuscany SCA iTest WS with WSPolicy
[INFO] task-segment: [clean, install]
[INFO] ------------------------------------------------------------------------
[INFO] [clean:clean {execution: default-clean}]
[INFO] [enforcer:enforce {execution: enforce-plugin-versions}]
[INFO] [remote-resources:process {execution: default}]
[INFO] [resources:resources {execution: default-resources}]
[INFO] Using 'UTF-8' encoding to copy filtered resources.
[INFO] Copying 6 resources
[INFO] Copying 1 resource
[INFO] Copying 3 resources
[INFO] [compiler:compile {execution: default-compile}]
[INFO] Compiling 4 source files to <https://builds.apache.org/job/Tuscany-2x/ws/sca-2x/testing/itest/ws/wspolicy/target/classes>
[INFO] -------------------------------------------------------------
[ERROR] COMPILATION ERROR :
[INFO] -------------------------------------------------------------
[ERROR] <https://builds.apache.org/job/Tuscany-2x/ws/sca-2x/testing/itest/ws/wspolicy/src/main/java/org/apache/tuscany/sca/binding/ws/axis2/helloworld/ServerPWCBHandler.java>:[27,29] package org.apache.ws.security does not exist
[ERROR] <https://builds.apache.org/job/Tuscany-2x/ws/sca-2x/testing/itest/ws/wspolicy/src/main/java/org/apache/tuscany/sca/binding/ws/axis2/helloworld/ServerPWCBHandler.java>:[38,12] cannot find symbol
symbol : class WSPasswordCallback
location: class org.apache.tuscany.sca.binding.ws.axis2.helloworld.ServerPWCBHandler
[ERROR] <https://builds.apache.org/job/Tuscany-2x/ws/sca-2x/testing/itest/ws/wspolicy/src/main/java/org/apache/tuscany/sca/binding/ws/axis2/helloworld/ServerPWCBHandler.java>:[38,39] cannot find symbol
symbol : class WSPasswordCallback
location: class org.apache.tuscany.sca.binding.ws.axis2.helloworld.ServerPWCBHandler
[ERROR] <https://builds.apache.org/job/Tuscany-2x/ws/sca-2x/testing/itest/ws/wspolicy/src/main/java/org/apache/tuscany/sca/binding/ws/axis2/helloworld/ServerPWCBHandler.java>:[42,36] cannot find symbol
symbol : variable WSPasswordCallback
location: class org.apache.tuscany.sca.binding.ws.axis2.helloworld.ServerPWCBHandler
[ERROR] <https://builds.apache.org/job/Tuscany-2x/ws/sca-2x/testing/itest/ws/wspolicy/src/main/java/org/apache/tuscany/sca/binding/ws/axis2/helloworld/ServerPWCBHandler.java>:[49,43] cannot find symbol
symbol : variable WSPasswordCallback
location: class org.apache.tuscany.sca.binding.ws.axis2.helloworld.ServerPWCBHandler
[INFO] 5 errors
[INFO] -------------------------------------------------------------
[JENKINS] Archiving disabled
[INFO] ------------------------------------------------------------------------
[ERROR] BUILD FAILURE
[INFO] ------------------------------------------------------------------------
[INFO] Compilation failure
<https://builds.apache.org/job/Tuscany-2x/ws/sca-2x/testing/itest/ws/wspolicy/src/main/java/org/apache/tuscany/sca/binding/ws/axis2/helloworld/ServerPWCBHandler.java>:[27,29] package org.apache.ws.security does not exist
<https://builds.apache.org/job/Tuscany-2x/ws/sca-2x/testing/itest/ws/wspolicy/src/main/java/org/apache/tuscany/sca/binding/ws/axis2/helloworld/ServerPWCBHandler.java>:[38,12] cannot find symbol
symbol : class WSPasswordCallback
location: class org.apache.tuscany.sca.binding.ws.axis2.helloworld.ServerPWCBHandler
<https://builds.apache.org/job/Tuscany-2x/ws/sca-2x/testing/itest/ws/wspolicy/src/main/java/org/apache/tuscany/sca/binding/ws/axis2/helloworld/ServerPWCBHandler.java>:[38,39] cannot find symbol
symbol : class WSPasswordCallback
location: class org.apache.tuscany.sca.binding.ws.axis2.helloworld.ServerPWCBHandler
<https://builds.apache.org/job/Tuscany-2x/ws/sca-2x/testing/itest/ws/wspolicy/src/main/java/org/apache/tuscany/sca/binding/ws/axis2/helloworld/ServerPWCBHandler.java>:[42,36] cannot find symbol
symbol : variable WSPasswordCallback
location: class org.apache.tuscany.sca.binding.ws.axis2.helloworld.ServerPWCBHandler
<https://builds.apache.org/job/Tuscany-2x/ws/sca-2x/testing/itest/ws/wspolicy/src/main/java/org/apache/tuscany/sca/binding/ws/axis2/helloworld/ServerPWCBHandler.java>:[49,43] cannot find symbol
symbol : variable WSPasswordCallback
location: class org.apache.tuscany.sca.binding.ws.axis2.helloworld.ServerPWCBHandler
[INFO] ------------------------------------------------------------------------
[INFO] For more information, run Maven with the -e switch
[INFO] ------------------------------------------------------------------------
[INFO] Total time: 40 minutes 25 seconds
[INFO] Finished at: Thu Jul 11 02:15:23 UTC 2013
[INFO] Final Memory: 732M/910M
[INFO] ------------------------------------------------------------------------
Maven failed with error.
Sending e-mails to: notification@tuscany.apache.org
Sending e-mails to: notification@tuscany.apache.org
Sending e-mails to: notification@tuscany.apache.org
Sending e-mails to: notification@tuscany.apache.org
Sending e-mails to: notification@tuscany.apache.org
Sending e-mails to: notification@tuscany.apache.org
Sending e-mails to: notification@tuscany.apache.org
Sending e-mails to: notification@tuscany.apache.org
Sending e-mails to: notification@tuscany.apache.org
Sending e-mails to: notification@tuscany.apache.org
Sending e-mails to: notification@tuscany.apache.org
Sending e-mails to: notification@tuscany.apache.org
Sending e-mails to: notification@tuscany.apache.org
Sending e-mails to: notification@tuscany.apache.org
Sending e-mails to: notification@tuscany.apache.org
Sending e-mails to: notification@tuscany.apache.org
Sending e-mails to: notification@tuscany.apache.org
Sending e-mails to: notification@tuscany.apache.org
Sending e-mails to: notification@tuscany.apache.org
Sending e-mails to: notification@tuscany.apache.org
Sending e-mails to: notification@tuscany.apache.org
Sending e-mails to: notification@tuscany.apache.org
channel stopped
2013-07-11 02:19:47.294:INFO::Shutdown hook executing
2013-07-11 02:19:47.294:INFO::Shutdown hook complete
Build failed in Jenkins: Tuscany-2x #1073
Posted by Apache Jenkins Server <je...@builds.apache.org>.
See <https://builds.apache.org/job/Tuscany-2x/1073/>
------------------------------------------
[...truncated 52440 lines...]
at org.mortbay.component.AbstractLifeCycle.start(AbstractLifeCycle.java:50)
at org.apache.tuscany.sca.http.jetty.JettyServer.addServletMapping(JettyServer.java:297)
... 30 more
Tests run: 21, Failures: 0, Errors: 21, Skipped: 0, Time elapsed: 2.123 sec <<< FAILURE!
Running org.example.orderservice.OrderServiceBareTestCase
Jul 10, 2013 2:53:14 AM org.apache.tuscany.sca.node.impl.NodeImpl start
INFO: Starting node: http://tuscany.apache.org/sca/1.1/nodes/default1 domain: default
Jul 10, 2013 2:53:14 AM org.apache.tuscany.sca.node.impl.NodeFactoryImpl loadContributions
INFO: Loading contribution: <https://builds.apache.org/job/Tuscany-2x/ws/sca-2x/testing/itest/ws/holder-ws-service-multiple-outputs/target/classes/>
Jul 10, 2013 2:53:15 AM org.apache.tuscany.sca.http.jetty.JettyLogger info
INFO: jetty-6.1.26
Jul 10, 2013 2:53:15 AM org.apache.tuscany.sca.http.jetty.JettyLogger warn
WARNING: failed SelectChannelConnector@0.0.0.0:8080: java.net.BindException: Address already in use
Jul 10, 2013 2:53:15 AM org.apache.tuscany.sca.http.jetty.JettyLogger warn
WARNING: failed Server@8c4b5f: java.net.BindException: Address already in use
Jul 10, 2013 2:53:15 AM org.apache.tuscany.sca.core.assembly.impl.CompositeActivatorImpl [] (StartException)
SEVERE: Exception during start processing
org.apache.tuscany.sca.host.http.ServletMappingException: java.net.BindException: Address already in use
at org.apache.tuscany.sca.http.jetty.JettyServer.addServletMapping(JettyServer.java:304)
at org.apache.tuscany.sca.http.jetty.JettyServer.addServletMapping(JettyServer.java:225)
at org.apache.tuscany.sca.host.http.DefaultServletHostExtensionPoint$LazyServletHost.addServletMapping(DefaultServletHostExtensionPoint.java:124)
at org.apache.tuscany.sca.binding.ws.axis2.provider.Axis2ServiceBindingProvider.start(Axis2ServiceBindingProvider.java:197)
at org.apache.tuscany.sca.core.assembly.impl.CompositeActivatorImpl$2.run(CompositeActivatorImpl.java:566)
at java.security.AccessController.doPrivileged(Native Method)
at org.apache.tuscany.sca.core.assembly.impl.CompositeActivatorImpl.startEndpoint(CompositeActivatorImpl.java:564)
at org.apache.tuscany.sca.core.assembly.impl.CompositeActivatorImpl.start(CompositeActivatorImpl.java:422)
at org.apache.tuscany.sca.core.assembly.impl.CompositeActivatorImpl.start(CompositeActivatorImpl.java:345)
at org.apache.tuscany.sca.node.impl.NodeImpl.start(NodeImpl.java:149)
at org.example.orderservice.OrderServiceBareTestCase.startServer(OrderServiceBareTestCase.java:52)
at sun.reflect.NativeMethodAccessorImpl.invoke0(Native Method)
at sun.reflect.NativeMethodAccessorImpl.invoke(NativeMethodAccessorImpl.java:39)
at sun.reflect.DelegatingMethodAccessorImpl.invoke(DelegatingMethodAccessorImpl.java:25)
at java.lang.reflect.Method.invoke(Method.java:597)
at org.junit.runners.model.FrameworkMethod$1.runReflectiveCall(FrameworkMethod.java:44)
at org.junit.internal.runners.model.ReflectiveCallable.run(ReflectiveCallable.java:15)
at org.junit.runners.model.FrameworkMethod.invokeExplosively(FrameworkMethod.java:41)
at org.junit.internal.runners.statements.RunBefores.evaluate(RunBefores.java:27)
at org.junit.internal.runners.statements.RunAfters.evaluate(RunAfters.java:31)
at org.junit.runners.ParentRunner.run(ParentRunner.java:236)
at org.apache.maven.surefire.junit4.JUnit4TestSet.execute(JUnit4TestSet.java:62)
at org.apache.maven.surefire.suite.AbstractDirectoryTestSuite.executeTestSet(AbstractDirectoryTestSuite.java:140)
at org.apache.maven.surefire.suite.AbstractDirectoryTestSuite.execute(AbstractDirectoryTestSuite.java:127)
at org.apache.maven.surefire.Surefire.run(Surefire.java:177)
at sun.reflect.NativeMethodAccessorImpl.invoke0(Native Method)
at sun.reflect.NativeMethodAccessorImpl.invoke(NativeMethodAccessorImpl.java:39)
at sun.reflect.DelegatingMethodAccessorImpl.invoke(DelegatingMethodAccessorImpl.java:25)
at java.lang.reflect.Method.invoke(Method.java:597)
at org.apache.maven.surefire.booter.SurefireBooter.runSuitesInProcess(SurefireBooter.java:345)
at org.apache.maven.surefire.booter.SurefireBooter.main(SurefireBooter.java:1009)
Caused by: java.net.BindException: Address already in use
at sun.nio.ch.Net.bind(Native Method)
at sun.nio.ch.ServerSocketChannelImpl.bind(ServerSocketChannelImpl.java:119)
at sun.nio.ch.ServerSocketAdaptor.bind(ServerSocketAdaptor.java:59)
at org.mortbay.jetty.nio.SelectChannelConnector.open(SelectChannelConnector.java:216)
at org.mortbay.jetty.nio.SelectChannelConnector.doStart(SelectChannelConnector.java:315)
at org.mortbay.component.AbstractLifeCycle.start(AbstractLifeCycle.java:50)
at org.mortbay.jetty.Server.doStart(Server.java:235)
at org.mortbay.component.AbstractLifeCycle.start(AbstractLifeCycle.java:50)
at org.apache.tuscany.sca.http.jetty.JettyServer.addServletMapping(JettyServer.java:297)
... 30 more
java.lang.IllegalStateException: org.apache.tuscany.sca.host.http.ServletMappingException: java.net.BindException: Address already in use
at org.apache.tuscany.sca.node.impl.NodeImpl.start(NodeImpl.java:178)
at org.example.orderservice.OrderServiceBareTestCase.startServer(OrderServiceBareTestCase.java:52)
at sun.reflect.NativeMethodAccessorImpl.invoke0(Native Method)
at sun.reflect.NativeMethodAccessorImpl.invoke(NativeMethodAccessorImpl.java:39)
at sun.reflect.DelegatingMethodAccessorImpl.invoke(DelegatingMethodAccessorImpl.java:25)
at java.lang.reflect.Method.invoke(Method.java:597)
at org.junit.runners.model.FrameworkMethod$1.runReflectiveCall(FrameworkMethod.java:44)
at org.junit.internal.runners.model.ReflectiveCallable.run(ReflectiveCallable.java:15)
at org.junit.runners.model.FrameworkMethod.invokeExplosively(FrameworkMethod.java:41)
at org.junit.internal.runners.statements.RunBefores.evaluate(RunBefores.java:27)
at org.junit.internal.runners.statements.RunAfters.evaluate(RunAfters.java:31)
at org.junit.runners.ParentRunner.run(ParentRunner.java:236)
at org.apache.maven.surefire.junit4.JUnit4TestSet.execute(JUnit4TestSet.java:62)
at org.apache.maven.surefire.suite.AbstractDirectoryTestSuite.executeTestSet(AbstractDirectoryTestSuite.java:140)
at org.apache.maven.surefire.suite.AbstractDirectoryTestSuite.execute(AbstractDirectoryTestSuite.java:127)
at org.apache.maven.surefire.Surefire.run(Surefire.java:177)
at sun.reflect.NativeMethodAccessorImpl.invoke0(Native Method)
at sun.reflect.NativeMethodAccessorImpl.invoke(NativeMethodAccessorImpl.java:39)
at sun.reflect.DelegatingMethodAccessorImpl.invoke(DelegatingMethodAccessorImpl.java:25)
at java.lang.reflect.Method.invoke(Method.java:597)
at org.apache.maven.surefire.booter.SurefireBooter.runSuitesInProcess(SurefireBooter.java:345)
at org.apache.maven.surefire.booter.SurefireBooter.main(SurefireBooter.java:1009)
Caused by: org.apache.tuscany.sca.host.http.ServletMappingException: java.net.BindException: Address already in use
at org.apache.tuscany.sca.http.jetty.JettyServer.addServletMapping(JettyServer.java:304)
at org.apache.tuscany.sca.http.jetty.JettyServer.addServletMapping(JettyServer.java:225)
at org.apache.tuscany.sca.host.http.DefaultServletHostExtensionPoint$LazyServletHost.addServletMapping(DefaultServletHostExtensionPoint.java:124)
at org.apache.tuscany.sca.binding.ws.axis2.provider.Axis2ServiceBindingProvider.start(Axis2ServiceBindingProvider.java:197)
at org.apache.tuscany.sca.core.assembly.impl.CompositeActivatorImpl$2.run(CompositeActivatorImpl.java:566)
at java.security.AccessController.doPrivileged(Native Method)
at org.apache.tuscany.sca.core.assembly.impl.CompositeActivatorImpl.startEndpoint(CompositeActivatorImpl.java:564)
at org.apache.tuscany.sca.core.assembly.impl.CompositeActivatorImpl.start(CompositeActivatorImpl.java:422)
at org.apache.tuscany.sca.core.assembly.impl.CompositeActivatorImpl.start(CompositeActivatorImpl.java:345)
at org.apache.tuscany.sca.node.impl.NodeImpl.start(NodeImpl.java:149)
... 21 more
Caused by: java.net.BindException: Address already in use
at sun.nio.ch.Net.bind(Native Method)
at sun.nio.ch.ServerSocketChannelImpl.bind(ServerSocketChannelImpl.java:119)
at sun.nio.ch.ServerSocketAdaptor.bind(ServerSocketAdaptor.java:59)
at org.mortbay.jetty.nio.SelectChannelConnector.open(SelectChannelConnector.java:216)
at org.mortbay.jetty.nio.SelectChannelConnector.doStart(SelectChannelConnector.java:315)
at org.mortbay.component.AbstractLifeCycle.start(AbstractLifeCycle.java:50)
at org.mortbay.jetty.Server.doStart(Server.java:235)
at org.mortbay.component.AbstractLifeCycle.start(AbstractLifeCycle.java:50)
at org.apache.tuscany.sca.http.jetty.JettyServer.addServletMapping(JettyServer.java:297)
... 30 more
Tests run: 10, Failures: 0, Errors: 10, Skipped: 0, Time elapsed: 0.335 sec <<< FAILURE!
Results :
Tests in error:
testOrderReviewApprovedSCA(org.example.orderservice.OrderServiceTestCase)
testOrderReviewApprovedWS(org.example.orderservice.OrderServiceTestCase)
testOrderReviewRejectedSCA(org.example.orderservice.OrderServiceTestCase)
testOrderReviewRejectedWS(org.example.orderservice.OrderServiceTestCase)
testOrderReviewRandomSCA(org.example.orderservice.OrderServiceTestCase)
testOrderReviewRandomWS(org.example.orderservice.OrderServiceTestCase)
testOrderReviewApprovedTwoInOutsSCA(org.example.orderservice.OrderServiceTestCase)
testOrderReviewApprovedTwoInOutsWS(org.example.orderservice.OrderServiceTestCase)
testOrderReviewRejectedTwoInOutsSCA(org.example.orderservice.OrderServiceTestCase)
testOrderReviewRejectedTwoInOutsWS(org.example.orderservice.OrderServiceTestCase)
testOrderReviewRandomTwoInOutsSCA(org.example.orderservice.OrderServiceTestCase)
testOrderReviewRandomTwoInOutsWS(org.example.orderservice.OrderServiceTestCase)
testOrderReviewTwoOutHoldersSCA(org.example.orderservice.OrderServiceTestCase)
testOrderReviewTwoOutHoldersWS(org.example.orderservice.OrderServiceTestCase)
testOrderReviewTwoInOutsThenInSCA(org.example.orderservice.OrderServiceTestCase)
testOrderReviewTwoInOutsThenInWS(org.example.orderservice.OrderServiceTestCase)
testOrderReviewVoidApprovedSCA(org.example.orderservice.OrderServiceTestCase)
testOrderReviewVoidApprovedWS(org.example.orderservice.OrderServiceTestCase)
testOrderReviewVoidRejectedSCA(org.example.orderservice.OrderServiceTestCase)
testOrderReviewVoidRejectedWS(org.example.orderservice.OrderServiceTestCase)
testOrderReviewOutThenInOutApprovedWS(org.example.orderservice.OrderServiceTestCase)
testOrderReviewBareApprovedSCA(org.example.orderservice.OrderServiceBareTestCase)
testOrderReviewBareApprovedWS(org.example.orderservice.OrderServiceBareTestCase)
testOrderReviewBareRejectedSCA(org.example.orderservice.OrderServiceBareTestCase)
testOrderReviewBareRejectedWS(org.example.orderservice.OrderServiceBareTestCase)
testOrderReviewInOutBareApprovedSCA(org.example.orderservice.OrderServiceBareTestCase)
testOrderReviewInOutBareApprovedWS(org.example.orderservice.OrderServiceBareTestCase)
testOrderReviewInOutBareRejectedSCA(org.example.orderservice.OrderServiceBareTestCase)
testOrderReviewInOutBareRejectedWS(org.example.orderservice.OrderServiceBareTestCase)
testOrderReviewBareOutHolderSCA(org.example.orderservice.OrderServiceBareTestCase)
testOrderReviewBareOutHolderWS(org.example.orderservice.OrderServiceBareTestCase)
Tests run: 31, Failures: 0, Errors: 31, Skipped: 0
[ERROR] There are test failures.
Please refer to <https://builds.apache.org/job/Tuscany-2x/ws/sca-2x/testing/itest/ws/holder-ws-service-multiple-outputs/target/surefire-reports> for the individual test results.
[JENKINS] Recording test results
[INFO] [jar:jar {execution: default-jar}]
[INFO] Building jar: <https://builds.apache.org/job/Tuscany-2x/ws/sca-2x/testing/itest/ws/holder-ws-service-multiple-outputs/target/itest-holder-ws-service-multiple-outputs.jar>
[INFO] [install:install {execution: default-install}]
[INFO] Installing <https://builds.apache.org/job/Tuscany-2x/ws/sca-2x/testing/itest/ws/holder-ws-service-multiple-outputs/target/itest-holder-ws-service-multiple-outputs.jar> to <https://builds.apache.org/job/Tuscany-2x/ws/.repository/org/apache/tuscany/sca/itest-holder-ws-service-multiple-outputs/2.5-SNAPSHOT/itest-holder-ws-service-multiple-outputs-2.5-SNAPSHOT.jar>
[JENKINS] Archiving disabled
[INFO] ------------------------------------------------------------------------
[INFO] Building Apache Tuscany SCA iTest WS with WSPolicy
[INFO] task-segment: [clean, install]
[INFO] ------------------------------------------------------------------------
[INFO] [clean:clean {execution: default-clean}]
[INFO] [enforcer:enforce {execution: enforce-plugin-versions}]
[INFO] [remote-resources:process {execution: default}]
[INFO] [resources:resources {execution: default-resources}]
[INFO] Using 'UTF-8' encoding to copy filtered resources.
[INFO] Copying 6 resources
[INFO] Copying 1 resource
[INFO] Copying 3 resources
[INFO] [compiler:compile {execution: default-compile}]
[INFO] Compiling 4 source files to <https://builds.apache.org/job/Tuscany-2x/ws/sca-2x/testing/itest/ws/wspolicy/target/classes>
[INFO] -------------------------------------------------------------
[ERROR] COMPILATION ERROR :
[INFO] -------------------------------------------------------------
[ERROR] <https://builds.apache.org/job/Tuscany-2x/ws/sca-2x/testing/itest/ws/wspolicy/src/main/java/org/apache/tuscany/sca/binding/ws/axis2/helloworld/ServerPWCBHandler.java>:[27,29] package org.apache.ws.security does not exist
[ERROR] <https://builds.apache.org/job/Tuscany-2x/ws/sca-2x/testing/itest/ws/wspolicy/src/main/java/org/apache/tuscany/sca/binding/ws/axis2/helloworld/ServerPWCBHandler.java>:[38,12] cannot find symbol
symbol : class WSPasswordCallback
location: class org.apache.tuscany.sca.binding.ws.axis2.helloworld.ServerPWCBHandler
[ERROR] <https://builds.apache.org/job/Tuscany-2x/ws/sca-2x/testing/itest/ws/wspolicy/src/main/java/org/apache/tuscany/sca/binding/ws/axis2/helloworld/ServerPWCBHandler.java>:[38,39] cannot find symbol
symbol : class WSPasswordCallback
location: class org.apache.tuscany.sca.binding.ws.axis2.helloworld.ServerPWCBHandler
[ERROR] <https://builds.apache.org/job/Tuscany-2x/ws/sca-2x/testing/itest/ws/wspolicy/src/main/java/org/apache/tuscany/sca/binding/ws/axis2/helloworld/ServerPWCBHandler.java>:[42,36] cannot find symbol
symbol : variable WSPasswordCallback
location: class org.apache.tuscany.sca.binding.ws.axis2.helloworld.ServerPWCBHandler
[ERROR] <https://builds.apache.org/job/Tuscany-2x/ws/sca-2x/testing/itest/ws/wspolicy/src/main/java/org/apache/tuscany/sca/binding/ws/axis2/helloworld/ServerPWCBHandler.java>:[49,43] cannot find symbol
symbol : variable WSPasswordCallback
location: class org.apache.tuscany.sca.binding.ws.axis2.helloworld.ServerPWCBHandler
[INFO] 5 errors
[INFO] -------------------------------------------------------------
[JENKINS] Archiving disabled
[INFO] ------------------------------------------------------------------------
[ERROR] BUILD FAILURE
[INFO] ------------------------------------------------------------------------
[INFO] Compilation failure
<https://builds.apache.org/job/Tuscany-2x/ws/sca-2x/testing/itest/ws/wspolicy/src/main/java/org/apache/tuscany/sca/binding/ws/axis2/helloworld/ServerPWCBHandler.java>:[27,29] package org.apache.ws.security does not exist
<https://builds.apache.org/job/Tuscany-2x/ws/sca-2x/testing/itest/ws/wspolicy/src/main/java/org/apache/tuscany/sca/binding/ws/axis2/helloworld/ServerPWCBHandler.java>:[38,12] cannot find symbol
symbol : class WSPasswordCallback
location: class org.apache.tuscany.sca.binding.ws.axis2.helloworld.ServerPWCBHandler
<https://builds.apache.org/job/Tuscany-2x/ws/sca-2x/testing/itest/ws/wspolicy/src/main/java/org/apache/tuscany/sca/binding/ws/axis2/helloworld/ServerPWCBHandler.java>:[38,39] cannot find symbol
symbol : class WSPasswordCallback
location: class org.apache.tuscany.sca.binding.ws.axis2.helloworld.ServerPWCBHandler
<https://builds.apache.org/job/Tuscany-2x/ws/sca-2x/testing/itest/ws/wspolicy/src/main/java/org/apache/tuscany/sca/binding/ws/axis2/helloworld/ServerPWCBHandler.java>:[42,36] cannot find symbol
symbol : variable WSPasswordCallback
location: class org.apache.tuscany.sca.binding.ws.axis2.helloworld.ServerPWCBHandler
<https://builds.apache.org/job/Tuscany-2x/ws/sca-2x/testing/itest/ws/wspolicy/src/main/java/org/apache/tuscany/sca/binding/ws/axis2/helloworld/ServerPWCBHandler.java>:[49,43] cannot find symbol
symbol : variable WSPasswordCallback
location: class org.apache.tuscany.sca.binding.ws.axis2.helloworld.ServerPWCBHandler
[INFO] ------------------------------------------------------------------------
[INFO] For more information, run Maven with the -e switch
[INFO] ------------------------------------------------------------------------
[INFO] Total time: 31 minutes 34 seconds
[INFO] Finished at: Wed Jul 10 02:53:18 UTC 2013
[INFO] Final Memory: 735M/910M
[INFO] ------------------------------------------------------------------------
Maven failed with error.
Sending e-mails to: notification@tuscany.apache.org
Sending e-mails to: notification@tuscany.apache.org
Sending e-mails to: notification@tuscany.apache.org
Sending e-mails to: notification@tuscany.apache.org
Sending e-mails to: notification@tuscany.apache.org
Sending e-mails to: notification@tuscany.apache.org
Sending e-mails to: notification@tuscany.apache.org
Sending e-mails to: notification@tuscany.apache.org
Sending e-mails to: notification@tuscany.apache.org
Sending e-mails to: notification@tuscany.apache.org
Sending e-mails to: notification@tuscany.apache.org
Sending e-mails to: notification@tuscany.apache.org
Sending e-mails to: notification@tuscany.apache.org
Sending e-mails to: notification@tuscany.apache.org
Sending e-mails to: notification@tuscany.apache.org
Sending e-mails to: notification@tuscany.apache.org
Sending e-mails to: notification@tuscany.apache.org
Sending e-mails to: notification@tuscany.apache.org
Sending e-mails to: notification@tuscany.apache.org
Sending e-mails to: notification@tuscany.apache.org
Sending e-mails to: notification@tuscany.apache.org
Sending e-mails to: notification@tuscany.apache.org
channel stopped
2013-07-10 02:57:35.090:INFO::Shutdown hook executing
2013-07-10 02:57:35.090:INFO::Shutdown hook complete
Build failed in Jenkins: Tuscany-2x #1072
Posted by Apache Jenkins Server <je...@builds.apache.org>.
See <https://builds.apache.org/job/Tuscany-2x/1072/>
------------------------------------------
[...truncated 47577 lines...]
INFO: Add endpoint - binding.ws - http://localhost:8085/myService
Jul 9, 2013 3:35:24 AM org.apache.tuscany.sca.core.assembly.impl.DomainRegistryImpl addEndpoint
INFO: Add endpoint - binding.sca - HelloWorldComponent/HelloWorld
Jul 9, 2013 3:35:24 AM org.apache.tuscany.sca.node.impl.NodeImpl stop
INFO: Stopping node: http://tuscany.apache.org/sca/1.1/nodes/default0
Jul 9, 2013 3:35:24 AM org.apache.tuscany.sca.core.assembly.impl.DomainRegistryImpl removeEndpoint
INFO: Remove endpoint - binding.ws - http://localhost:8085/myService
Jul 9, 2013 3:35:24 AM org.apache.tuscany.sca.http.jetty.JettyServer removeServletMapping
INFO: Removed Servlet mapping: /myService
Jul 9, 2013 3:35:24 AM org.apache.tuscany.sca.core.assembly.impl.DomainRegistryImpl removeEndpoint
INFO: Remove endpoint - binding.sca - HelloWorldComponent/HelloWorld
Tests run: 1, Failures: 0, Errors: 0, Skipped: 0, Time elapsed: 2.399 sec
Results :
Tests run: 1, Failures: 0, Errors: 0, Skipped: 0
[JENKINS] Recording test results
[INFO] [jar:jar {execution: default-jar}]
[INFO] Building jar: <https://builds.apache.org/job/Tuscany-2x/ws/sca-2x/testing/itest/ws/endpoint-references/target/itest-ws-endpoint-references.jar>
[INFO] [install:install {execution: default-install}]
[INFO] Installing <https://builds.apache.org/job/Tuscany-2x/ws/sca-2x/testing/itest/ws/endpoint-references/target/itest-ws-endpoint-references.jar> to <https://builds.apache.org/job/Tuscany-2x/ws/.repository/org/apache/tuscany/sca/itest-ws-endpoint-references/2.5-SNAPSHOT/itest-ws-endpoint-references-2.5-SNAPSHOT.jar>
[JENKINS] Archiving disabled
[INFO] ------------------------------------------------------------------------
[INFO] Building Apache Tuscany SCA itest WS Holder Input/MultipleOutputs
[INFO] task-segment: [clean, install]
[INFO] ------------------------------------------------------------------------
[INFO] [clean:clean {execution: default-clean}]
[INFO] [enforcer:enforce {execution: enforce-plugin-versions}]
[INFO] [remote-resources:process {execution: default}]
[INFO] [resources:resources {execution: default-resources}]
[INFO] Using 'UTF-8' encoding to copy filtered resources.
[INFO] Copying 2 resources
[INFO] Copying 0 resource
[INFO] Copying 3 resources
[INFO] [compiler:compile {execution: default-compile}]
[INFO] Compiling 8 source files to <https://builds.apache.org/job/Tuscany-2x/ws/sca-2x/testing/itest/ws/holder-ws-service-multiple-outputs/target/classes>
[INFO] [resources:testResources {execution: default-testResources}]
[INFO] Using 'UTF-8' encoding to copy filtered resources.
[INFO] skip non existing resourceDirectory <https://builds.apache.org/job/Tuscany-2x/ws/sca-2x/testing/itest/ws/holder-ws-service-multiple-outputs/src/test/resources>
[INFO] Copying 3 resources
[INFO] [compiler:testCompile {execution: default-testCompile}]
[INFO] Compiling 2 source files to <https://builds.apache.org/job/Tuscany-2x/ws/sca-2x/testing/itest/ws/holder-ws-service-multiple-outputs/target/test-classes>
[INFO] [surefire:test {execution: default-test}]
[INFO] Surefire report directory: <https://builds.apache.org/job/Tuscany-2x/ws/sca-2x/testing/itest/ws/holder-ws-service-multiple-outputs/target/surefire-reports>
-------------------------------------------------------
T E S T S
-------------------------------------------------------
Running org.example.orderservice.OrderServiceTestCase
Jul 9, 2013 3:35:28 AM org.apache.tuscany.sca.node.impl.NodeImpl start
INFO: Starting node: http://tuscany.apache.org/sca/1.1/nodes/default0 domain: default
Jul 9, 2013 3:35:28 AM org.apache.tuscany.sca.node.impl.NodeFactoryImpl loadContributions
INFO: Loading contribution: <https://builds.apache.org/job/Tuscany-2x/ws/sca-2x/testing/itest/ws/holder-ws-service-multiple-outputs/target/classes/>
2013-07-09 03:35:30.419:INFO::Logging to STDERR via org.mortbay.log.StdErrLog
Jul 9, 2013 3:35:30 AM org.apache.tuscany.sca.core.assembly.impl.DomainRegistryImpl addEndpoint
INFO: Add endpoint - binding.sca - OrderServiceComponent/OrderService/sca
Jul 9, 2013 3:35:30 AM org.apache.tuscany.sca.http.jetty.JettyLogger info
INFO: jetty-6.1.26
Jul 9, 2013 3:35:30 AM org.apache.tuscany.sca.http.jetty.JettyLogger info
INFO: Started SelectChannelConnector@0.0.0.0:8080
Jul 9, 2013 3:35:30 AM org.apache.tuscany.sca.http.jetty.JettyServer addServletMapping
INFO: Added Servlet mapping: http://67.195.138.58:8080/OrderServiceComponent/OrderService
Jul 9, 2013 3:35:30 AM org.apache.tuscany.sca.core.assembly.impl.DomainRegistryImpl addEndpoint
INFO: Add endpoint - binding.ws - http://67.195.138.58:8080/OrderServiceComponent/OrderService
Jul 9, 2013 3:35:30 AM org.apache.tuscany.sca.core.assembly.impl.DomainRegistryImpl addEndpoint
INFO: Add endpoint - binding.sca - OrderServiceForwardComponent/OrderService
>>> Order submitted=Order[customerId=cust1234,orderId=0,total=50.0,status=Created]
>>> OrderService.reviewOrder return=Order[customerId=cust1234,orderId=0,total=50.0,status=Approved]
>>> Order returned=Order[customerId=cust1234,orderId=0,total=50.0,status=Approved]
>>> Order submitted=Order[customerId=cust1234,orderId=0,total=50.0,status=Created]
>>> OrderService.reviewOrder return=Order[customerId=cust1234,orderId=0,total=50.0,status=Approved]
>>> Order returned=Order[customerId=cust1234,orderId=0,total=50.0,status=Approved]
>>> Order submitted=Order[customerId=cust2345,orderId=0,total=50000.0,status=Created]
>>> OrderService.reviewOrder return=Order[customerId=cust2345,orderId=0,total=50000.0,status=Rejected]
>>> Order returned=Order[customerId=cust2345,orderId=0,total=50000.0,status=Rejected]
>>> return values: retval1 retval2
>>> Order submitted=Order[customerId=cust2345,orderId=0,total=50000.0,status=Created]
>>> OrderService.reviewOrder return=Order[customerId=cust2345,orderId=0,total=50000.0,status=Rejected]
>>> Order returned=Order[customerId=cust2345,orderId=0,total=50000.0,status=Rejected]
>>> return values: retval1 retval2
>>> Order submitted=Order[customerId=cust3456,orderId=0,total=600.0,status=Created]
>>> OrderService.reviewOrder return=Order[customerId=cust3456,orderId=0,total=600.0,status=Rejected]
>>> Order returned=Order[customerId=cust3456,orderId=0,total=600.0,status=Rejected]
>>> Order submitted=Order[customerId=cust3456,orderId=0,total=600.0,status=Created]
>>> OrderService.reviewOrder return=Order[customerId=cust3456,orderId=0,total=600.0,status=Approved]
>>> Order returned=Order[customerId=cust3456,orderId=0,total=600.0,status=Approved]
>>> Order submitted=Order[customerId=cust1234,orderId=0,total=50.0,status=Created]
>>> OrderService.reviewOrder return=Order[customerId=cust1234,orderId=0,total=50.0,status=Approved]
>>> Order returned=Order[customerId=cust1234,orderId=0,total=50.0,status=Approved]
>>> Order submitted=Order[customerId=cust1234,orderId=0,total=50.0,status=Created]
>>> OrderService.reviewOrder return=Order[customerId=cust1234,orderId=0,total=50.0,status=Approved]
>>> Order returned=Order[customerId=cust1234,orderId=0,total=50.0,status=Approved]
>>> Order submitted=Order[customerId=cust2345,orderId=0,total=50000.0,status=Created]
>>> OrderService.reviewOrder return=Order[customerId=cust2345,orderId=0,total=50000.0,status=Rejected]
>>> Order returned=Order[customerId=cust2345,orderId=0,total=50000.0,status=Rejected]
>>> return values: retval1 retval2
>>> Order submitted=Order[customerId=cust2345,orderId=0,total=50000.0,status=Created]
>>> OrderService.reviewOrder return=Order[customerId=cust2345,orderId=0,total=50000.0,status=Rejected]
>>> Order returned=Order[customerId=cust2345,orderId=0,total=50000.0,status=Rejected]
>>> return values: retval1 retval2
>>> Order submitted=Order[customerId=cust3456,orderId=0,total=600.0,status=Created]
>>> OrderService.reviewOrder return=Order[customerId=cust3456,orderId=0,total=600.0,status=Approved]
>>> Order returned=Order[customerId=cust3456,orderId=0,total=600.0,status=Approved]
>>> Order submitted=Order[customerId=cust3456,orderId=0,total=600.0,status=Created]
>>> OrderService.reviewOrder return=Order[customerId=cust3456,orderId=0,total=600.0,status=Approved]
>>> Order returned=Order[customerId=cust3456,orderId=0,total=600.0,status=Approved]
>>> Order submitted=Order[customerId=cust3456,orderId=0,total=600.0,status=Created]
>>> Order returned=Order[customerId=null,orderId=0,total=0.0,status=Rejected]
>>> Order submitted=Order[customerId=cust3456,orderId=0,total=600.0,status=Created]
>>> Order returned=Order[customerId=null,orderId=0,total=0.0,status=Rejected]
>>> Order submitted=Order[customerId=cust1234,orderId=0,total=50.0,status=Created]
>>> Order returned=Order[customerId=cust1234,orderId=0,total=50.0,status=Approved]
>>> Order submitted=Order[customerId=cust1234,orderId=0,total=50.0,status=Created]
>>> Order returned=Order[customerId=cust1234,orderId=0,total=50.0,status=Approved]
>>> Order submitted=Order[customerId=cust1234,orderId=0,total=50.0,status=Created]
>>> Order submitted=Order[customerId=cust1234,orderId=0,total=50.0,status=Created]
>>> Order submitted=Order[customerId=cust2345,orderId=0,total=50000.0,status=Created]
>>> Order submitted=Order[customerId=cust2345,orderId=0,total=50000.0,status=Created]
>>> Order submitted=Order[customerId=cust1234,orderId=0,total=50.0,status=Created]
>>> OrderService.reviewOrder return=Order[customerId=cust1234,orderId=0,total=50.0,status=Approved]
Jul 9, 2013 3:35:31 AM org.apache.tuscany.sca.node.impl.NodeImpl stop
INFO: Stopping node: http://tuscany.apache.org/sca/1.1/nodes/default0
Jul 9, 2013 3:35:31 AM org.apache.tuscany.sca.core.assembly.impl.DomainRegistryImpl removeEndpoint
INFO: Remove endpoint - binding.sca - OrderServiceComponent/OrderService/sca
Jul 9, 2013 3:35:31 AM org.apache.tuscany.sca.core.assembly.impl.DomainRegistryImpl removeEndpoint
INFO: Remove endpoint - binding.ws - http://67.195.138.58:8080/OrderServiceComponent/OrderService
Jul 9, 2013 3:35:31 AM org.apache.tuscany.sca.http.jetty.JettyServer removeServletMapping
INFO: Removed Servlet mapping: /OrderServiceComponent/OrderService
Jul 9, 2013 3:35:31 AM org.apache.tuscany.sca.http.jetty.JettyLogger info
INFO: Stopped SelectChannelConnector@0.0.0.0:8080
Jul 9, 2013 3:35:31 AM org.apache.tuscany.sca.core.assembly.impl.DomainRegistryImpl removeEndpoint
INFO: Remove endpoint - binding.sca - OrderServiceForwardComponent/OrderService
Tests run: 21, Failures: 0, Errors: 0, Skipped: 0, Time elapsed: 2.764 sec
Running org.example.orderservice.OrderServiceBareTestCase
Jul 9, 2013 3:35:31 AM org.apache.tuscany.sca.node.impl.NodeImpl start
INFO: Starting node: http://tuscany.apache.org/sca/1.1/nodes/default0 domain: default
Jul 9, 2013 3:35:31 AM org.apache.tuscany.sca.node.impl.NodeFactoryImpl loadContributions
INFO: Loading contribution: <https://builds.apache.org/job/Tuscany-2x/ws/sca-2x/testing/itest/ws/holder-ws-service-multiple-outputs/target/classes/>
Jul 9, 2013 3:35:31 AM org.apache.tuscany.sca.http.jetty.JettyLogger info
INFO: jetty-6.1.26
Jul 9, 2013 3:35:31 AM org.apache.tuscany.sca.http.jetty.JettyLogger info
INFO: Started SelectChannelConnector@0.0.0.0:8080
Jul 9, 2013 3:35:31 AM org.apache.tuscany.sca.http.jetty.JettyServer addServletMapping
INFO: Added Servlet mapping: http://67.195.138.58:8080/OrderServiceBareComponent/OrderServiceBare
Jul 9, 2013 3:35:31 AM org.apache.tuscany.sca.core.assembly.impl.DomainRegistryImpl addEndpoint
INFO: Add endpoint - binding.ws - http://67.195.138.58:8080/OrderServiceBareComponent/OrderServiceBare
Jul 9, 2013 3:35:31 AM org.apache.tuscany.sca.http.jetty.JettyServer addServletMapping
INFO: Added Servlet mapping: http://67.195.138.58:8080/OrderServiceBareForwardComponent/OrderServiceBare
Jul 9, 2013 3:35:31 AM org.apache.tuscany.sca.core.assembly.impl.DomainRegistryImpl addEndpoint
INFO: Add endpoint - binding.ws - http://67.195.138.58:8080/OrderServiceBareForwardComponent/OrderServiceBare
Jul 9, 2013 3:35:31 AM org.apache.tuscany.sca.node.impl.NodeImpl stop
INFO: Stopping node: http://tuscany.apache.org/sca/1.1/nodes/default0
Jul 9, 2013 3:35:31 AM org.apache.tuscany.sca.core.assembly.impl.DomainRegistryImpl removeEndpoint
INFO: Remove endpoint - binding.ws - http://67.195.138.58:8080/OrderServiceBareComponent/OrderServiceBare
Jul 9, 2013 3:35:31 AM org.apache.tuscany.sca.http.jetty.JettyServer removeServletMapping
INFO: Removed Servlet mapping: /OrderServiceBareComponent/OrderServiceBare
Jul 9, 2013 3:35:31 AM org.apache.tuscany.sca.core.assembly.impl.DomainRegistryImpl removeEndpoint
INFO: Remove endpoint - binding.ws - http://67.195.138.58:8080/OrderServiceBareForwardComponent/OrderServiceBare
Jul 9, 2013 3:35:31 AM org.apache.tuscany.sca.http.jetty.JettyServer removeServletMapping
INFO: Removed Servlet mapping: /OrderServiceBareForwardComponent/OrderServiceBare
Jul 9, 2013 3:35:31 AM org.apache.tuscany.sca.http.jetty.JettyLogger info
INFO: Stopped SelectChannelConnector@0.0.0.0:8080
Tests run: 10, Failures: 0, Errors: 0, Skipped: 0, Time elapsed: 0.548 sec
Results :
Tests run: 31, Failures: 0, Errors: 0, Skipped: 0
[JENKINS] Recording test results
[INFO] [jar:jar {execution: default-jar}]
[INFO] Building jar: <https://builds.apache.org/job/Tuscany-2x/ws/sca-2x/testing/itest/ws/holder-ws-service-multiple-outputs/target/itest-holder-ws-service-multiple-outputs.jar>
[INFO] [install:install {execution: default-install}]
[INFO] Installing <https://builds.apache.org/job/Tuscany-2x/ws/sca-2x/testing/itest/ws/holder-ws-service-multiple-outputs/target/itest-holder-ws-service-multiple-outputs.jar> to <https://builds.apache.org/job/Tuscany-2x/ws/.repository/org/apache/tuscany/sca/itest-holder-ws-service-multiple-outputs/2.5-SNAPSHOT/itest-holder-ws-service-multiple-outputs-2.5-SNAPSHOT.jar>
[JENKINS] Archiving disabled
[INFO] ------------------------------------------------------------------------
[INFO] Building Apache Tuscany SCA iTest WS with WSPolicy
[INFO] task-segment: [clean, install]
[INFO] ------------------------------------------------------------------------
[INFO] [clean:clean {execution: default-clean}]
[INFO] [enforcer:enforce {execution: enforce-plugin-versions}]
[INFO] [remote-resources:process {execution: default}]
[INFO] [resources:resources {execution: default-resources}]
[INFO] Using 'UTF-8' encoding to copy filtered resources.
[INFO] Copying 6 resources
[INFO] Copying 1 resource
[INFO] Copying 3 resources
[INFO] [compiler:compile {execution: default-compile}]
[INFO] Compiling 4 source files to <https://builds.apache.org/job/Tuscany-2x/ws/sca-2x/testing/itest/ws/wspolicy/target/classes>
[INFO] -------------------------------------------------------------
[ERROR] COMPILATION ERROR :
[INFO] -------------------------------------------------------------
[ERROR] <https://builds.apache.org/job/Tuscany-2x/ws/sca-2x/testing/itest/ws/wspolicy/src/main/java/org/apache/tuscany/sca/binding/ws/axis2/helloworld/ServerPWCBHandler.java>:[27,29] package org.apache.ws.security does not exist
[ERROR] <https://builds.apache.org/job/Tuscany-2x/ws/sca-2x/testing/itest/ws/wspolicy/src/main/java/org/apache/tuscany/sca/binding/ws/axis2/helloworld/ServerPWCBHandler.java>:[38,12] cannot find symbol
symbol : class WSPasswordCallback
location: class org.apache.tuscany.sca.binding.ws.axis2.helloworld.ServerPWCBHandler
[ERROR] <https://builds.apache.org/job/Tuscany-2x/ws/sca-2x/testing/itest/ws/wspolicy/src/main/java/org/apache/tuscany/sca/binding/ws/axis2/helloworld/ServerPWCBHandler.java>:[38,39] cannot find symbol
symbol : class WSPasswordCallback
location: class org.apache.tuscany.sca.binding.ws.axis2.helloworld.ServerPWCBHandler
[ERROR] <https://builds.apache.org/job/Tuscany-2x/ws/sca-2x/testing/itest/ws/wspolicy/src/main/java/org/apache/tuscany/sca/binding/ws/axis2/helloworld/ServerPWCBHandler.java>:[42,36] cannot find symbol
symbol : variable WSPasswordCallback
location: class org.apache.tuscany.sca.binding.ws.axis2.helloworld.ServerPWCBHandler
[ERROR] <https://builds.apache.org/job/Tuscany-2x/ws/sca-2x/testing/itest/ws/wspolicy/src/main/java/org/apache/tuscany/sca/binding/ws/axis2/helloworld/ServerPWCBHandler.java>:[49,43] cannot find symbol
symbol : variable WSPasswordCallback
location: class org.apache.tuscany.sca.binding.ws.axis2.helloworld.ServerPWCBHandler
[INFO] 5 errors
[INFO] -------------------------------------------------------------
[JENKINS] Archiving disabled
[INFO] ------------------------------------------------------------------------
[ERROR] BUILD FAILURE
[INFO] ------------------------------------------------------------------------
[INFO] Compilation failure
<https://builds.apache.org/job/Tuscany-2x/ws/sca-2x/testing/itest/ws/wspolicy/src/main/java/org/apache/tuscany/sca/binding/ws/axis2/helloworld/ServerPWCBHandler.java>:[27,29] package org.apache.ws.security does not exist
<https://builds.apache.org/job/Tuscany-2x/ws/sca-2x/testing/itest/ws/wspolicy/src/main/java/org/apache/tuscany/sca/binding/ws/axis2/helloworld/ServerPWCBHandler.java>:[38,12] cannot find symbol
symbol : class WSPasswordCallback
location: class org.apache.tuscany.sca.binding.ws.axis2.helloworld.ServerPWCBHandler
<https://builds.apache.org/job/Tuscany-2x/ws/sca-2x/testing/itest/ws/wspolicy/src/main/java/org/apache/tuscany/sca/binding/ws/axis2/helloworld/ServerPWCBHandler.java>:[38,39] cannot find symbol
symbol : class WSPasswordCallback
location: class org.apache.tuscany.sca.binding.ws.axis2.helloworld.ServerPWCBHandler
<https://builds.apache.org/job/Tuscany-2x/ws/sca-2x/testing/itest/ws/wspolicy/src/main/java/org/apache/tuscany/sca/binding/ws/axis2/helloworld/ServerPWCBHandler.java>:[42,36] cannot find symbol
symbol : variable WSPasswordCallback
location: class org.apache.tuscany.sca.binding.ws.axis2.helloworld.ServerPWCBHandler
<https://builds.apache.org/job/Tuscany-2x/ws/sca-2x/testing/itest/ws/wspolicy/src/main/java/org/apache/tuscany/sca/binding/ws/axis2/helloworld/ServerPWCBHandler.java>:[49,43] cannot find symbol
symbol : variable WSPasswordCallback
location: class org.apache.tuscany.sca.binding.ws.axis2.helloworld.ServerPWCBHandler
[INFO] ------------------------------------------------------------------------
[INFO] For more information, run Maven with the -e switch
[INFO] ------------------------------------------------------------------------
[INFO] Total time: 31 minutes 56 seconds
[INFO] Finished at: Tue Jul 09 03:35:36 UTC 2013
[INFO] Final Memory: 736M/910M
[INFO] ------------------------------------------------------------------------
Maven failed with error.
Sending e-mails to: notification@tuscany.apache.org
channel stopped
2013-07-09 03:39:37.163:INFO::Shutdown hook executing
2013-07-09 03:39:37.164:INFO::Shutdown hook complete
Build failed in Jenkins: Tuscany-2x #1071
Posted by Apache Jenkins Server <je...@builds.apache.org>.
See <https://builds.apache.org/job/Tuscany-2x/1071/>
------------------------------------------
[...truncated 47561 lines...]
INFO: Add endpoint - binding.ws - http://localhost:8085/myService
Jul 8, 2013 1:58:35 AM org.apache.tuscany.sca.core.assembly.impl.DomainRegistryImpl addEndpoint
INFO: Add endpoint - binding.sca - HelloWorldComponent/HelloWorld
Jul 8, 2013 1:58:35 AM org.apache.tuscany.sca.node.impl.NodeImpl stop
INFO: Stopping node: http://tuscany.apache.org/sca/1.1/nodes/default0
Jul 8, 2013 1:58:35 AM org.apache.tuscany.sca.core.assembly.impl.DomainRegistryImpl removeEndpoint
INFO: Remove endpoint - binding.ws - http://localhost:8085/myService
Jul 8, 2013 1:58:35 AM org.apache.tuscany.sca.http.jetty.JettyServer removeServletMapping
INFO: Removed Servlet mapping: /myService
Jul 8, 2013 1:58:35 AM org.apache.tuscany.sca.core.assembly.impl.DomainRegistryImpl removeEndpoint
INFO: Remove endpoint - binding.sca - HelloWorldComponent/HelloWorld
Tests run: 1, Failures: 0, Errors: 0, Skipped: 0, Time elapsed: 5.597 sec
Results :
Tests run: 1, Failures: 0, Errors: 0, Skipped: 0
[JENKINS] Recording test results
[INFO] [jar:jar {execution: default-jar}]
[INFO] Building jar: <https://builds.apache.org/job/Tuscany-2x/ws/sca-2x/testing/itest/ws/endpoint-references/target/itest-ws-endpoint-references.jar>
[INFO] [install:install {execution: default-install}]
[INFO] Installing <https://builds.apache.org/job/Tuscany-2x/ws/sca-2x/testing/itest/ws/endpoint-references/target/itest-ws-endpoint-references.jar> to <https://builds.apache.org/job/Tuscany-2x/ws/.repository/org/apache/tuscany/sca/itest-ws-endpoint-references/2.5-SNAPSHOT/itest-ws-endpoint-references-2.5-SNAPSHOT.jar>
[JENKINS] Archiving disabled
[INFO] ------------------------------------------------------------------------
[INFO] Building Apache Tuscany SCA itest WS Holder Input/MultipleOutputs
[INFO] task-segment: [clean, install]
[INFO] ------------------------------------------------------------------------
[INFO] [clean:clean {execution: default-clean}]
[INFO] [enforcer:enforce {execution: enforce-plugin-versions}]
[INFO] [remote-resources:process {execution: default}]
[INFO] [resources:resources {execution: default-resources}]
[INFO] Using 'UTF-8' encoding to copy filtered resources.
[INFO] Copying 2 resources
[INFO] Copying 0 resource
[INFO] Copying 3 resources
[INFO] [compiler:compile {execution: default-compile}]
[INFO] Compiling 8 source files to <https://builds.apache.org/job/Tuscany-2x/ws/sca-2x/testing/itest/ws/holder-ws-service-multiple-outputs/target/classes>
[INFO] [resources:testResources {execution: default-testResources}]
[INFO] Using 'UTF-8' encoding to copy filtered resources.
[INFO] skip non existing resourceDirectory <https://builds.apache.org/job/Tuscany-2x/ws/sca-2x/testing/itest/ws/holder-ws-service-multiple-outputs/src/test/resources>
[INFO] Copying 3 resources
[INFO] [compiler:testCompile {execution: default-testCompile}]
[INFO] Compiling 2 source files to <https://builds.apache.org/job/Tuscany-2x/ws/sca-2x/testing/itest/ws/holder-ws-service-multiple-outputs/target/test-classes>
[INFO] [surefire:test {execution: default-test}]
[INFO] Surefire report directory: <https://builds.apache.org/job/Tuscany-2x/ws/sca-2x/testing/itest/ws/holder-ws-service-multiple-outputs/target/surefire-reports>
-------------------------------------------------------
T E S T S
-------------------------------------------------------
Running org.example.orderservice.OrderServiceTestCase
Jul 8, 2013 1:58:40 AM org.apache.tuscany.sca.node.impl.NodeImpl start
INFO: Starting node: http://tuscany.apache.org/sca/1.1/nodes/default0 domain: default
Jul 8, 2013 1:58:40 AM org.apache.tuscany.sca.node.impl.NodeFactoryImpl loadContributions
INFO: Loading contribution: <https://builds.apache.org/job/Tuscany-2x/ws/sca-2x/testing/itest/ws/holder-ws-service-multiple-outputs/target/classes/>
2013-07-08 01:58:42.443:INFO::Logging to STDERR via org.mortbay.log.StdErrLog
Jul 8, 2013 1:58:42 AM org.apache.tuscany.sca.core.assembly.impl.DomainRegistryImpl addEndpoint
INFO: Add endpoint - binding.sca - OrderServiceComponent/OrderService/sca
Jul 8, 2013 1:58:42 AM org.apache.tuscany.sca.http.jetty.JettyLogger info
INFO: jetty-6.1.26
Jul 8, 2013 1:58:42 AM org.apache.tuscany.sca.http.jetty.JettyLogger info
INFO: Started SelectChannelConnector@0.0.0.0:8080
Jul 8, 2013 1:58:42 AM org.apache.tuscany.sca.http.jetty.JettyServer addServletMapping
INFO: Added Servlet mapping: http://67.195.138.58:8080/OrderServiceComponent/OrderService
Jul 8, 2013 1:58:42 AM org.apache.tuscany.sca.core.assembly.impl.DomainRegistryImpl addEndpoint
INFO: Add endpoint - binding.ws - http://67.195.138.58:8080/OrderServiceComponent/OrderService
Jul 8, 2013 1:58:42 AM org.apache.tuscany.sca.core.assembly.impl.DomainRegistryImpl addEndpoint
INFO: Add endpoint - binding.sca - OrderServiceForwardComponent/OrderService
>>> Order submitted=Order[customerId=cust1234,orderId=0,total=50.0,status=Created]
>>> OrderService.reviewOrder return=Order[customerId=cust1234,orderId=0,total=50.0,status=Approved]
>>> Order returned=Order[customerId=cust1234,orderId=0,total=50.0,status=Approved]
>>> Order submitted=Order[customerId=cust1234,orderId=0,total=50.0,status=Created]
>>> OrderService.reviewOrder return=Order[customerId=cust1234,orderId=0,total=50.0,status=Approved]
>>> Order returned=Order[customerId=cust1234,orderId=0,total=50.0,status=Approved]
>>> Order submitted=Order[customerId=cust2345,orderId=0,total=50000.0,status=Created]
>>> OrderService.reviewOrder return=Order[customerId=cust2345,orderId=0,total=50000.0,status=Rejected]
>>> Order returned=Order[customerId=cust2345,orderId=0,total=50000.0,status=Rejected]
>>> return values: retval1 retval2
>>> Order submitted=Order[customerId=cust2345,orderId=0,total=50000.0,status=Created]
>>> OrderService.reviewOrder return=Order[customerId=cust2345,orderId=0,total=50000.0,status=Rejected]
>>> Order returned=Order[customerId=cust2345,orderId=0,total=50000.0,status=Rejected]
>>> return values: retval1 retval2
>>> Order submitted=Order[customerId=cust3456,orderId=0,total=600.0,status=Created]
>>> OrderService.reviewOrder return=Order[customerId=cust3456,orderId=0,total=600.0,status=Rejected]
>>> Order returned=Order[customerId=cust3456,orderId=0,total=600.0,status=Rejected]
>>> Order submitted=Order[customerId=cust3456,orderId=0,total=600.0,status=Created]
>>> OrderService.reviewOrder return=Order[customerId=cust3456,orderId=0,total=600.0,status=Approved]
>>> Order returned=Order[customerId=cust3456,orderId=0,total=600.0,status=Approved]
>>> Order submitted=Order[customerId=cust1234,orderId=0,total=50.0,status=Created]
>>> OrderService.reviewOrder return=Order[customerId=cust1234,orderId=0,total=50.0,status=Approved]
>>> Order returned=Order[customerId=cust1234,orderId=0,total=50.0,status=Approved]
>>> Order submitted=Order[customerId=cust1234,orderId=0,total=50.0,status=Created]
>>> OrderService.reviewOrder return=Order[customerId=cust1234,orderId=0,total=50.0,status=Approved]
>>> Order returned=Order[customerId=cust1234,orderId=0,total=50.0,status=Approved]
>>> Order submitted=Order[customerId=cust2345,orderId=0,total=50000.0,status=Created]
>>> OrderService.reviewOrder return=Order[customerId=cust2345,orderId=0,total=50000.0,status=Rejected]
>>> Order returned=Order[customerId=cust2345,orderId=0,total=50000.0,status=Rejected]
>>> return values: retval1 retval2
>>> Order submitted=Order[customerId=cust2345,orderId=0,total=50000.0,status=Created]
>>> OrderService.reviewOrder return=Order[customerId=cust2345,orderId=0,total=50000.0,status=Rejected]
>>> Order returned=Order[customerId=cust2345,orderId=0,total=50000.0,status=Rejected]
>>> return values: retval1 retval2
>>> Order submitted=Order[customerId=cust3456,orderId=0,total=600.0,status=Created]
>>> OrderService.reviewOrder return=Order[customerId=cust3456,orderId=0,total=600.0,status=Approved]
>>> Order returned=Order[customerId=cust3456,orderId=0,total=600.0,status=Approved]
>>> Order submitted=Order[customerId=cust3456,orderId=0,total=600.0,status=Created]
>>> OrderService.reviewOrder return=Order[customerId=cust3456,orderId=0,total=600.0,status=Rejected]
>>> Order returned=Order[customerId=cust3456,orderId=0,total=600.0,status=Rejected]
>>> Order submitted=Order[customerId=cust3456,orderId=0,total=600.0,status=Created]
>>> Order returned=Order[customerId=null,orderId=0,total=0.0,status=Rejected]
>>> Order submitted=Order[customerId=cust3456,orderId=0,total=600.0,status=Created]
>>> Order returned=Order[customerId=null,orderId=0,total=0.0,status=Rejected]
>>> Order submitted=Order[customerId=cust1234,orderId=0,total=50.0,status=Created]
>>> Order returned=Order[customerId=cust1234,orderId=0,total=50.0,status=Approved]
>>> Order submitted=Order[customerId=cust1234,orderId=0,total=50.0,status=Created]
>>> Order returned=Order[customerId=cust1234,orderId=0,total=50.0,status=Approved]
>>> Order submitted=Order[customerId=cust1234,orderId=0,total=50.0,status=Created]
>>> Order submitted=Order[customerId=cust1234,orderId=0,total=50.0,status=Created]
>>> Order submitted=Order[customerId=cust2345,orderId=0,total=50000.0,status=Created]
>>> Order submitted=Order[customerId=cust2345,orderId=0,total=50000.0,status=Created]
>>> Order submitted=Order[customerId=cust1234,orderId=0,total=50.0,status=Created]
>>> OrderService.reviewOrder return=Order[customerId=cust1234,orderId=0,total=50.0,status=Approved]
Jul 8, 2013 1:58:43 AM org.apache.tuscany.sca.node.impl.NodeImpl stop
INFO: Stopping node: http://tuscany.apache.org/sca/1.1/nodes/default0
Jul 8, 2013 1:58:43 AM org.apache.tuscany.sca.core.assembly.impl.DomainRegistryImpl removeEndpoint
INFO: Remove endpoint - binding.sca - OrderServiceComponent/OrderService/sca
Jul 8, 2013 1:58:43 AM org.apache.tuscany.sca.core.assembly.impl.DomainRegistryImpl removeEndpoint
INFO: Remove endpoint - binding.ws - http://67.195.138.58:8080/OrderServiceComponent/OrderService
Jul 8, 2013 1:58:43 AM org.apache.tuscany.sca.http.jetty.JettyServer removeServletMapping
INFO: Removed Servlet mapping: /OrderServiceComponent/OrderService
Jul 8, 2013 1:58:43 AM org.apache.tuscany.sca.http.jetty.JettyLogger info
INFO: Stopped SelectChannelConnector@0.0.0.0:8080
Jul 8, 2013 1:58:43 AM org.apache.tuscany.sca.core.assembly.impl.DomainRegistryImpl removeEndpoint
INFO: Remove endpoint - binding.sca - OrderServiceForwardComponent/OrderService
Tests run: 21, Failures: 0, Errors: 0, Skipped: 0, Time elapsed: 2.796 sec
Running org.example.orderservice.OrderServiceBareTestCase
Jul 8, 2013 1:58:43 AM org.apache.tuscany.sca.node.impl.NodeImpl start
INFO: Starting node: http://tuscany.apache.org/sca/1.1/nodes/default0 domain: default
Jul 8, 2013 1:58:43 AM org.apache.tuscany.sca.node.impl.NodeFactoryImpl loadContributions
INFO: Loading contribution: <https://builds.apache.org/job/Tuscany-2x/ws/sca-2x/testing/itest/ws/holder-ws-service-multiple-outputs/target/classes/>
Jul 8, 2013 1:58:43 AM org.apache.tuscany.sca.http.jetty.JettyLogger info
INFO: jetty-6.1.26
Jul 8, 2013 1:58:43 AM org.apache.tuscany.sca.http.jetty.JettyLogger info
INFO: Started SelectChannelConnector@0.0.0.0:8080
Jul 8, 2013 1:58:43 AM org.apache.tuscany.sca.http.jetty.JettyServer addServletMapping
INFO: Added Servlet mapping: http://67.195.138.58:8080/OrderServiceBareComponent/OrderServiceBare
Jul 8, 2013 1:58:43 AM org.apache.tuscany.sca.core.assembly.impl.DomainRegistryImpl addEndpoint
INFO: Add endpoint - binding.ws - http://67.195.138.58:8080/OrderServiceBareComponent/OrderServiceBare
Jul 8, 2013 1:58:43 AM org.apache.tuscany.sca.http.jetty.JettyServer addServletMapping
INFO: Added Servlet mapping: http://67.195.138.58:8080/OrderServiceBareForwardComponent/OrderServiceBare
Jul 8, 2013 1:58:43 AM org.apache.tuscany.sca.core.assembly.impl.DomainRegistryImpl addEndpoint
INFO: Add endpoint - binding.ws - http://67.195.138.58:8080/OrderServiceBareForwardComponent/OrderServiceBare
Jul 8, 2013 1:58:43 AM org.apache.tuscany.sca.node.impl.NodeImpl stop
INFO: Stopping node: http://tuscany.apache.org/sca/1.1/nodes/default0
Jul 8, 2013 1:58:43 AM org.apache.tuscany.sca.core.assembly.impl.DomainRegistryImpl removeEndpoint
INFO: Remove endpoint - binding.ws - http://67.195.138.58:8080/OrderServiceBareComponent/OrderServiceBare
Jul 8, 2013 1:58:43 AM org.apache.tuscany.sca.http.jetty.JettyServer removeServletMapping
INFO: Removed Servlet mapping: /OrderServiceBareComponent/OrderServiceBare
Jul 8, 2013 1:58:43 AM org.apache.tuscany.sca.core.assembly.impl.DomainRegistryImpl removeEndpoint
INFO: Remove endpoint - binding.ws - http://67.195.138.58:8080/OrderServiceBareForwardComponent/OrderServiceBare
Jul 8, 2013 1:58:43 AM org.apache.tuscany.sca.http.jetty.JettyServer removeServletMapping
INFO: Removed Servlet mapping: /OrderServiceBareForwardComponent/OrderServiceBare
Jul 8, 2013 1:58:43 AM org.apache.tuscany.sca.http.jetty.JettyLogger info
INFO: Stopped SelectChannelConnector@0.0.0.0:8080
Tests run: 10, Failures: 0, Errors: 0, Skipped: 0, Time elapsed: 0.54 sec
Results :
Tests run: 31, Failures: 0, Errors: 0, Skipped: 0
[JENKINS] Recording test results
[INFO] [jar:jar {execution: default-jar}]
[INFO] Building jar: <https://builds.apache.org/job/Tuscany-2x/ws/sca-2x/testing/itest/ws/holder-ws-service-multiple-outputs/target/itest-holder-ws-service-multiple-outputs.jar>
[INFO] [install:install {execution: default-install}]
[INFO] Installing <https://builds.apache.org/job/Tuscany-2x/ws/sca-2x/testing/itest/ws/holder-ws-service-multiple-outputs/target/itest-holder-ws-service-multiple-outputs.jar> to <https://builds.apache.org/job/Tuscany-2x/ws/.repository/org/apache/tuscany/sca/itest-holder-ws-service-multiple-outputs/2.5-SNAPSHOT/itest-holder-ws-service-multiple-outputs-2.5-SNAPSHOT.jar>
[JENKINS] Archiving disabled
[INFO] ------------------------------------------------------------------------
[INFO] Building Apache Tuscany SCA iTest WS with WSPolicy
[INFO] task-segment: [clean, install]
[INFO] ------------------------------------------------------------------------
[INFO] [clean:clean {execution: default-clean}]
[INFO] [enforcer:enforce {execution: enforce-plugin-versions}]
[INFO] [remote-resources:process {execution: default}]
[INFO] [resources:resources {execution: default-resources}]
[INFO] Using 'UTF-8' encoding to copy filtered resources.
[INFO] Copying 6 resources
[INFO] Copying 1 resource
[INFO] Copying 3 resources
[INFO] [compiler:compile {execution: default-compile}]
[INFO] Compiling 4 source files to <https://builds.apache.org/job/Tuscany-2x/ws/sca-2x/testing/itest/ws/wspolicy/target/classes>
[INFO] -------------------------------------------------------------
[ERROR] COMPILATION ERROR :
[INFO] -------------------------------------------------------------
[ERROR] <https://builds.apache.org/job/Tuscany-2x/ws/sca-2x/testing/itest/ws/wspolicy/src/main/java/org/apache/tuscany/sca/binding/ws/axis2/helloworld/ServerPWCBHandler.java>:[27,29] package org.apache.ws.security does not exist
[ERROR] <https://builds.apache.org/job/Tuscany-2x/ws/sca-2x/testing/itest/ws/wspolicy/src/main/java/org/apache/tuscany/sca/binding/ws/axis2/helloworld/ServerPWCBHandler.java>:[38,12] cannot find symbol
symbol : class WSPasswordCallback
location: class org.apache.tuscany.sca.binding.ws.axis2.helloworld.ServerPWCBHandler
[ERROR] <https://builds.apache.org/job/Tuscany-2x/ws/sca-2x/testing/itest/ws/wspolicy/src/main/java/org/apache/tuscany/sca/binding/ws/axis2/helloworld/ServerPWCBHandler.java>:[38,39] cannot find symbol
symbol : class WSPasswordCallback
location: class org.apache.tuscany.sca.binding.ws.axis2.helloworld.ServerPWCBHandler
[ERROR] <https://builds.apache.org/job/Tuscany-2x/ws/sca-2x/testing/itest/ws/wspolicy/src/main/java/org/apache/tuscany/sca/binding/ws/axis2/helloworld/ServerPWCBHandler.java>:[42,36] cannot find symbol
symbol : variable WSPasswordCallback
location: class org.apache.tuscany.sca.binding.ws.axis2.helloworld.ServerPWCBHandler
[ERROR] <https://builds.apache.org/job/Tuscany-2x/ws/sca-2x/testing/itest/ws/wspolicy/src/main/java/org/apache/tuscany/sca/binding/ws/axis2/helloworld/ServerPWCBHandler.java>:[49,43] cannot find symbol
symbol : variable WSPasswordCallback
location: class org.apache.tuscany.sca.binding.ws.axis2.helloworld.ServerPWCBHandler
[INFO] 5 errors
[INFO] -------------------------------------------------------------
[JENKINS] Archiving disabled
[INFO] ------------------------------------------------------------------------
[ERROR] BUILD FAILURE
[INFO] ------------------------------------------------------------------------
[INFO] Compilation failure
<https://builds.apache.org/job/Tuscany-2x/ws/sca-2x/testing/itest/ws/wspolicy/src/main/java/org/apache/tuscany/sca/binding/ws/axis2/helloworld/ServerPWCBHandler.java>:[27,29] package org.apache.ws.security does not exist
<https://builds.apache.org/job/Tuscany-2x/ws/sca-2x/testing/itest/ws/wspolicy/src/main/java/org/apache/tuscany/sca/binding/ws/axis2/helloworld/ServerPWCBHandler.java>:[38,12] cannot find symbol
symbol : class WSPasswordCallback
location: class org.apache.tuscany.sca.binding.ws.axis2.helloworld.ServerPWCBHandler
<https://builds.apache.org/job/Tuscany-2x/ws/sca-2x/testing/itest/ws/wspolicy/src/main/java/org/apache/tuscany/sca/binding/ws/axis2/helloworld/ServerPWCBHandler.java>:[38,39] cannot find symbol
symbol : class WSPasswordCallback
location: class org.apache.tuscany.sca.binding.ws.axis2.helloworld.ServerPWCBHandler
<https://builds.apache.org/job/Tuscany-2x/ws/sca-2x/testing/itest/ws/wspolicy/src/main/java/org/apache/tuscany/sca/binding/ws/axis2/helloworld/ServerPWCBHandler.java>:[42,36] cannot find symbol
symbol : variable WSPasswordCallback
location: class org.apache.tuscany.sca.binding.ws.axis2.helloworld.ServerPWCBHandler
<https://builds.apache.org/job/Tuscany-2x/ws/sca-2x/testing/itest/ws/wspolicy/src/main/java/org/apache/tuscany/sca/binding/ws/axis2/helloworld/ServerPWCBHandler.java>:[49,43] cannot find symbol
symbol : variable WSPasswordCallback
location: class org.apache.tuscany.sca.binding.ws.axis2.helloworld.ServerPWCBHandler
[INFO] ------------------------------------------------------------------------
[INFO] For more information, run Maven with the -e switch
[INFO] ------------------------------------------------------------------------
[INFO] Total time: 32 minutes 34 seconds
[INFO] Finished at: Mon Jul 08 01:58:48 UTC 2013
[INFO] Final Memory: 730M/910M
[INFO] ------------------------------------------------------------------------
Maven failed with error.
Sending e-mails to: notification@tuscany.apache.org
channel stopped
2013-07-08 02:03:03.902:INFO::Shutdown hook executing
2013-07-08 02:03:03.902:INFO::Shutdown hook complete