You are viewing a plain text version of this content. The canonical link for it is here.
Posted to builds@beam.apache.org by Apache Jenkins Server <je...@builds.apache.org> on 2022/02/13 00:35:25 UTC
Build failed in Jenkins: beam_PostCommit_XVR_Direct #2293
See <https://ci-beam.apache.org/job/beam_PostCommit_XVR_Direct/2293/display/redirect>
Changes:
------------------------------------------
[...truncated 494.93 KB...]
mmh3==3.0.0
mock==2.0.0
more-itertools==8.12.0
mypy-extensions==0.4.3
nltk==3.6.7
nose==1.3.7
numpy==1.19.5
oauth2client==4.1.3
oauthlib==3.2.0
opt-einsum==3.3.0
orjson==3.6.1
overrides==6.1.0
packaging==21.3
pandas==1.1.5
parameterized==0.7.5
pbr==5.8.1
pip==21.2.4
pluggy==0.13.1
proto-plus==1.20.0
protobuf==3.19.4
psycopg2-binary==2.9.3
py==1.11.0
pyarrow==6.0.1
pyasn1==0.4.8
pyasn1-modules==0.2.8
pycparser==2.21
pydot==1.4.2
PyHamcrest==1.10.1
pymongo==3.12.3
PyMySQL==1.0.2
pyparsing==2.4.7
pytest==4.6.11
pytest-forked==1.4.0
pytest-timeout==1.4.2
pytest-xdist==1.34.0
python-dateutil==2.8.2
python-snappy==0.6.0
pytz==2021.3
PyYAML==6.0
regex==2022.1.18
requests==2.27.1
requests-mock==1.9.3
requests-oauthlib==1.3.1
rsa==4.8
scikit-learn==0.24.2
scipy==1.5.4
setuptools==57.5.0
six==1.15.0
soupsieve==2.3.1
SQLAlchemy==1.4.31
tenacity==5.1.5
tensorboard==2.6.0
tensorboard-data-server==0.6.1
tensorboard-plugin-wit==1.8.1
tensorflow==2.6.2
tensorflow-estimator==2.6.0
termcolor==1.1.0
testcontainers==3.4.2
threadpoolctl==3.1.0
tqdm==4.62.3
typing-extensions==3.7.4.3
typing-inspect==0.7.1
typing-utils==0.1.0
uritemplate==4.1.1
urllib3==1.26.8
wcwidth==0.2.5
websocket-client==1.2.3
Werkzeug==2.0.3
wheel==0.37.0
wrapt==1.12.1
zipp==3.6.0
Removing intermediate container 6b07018eba15
---> ce02417f1742
Step 16/31 : COPY target/LICENSE /opt/apache/beam/
---> 383cf5d85ae4
Step 17/31 : COPY target/LICENSE.python /opt/apache/beam/
---> b2351916d4d1
Step 18/31 : COPY target/NOTICE /opt/apache/beam/
---> b2dd4db4ffdf
Step 19/31 : COPY target/launcher/linux_amd64/boot /opt/apache/beam/
---> b4b2375c98f1
Step 20/31 : ENTRYPOINT ["/opt/apache/beam/boot"]
---> Running in 48cf65333417
Removing intermediate container 48cf65333417
---> fdefb8b41f01
Step 21/31 : FROM beam as third_party_licenses
---> fdefb8b41f01
Step 22/31 : ARG pull_licenses
---> Running in d61c4d84fb63
Removing intermediate container d61c4d84fb63
---> 1732c57a9be2
Step 23/31 : COPY target/license_scripts /tmp/license_scripts/
---> 030319dbac6c
Step 24/31 : COPY target/LICENSE target/go-licenses/* /opt/apache/beam/third_party_licenses/golang/
---> fb47ad64d5d5
Step 25/31 : RUN rm /opt/apache/beam/third_party_licenses/golang/LICENSE
---> Running in aac81c5653c2
Removing intermediate container aac81c5653c2
---> fbaac8e6aa43
Step 26/31 : COPY target/license_scripts /tmp/license_scripts/
---> 100bb5c20886
Step 27/31 : RUN if [ "$pull_licenses" = "true" ] ; then pip install 'pip-licenses<3.0.0' pyyaml tenacity && python /tmp/license_scripts/pull_licenses_py.py ; fi
---> Running in d912ffd37bd9
Collecting pip-licenses<3.0.0
Downloading pip_licenses-2.3.0-py3-none-any.whl (14 kB)
Requirement already satisfied: pyyaml in /usr/local/lib/python3.6/site-packages (6.0)
Requirement already satisfied: tenacity in /usr/local/lib/python3.6/site-packages (5.1.5)
Collecting PTable
Downloading PTable-0.9.2.tar.gz (31 kB)
Requirement already satisfied: six>=1.9.0 in /usr/local/lib/python3.6/site-packages (from tenacity) (1.15.0)
Building wheels for collected packages: PTable
Building wheel for PTable (setup.py): started
Building wheel for PTable (setup.py): finished with status 'done'
Created wheel for PTable: filename=PTable-0.9.2-py3-none-any.whl size=22924 sha256=ac4f587b0374e00c4b85a8e4742bb5f7dbb04ed545f6b683320d887aa1b02af1
Stored in directory: /root/.cache/pip/wheels/f3/65/67/71f473ec87ea4554d1bdfb1b5128cfe1414c2b113b72a1ee8e
Successfully built PTable
Installing collected packages: PTable, pip-licenses
Successfully installed PTable-0.9.2 pip-licenses-2.3.0
[91mWARNING: Running pip as the 'root' user can result in broken permissions and conflicting behaviour with the system package manager. It is recommended to use a virtual environment instead: https://pip.pypa.io/warnings/venv
[0m[91mWARNING: You are using pip version 21.2.4; however, version 21.3.1 is available.
You should consider upgrading via the '/usr/local/bin/python -m pip install --upgrade pip' command.
[0m[91mINFO:root:Successfully pulled licenses for 138 dependencies
[0mSkip pulling license for bs4
Removing intermediate container d912ffd37bd9
---> e57f2b4dee52
Step 28/31 : FROM beam
---> fdefb8b41f01
Step 29/31 : ARG pull_licenses
---> Running in 62208b71b081
Removing intermediate container 62208b71b081
---> 60d1d1c54f7a
Step 30/31 : COPY --from=third_party_licenses /opt/apache/beam/third_party_licenses /opt/apache/beam/third_party_licenses
---> e27fefc1aedf
Step 31/31 : RUN if [ "$pull_licenses" != "true" ] ; then rm -rf /opt/apache/beam/third_party_licenses ; fi
---> Running in 1def64ad5671
Removing intermediate container 1def64ad5671
---> a5c5c9493d82
Successfully built a5c5c9493d82
Successfully tagged apache/beam_python3.6_sdk:2.38.0.dev
> Task :sdks:python:test-suites:direct:xlang:validatesCrossLanguageRunnerSetup
> Task :sdks:python:test-suites:direct:xlang:validatesCrossLanguageRunnerGoUsingJava
Feb 13, 2022 12:15:20 AM org.apache.beam.sdk.expansion.service.ExpansionService loadRegisteredTransforms
INFO: Registering external transforms: [beam:transform:org.apache.beam:kafka_read_with_metadata:v1, beam:transform:org.apache.beam:kafka_read_without_metadata:v1, beam:transform:org.apache.beam:kafka_write:v1, beam:external:java:generate_sequence:v1]
Feb 13, 2022 12:15:20 AM org.apache.beam.sdk.expansion.service.ExpansionService loadRegisteredTransforms
INFO: Registering external transforms: [beam:transform:org.apache.beam:schemaio_jdbc_read:v1, beam:transform:org.apache.beam:schemaio_jdbc_write:v1, beam:transform:org.apache.beam:schemaio_avro_read:v1, beam:transform:org.apache.beam:schemaio_avro_write:v1, beam:external:java:generate_sequence:v1]
Feb 13, 2022 12:15:20 AM org.apache.beam.sdk.expansion.service.ExpansionService loadRegisteredTransforms
INFO: Registering external transforms: [beam:transform:org.apache.beam:debezium_read:v1, beam:external:java:generate_sequence:v1]
go1.16.12: already downloaded in /home/jenkins/sdk/go1.16.12
FAILURE: Build failed with an exception.
* What went wrong:
Execution failed for task ':sdks:go:container:docker'.
> Process 'command 'docker'' finished with non-zero exit value 143
* Try:
> Run with --stacktrace option to get the stack trace.
> Run with --info or --debug option to get more log output.
> Run with --scan to get full insights.
* Get more help at https://help.gradle.org
BUILD FAILED in 12s
The message received from the daemon indicates that the daemon has disappeared.
Build request sent: Build{id=e96a2596-eee2-4060-ba06-fe70330643e1, currentDir=<https://ci-beam.apache.org/job/beam_PostCommit_XVR_Direct/ws/src}>
Attempting to read last messages from the daemon log...
Daemon pid: 167959
log file: /home/jenkins/.gradle/daemon/7.3.2/daemon-167959.out.log
----- Last 20 lines from daemon log file - daemon-167959.out.log -----
go1.16.12: already downloaded in /home/jenkins/sdk/go1.16.12
GOCMD=/home/jenkins/go/bin/go1.16.12
/home/jenkins/go/bin/go1.16.12 build -o ./build/target/linux_amd64/boot boot.go
FAILURE: Build failed with an exception.
* What went wrong:
Execution failed for task ':sdks:go:container:docker'.
> Process 'command 'docker'' finished with non-zero exit value 143
* Try:
> Run with --stacktrace option to get the stack trace.
> Run with --info or --debug option to get more log output.
> Run with --scan to get full insights.
* Get more help at https://help.gradle.org
BUILD FAILED in 12s
16 actionable tasks: 5 executed, 11 up-to-date
Daemon vm is shutting down... The daemon has exited normally or was terminated in response to a user interrupt.
----- End of the daemon log -----
FAILURE: Build failed with an exception.
* What went wrong:
Gradle build daemon disappeared unexpectedly (it may have been killed or may have crashed)
* Try:
> Run with --stacktrace option to get the stack trace.
> Run with --info or --debug option to get more log output.
> Run with --scan to get full insights.
* Get more help at https://help.gradle.org
> Task :sdks:python:test-suites:direct:xlang:validatesCrossLanguageRunnerGoUsingJava FAILED
> Task :sdks:python:test-suites:direct:xlang:validatesCrossLanguageRunnerJavaUsingJava
> Task :sdks:python:test-suites:direct:xlang:validatesCrossLanguageRunnerJavaUsingPython
> Task :sdks:python:test-suites:direct:xlang:validatesCrossLanguageRunnerJavaUsingPythonOnly
> Task :sdks:python:test-suites:direct:xlang:validatesCrossLanguageRunnerPythonUsingJava
> Task :sdks:python:test-suites:direct:xlang:validatesCrossLanguageRunnerPythonUsingPython
> Task :sdks:python:test-suites:direct:xlang:validatesCrossLanguageRunnerPythonUsingSql
> Task :sdks:python:test-suites:direct:xlang:validatesCrossLanguageRunnerCleanup
> Task :sdks:python:test-suites:direct:xlang:fnApiJobServerCleanup
FAILURE: Build failed with an exception.
* Where:
Build file '<https://ci-beam.apache.org/job/beam_PostCommit_XVR_Direct/ws/src/sdks/go/test/build.gradle'> line: 176
* What went wrong:
Execution failed for task ':sdks:python:test-suites:direct:xlang:validatesCrossLanguageRunnerGoUsingJava'.
> Process 'command 'sh'' finished with non-zero exit value 1
* Try:
> Run with --stacktrace option to get the stack trace.
> Run with --info or --debug option to get more log output.
> Run with --scan to get full insights.
* Get more help at https://help.gradle.org
Deprecated Gradle features were used in this build, making it incompatible with Gradle 8.0.
You can use '--warning-mode all' to show the individual deprecation warnings and determine if they come from your own scripts or plugins.
See https://docs.gradle.org/7.3.2/userguide/command_line_interface.html#sec:command_line_warnings
Execution optimizations have been disabled for 1 invalid unit(s) of work during this build to ensure correctness.
Please consult deprecation warnings for more details.
BUILD FAILED in 32m 33s
233 actionable tasks: 157 executed, 65 from cache, 11 up-to-date
Publishing build scan...
https://gradle.com/s/hqsoqdtlsfdgm
Build step 'Invoke Gradle script' changed build result to FAILURE
Build step 'Invoke Gradle script' marked build as failure
---------------------------------------------------------------------
To unsubscribe, e-mail: builds-unsubscribe@beam.apache.org
For additional commands, e-mail: builds-help@beam.apache.org
Jenkins build is back to normal : beam_PostCommit_XVR_Direct #2294
Posted by Apache Jenkins Server <je...@builds.apache.org>.
See <https://ci-beam.apache.org/job/beam_PostCommit_XVR_Direct/2294/display/redirect>
---------------------------------------------------------------------
To unsubscribe, e-mail: builds-unsubscribe@beam.apache.org
For additional commands, e-mail: builds-help@beam.apache.org