You are viewing a plain text version of this content. The canonical link for it is here.
Posted to dev@zookeeper.apache.org by Apache Jenkins Server <je...@builds.apache.org> on 2014/06/19 14:05:19 UTC
ZooKeeper-trunk-jdk8 - Build # 49 - Failure
See https://builds.apache.org/job/ZooKeeper-trunk-jdk8/49/
###################################################################################
########################## LAST 60 LINES OF THE CONSOLE ###########################
[...truncated 286616 lines...]
[junit] 2014-06-19 12:04:55,036 [myid:] - INFO [main:ClientBase@443] - STARTING server
[junit] 2014-06-19 12:04:55,036 [myid:] - INFO [main:ClientBase@364] - CREATING server instance 127.0.0.1:11221
[junit] 2014-06-19 12:04:55,036 [myid:] - INFO [main:NIOServerCnxnFactory@670] - Configuring NIO connection handler with 10s sessionless connection timeout, 2 selector thread(s), 16 worker threads, and 64 kB direct buffers.
[junit] 2014-06-19 12:04:55,037 [myid:] - INFO [main:NIOServerCnxnFactory@683] - binding to port 0.0.0.0/0.0.0.0:11221
[junit] 2014-06-19 12:04:55,037 [myid:] - INFO [main:ClientBase@339] - STARTING server instance 127.0.0.1:11221
[junit] 2014-06-19 12:04:55,037 [myid:] - INFO [main:ZooKeeperServer@766] - minSessionTimeout set to 6000
[junit] 2014-06-19 12:04:55,037 [myid:] - INFO [main:ZooKeeperServer@775] - maxSessionTimeout set to 60000
[junit] 2014-06-19 12:04:55,037 [myid:] - INFO [main:ZooKeeperServer@149] - Created server with tickTime 3000 minSessionTimeout 6000 maxSessionTimeout 60000 datadir /home/jenkins/jenkins-slave/workspace/ZooKeeper-trunk-jdk8/trunk/build/test/tmp/test5995443325321415776.junit.dir/version-2 snapdir /home/jenkins/jenkins-slave/workspace/ZooKeeper-trunk-jdk8/trunk/build/test/tmp/test5995443325321415776.junit.dir/version-2
[junit] 2014-06-19 12:04:55,038 [myid:] - INFO [main:FileSnap@83] - Reading snapshot /home/jenkins/jenkins-slave/workspace/ZooKeeper-trunk-jdk8/trunk/build/test/tmp/test5995443325321415776.junit.dir/version-2/snapshot.b
[junit] 2014-06-19 12:04:55,039 [myid:] - INFO [main:FileTxnSnapLog@298] - Snapshotting: 0xb to /home/jenkins/jenkins-slave/workspace/ZooKeeper-trunk-jdk8/trunk/build/test/tmp/test5995443325321415776.junit.dir/version-2/snapshot.b
[junit] 2014-06-19 12:04:55,041 [myid:] - INFO [main:FourLetterWordMain@43] - connecting to 127.0.0.1 11221
[junit] 2014-06-19 12:04:55,044 [myid:] - INFO [NIOServerCxnFactory.AcceptThread:0.0.0.0/0.0.0.0:11221:NIOServerCnxnFactory$AcceptThread@296] - Accepted socket connection from /127.0.0.1:39459
[junit] 2014-06-19 12:04:55,045 [myid:] - INFO [NIOWorkerThread-1:NIOServerCnxn@835] - Processing stat command from /127.0.0.1:39459
[junit] 2014-06-19 12:04:55,045 [myid:] - INFO [NIOWorkerThread-1:NIOServerCnxn$StatCommand@684] - Stat command output
[junit] 2014-06-19 12:04:55,045 [myid:] - INFO [NIOWorkerThread-1:NIOServerCnxn@1006] - Closed socket connection for client /127.0.0.1:39459 (no session established for client)
[junit] 2014-06-19 12:04:55,045 [myid:] - INFO [main:JMXEnv@224] - ensureParent:[InMemoryDataTree, StandaloneServer_port]
[junit] 2014-06-19 12:04:55,046 [myid:] - INFO [main:JMXEnv@241] - expect:InMemoryDataTree
[junit] 2014-06-19 12:04:55,047 [myid:] - INFO [main:JMXEnv@245] - found:InMemoryDataTree org.apache.ZooKeeperService:name0=StandaloneServer_port-1,name1=InMemoryDataTree
[junit] 2014-06-19 12:04:55,047 [myid:] - INFO [main:JMXEnv@241] - expect:StandaloneServer_port
[junit] 2014-06-19 12:04:55,047 [myid:] - INFO [main:JMXEnv@245] - found:StandaloneServer_port org.apache.ZooKeeperService:name0=StandaloneServer_port-1
[junit] 2014-06-19 12:04:55,047 [myid:] - INFO [main:JUnit4ZKTestRunner$LoggedInvokeMethod@55] - Memory used 3009
[junit] 2014-06-19 12:04:55,047 [myid:] - INFO [main:JUnit4ZKTestRunner$LoggedInvokeMethod@60] - Number of threads 24
[junit] 2014-06-19 12:04:55,047 [myid:] - INFO [main:JUnit4ZKTestRunner$LoggedInvokeMethod@65] - FINISHED TEST METHOD testQuota
[junit] 2014-06-19 12:04:55,048 [myid:] - INFO [main:ClientBase@520] - tearDown starting
[junit] 2014-06-19 12:04:55,117 [myid:] - INFO [main:ZooKeeper@968] - Session: 0x146b403edd90000 closed
[junit] 2014-06-19 12:04:55,117 [myid:] - INFO [main-EventThread:ClientCnxn$EventThread@529] - EventThread shut down
[junit] 2014-06-19 12:04:55,117 [myid:] - INFO [main:ClientBase@490] - STOPPING server
[junit] 2014-06-19 12:04:55,118 [myid:] - INFO [ConnnectionExpirer:NIOServerCnxnFactory$ConnectionExpirerThread@583] - ConnnectionExpirerThread interrupted
[junit] 2014-06-19 12:04:55,118 [myid:] - INFO [NIOServerCxnFactory.SelectorThread-1:NIOServerCnxnFactory$SelectorThread@420] - selector thread exitted run method
[junit] 2014-06-19 12:04:55,118 [myid:] - INFO [NIOServerCxnFactory.AcceptThread:0.0.0.0/0.0.0.0:11221:NIOServerCnxnFactory$AcceptThread@219] - accept thread exitted run method
[junit] 2014-06-19 12:04:55,118 [myid:] - INFO [NIOServerCxnFactory.SelectorThread-0:NIOServerCnxnFactory$SelectorThread@420] - selector thread exitted run method
[junit] 2014-06-19 12:04:55,118 [myid:] - INFO [main:ZooKeeperServer@428] - shutting down
[junit] 2014-06-19 12:04:55,119 [myid:] - INFO [main:SessionTrackerImpl@184] - Shutting down
[junit] 2014-06-19 12:04:55,119 [myid:] - INFO [main:PrepRequestProcessor@981] - Shutting down
[junit] 2014-06-19 12:04:55,119 [myid:] - INFO [main:SyncRequestProcessor@191] - Shutting down
[junit] 2014-06-19 12:04:55,119 [myid:] - INFO [ProcessThread(sid:0 cport:-1)::PrepRequestProcessor@155] - PrepRequestProcessor exited loop!
[junit] 2014-06-19 12:04:55,119 [myid:] - INFO [SyncThread:0:SyncRequestProcessor@169] - SyncRequestProcessor exited!
[junit] 2014-06-19 12:04:55,119 [myid:] - INFO [main:FinalRequestProcessor@476] - shutdown of request processor complete
[junit] 2014-06-19 12:04:55,119 [myid:] - INFO [main:MBeanRegistry@119] - Unregister MBean [org.apache.ZooKeeperService:name0=StandaloneServer_port-1,name1=InMemoryDataTree]
[junit] 2014-06-19 12:04:55,120 [myid:] - INFO [main:MBeanRegistry@119] - Unregister MBean [org.apache.ZooKeeperService:name0=StandaloneServer_port-1]
[junit] 2014-06-19 12:04:55,120 [myid:] - INFO [main:FourLetterWordMain@43] - connecting to 127.0.0.1 11221
[junit] 2014-06-19 12:04:55,120 [myid:] - INFO [main:JMXEnv@142] - ensureOnly:[]
[junit] 2014-06-19 12:04:55,123 [myid:] - INFO [main:ClientBase@545] - fdcount after test is: 47 at start it was 31
[junit] 2014-06-19 12:04:55,123 [myid:] - INFO [main:ClientBase@547] - sleeping for 20 secs
[junit] 2014-06-19 12:04:55,124 [myid:] - INFO [main:ZKTestCase$1@61] - SUCCEEDED testQuota
[junit] 2014-06-19 12:04:55,125 [myid:] - INFO [main:ZKTestCase$1@56] - FINISHED testQuota
[junit] Tests run: 1, Failures: 0, Errors: 0, Time elapsed: 0.513 sec
BUILD FAILED
/home/jenkins/jenkins-slave/workspace/ZooKeeper-trunk-jdk8/trunk/build.xml:1337: Tests failed!
Total time: 32 minutes 59 seconds
Build step 'Execute shell' marked build as failure
[locks-and-latches] Releasing all the locks
[locks-and-latches] All the locks released
[WARNINGS] Skipping publisher since build result is FAILURE
Recording test results
Email was triggered for: Failure
Sending email for trigger: Failure
###################################################################################
############################## FAILED TESTS (if any) ##############################
2 tests failed.
REGRESSION: org.apache.zookeeper.test.ReconfigTest.testJMXBeanAfterRoleChange
Error Message:
Mismatches ElectionAddress! expected:<[127.0.0.1]:12232> but was:<[localhost]:12232>
Stack Trace:
junit.framework.AssertionFailedError: Mismatches ElectionAddress! expected:<[127.0.0.1]:12232> but was:<[localhost]:12232>
at org.apache.zookeeper.test.ReconfigTest.assertRemotePeerMXBeanAttributes(ReconfigTest.java:965)
at org.apache.zookeeper.test.ReconfigTest.testJMXBeanAfterRoleChange(ReconfigTest.java:885)
at org.apache.zookeeper.JUnit4ZKTestRunner$LoggedInvokeMethod.evaluate(JUnit4ZKTestRunner.java:52)
REGRESSION: org.apache.zookeeper.test.ReconfigTest.testJMXBeanAfterRemoveAddOne
Error Message:
Mismatches ElectionAddress! expected:<[127.0.0.1]:12369> but was:<[localhost]:12369>
Stack Trace:
junit.framework.AssertionFailedError: Mismatches ElectionAddress! expected:<[127.0.0.1]:12369> but was:<[localhost]:12369>
at org.apache.zookeeper.test.ReconfigTest.assertRemotePeerMXBeanAttributes(ReconfigTest.java:965)
at org.apache.zookeeper.test.ReconfigTest.testJMXBeanAfterRemoveAddOne(ReconfigTest.java:807)
at org.apache.zookeeper.JUnit4ZKTestRunner$LoggedInvokeMethod.evaluate(JUnit4ZKTestRunner.java:52)
ZooKeeper-trunk-jdk8 - Build # 51 - Still Failing
Posted by Apache Jenkins Server <je...@builds.apache.org>.
See https://builds.apache.org/job/ZooKeeper-trunk-jdk8/51/
###################################################################################
########################## LAST 60 LINES OF THE CONSOLE ###########################
[...truncated 288336 lines...]
[junit] 2014-06-21 12:16:51,280 [myid:] - INFO [main:ClientBase@443] - STARTING server
[junit] 2014-06-21 12:16:51,280 [myid:] - INFO [main:ClientBase@364] - CREATING server instance 127.0.0.1:11221
[junit] 2014-06-21 12:16:51,280 [myid:] - INFO [main:NIOServerCnxnFactory@670] - Configuring NIO connection handler with 10s sessionless connection timeout, 2 selector thread(s), 16 worker threads, and 64 kB direct buffers.
[junit] 2014-06-21 12:16:51,280 [myid:] - INFO [main:NIOServerCnxnFactory@683] - binding to port 0.0.0.0/0.0.0.0:11221
[junit] 2014-06-21 12:16:51,281 [myid:] - INFO [main:ClientBase@339] - STARTING server instance 127.0.0.1:11221
[junit] 2014-06-21 12:16:51,281 [myid:] - INFO [main:ZooKeeperServer@766] - minSessionTimeout set to 6000
[junit] 2014-06-21 12:16:51,281 [myid:] - INFO [main:ZooKeeperServer@775] - maxSessionTimeout set to 60000
[junit] 2014-06-21 12:16:51,281 [myid:] - INFO [main:ZooKeeperServer@149] - Created server with tickTime 3000 minSessionTimeout 6000 maxSessionTimeout 60000 datadir /home/jenkins/jenkins-slave/workspace/ZooKeeper-trunk-jdk8/trunk/build/test/tmp/test3931969238102539322.junit.dir/version-2 snapdir /home/jenkins/jenkins-slave/workspace/ZooKeeper-trunk-jdk8/trunk/build/test/tmp/test3931969238102539322.junit.dir/version-2
[junit] 2014-06-21 12:16:51,282 [myid:] - INFO [main:FileSnap@83] - Reading snapshot /home/jenkins/jenkins-slave/workspace/ZooKeeper-trunk-jdk8/trunk/build/test/tmp/test3931969238102539322.junit.dir/version-2/snapshot.b
[junit] 2014-06-21 12:16:51,283 [myid:] - INFO [main:FileTxnSnapLog@298] - Snapshotting: 0xb to /home/jenkins/jenkins-slave/workspace/ZooKeeper-trunk-jdk8/trunk/build/test/tmp/test3931969238102539322.junit.dir/version-2/snapshot.b
[junit] 2014-06-21 12:16:51,288 [myid:] - INFO [main:FourLetterWordMain@43] - connecting to 127.0.0.1 11221
[junit] 2014-06-21 12:16:51,289 [myid:] - INFO [NIOServerCxnFactory.AcceptThread:0.0.0.0/0.0.0.0:11221:NIOServerCnxnFactory$AcceptThread@296] - Accepted socket connection from /127.0.0.1:46597
[junit] 2014-06-21 12:16:51,289 [myid:] - INFO [NIOWorkerThread-1:NIOServerCnxn@835] - Processing stat command from /127.0.0.1:46597
[junit] 2014-06-21 12:16:51,290 [myid:] - INFO [NIOWorkerThread-1:NIOServerCnxn$StatCommand@684] - Stat command output
[junit] 2014-06-21 12:16:51,290 [myid:] - INFO [NIOWorkerThread-1:NIOServerCnxn@1006] - Closed socket connection for client /127.0.0.1:46597 (no session established for client)
[junit] 2014-06-21 12:16:51,290 [myid:] - INFO [main:JMXEnv@224] - ensureParent:[InMemoryDataTree, StandaloneServer_port]
[junit] 2014-06-21 12:16:51,291 [myid:] - INFO [main:JMXEnv@241] - expect:InMemoryDataTree
[junit] 2014-06-21 12:16:51,291 [myid:] - INFO [main:JMXEnv@245] - found:InMemoryDataTree org.apache.ZooKeeperService:name0=StandaloneServer_port-1,name1=InMemoryDataTree
[junit] 2014-06-21 12:16:51,292 [myid:] - INFO [main:JMXEnv@241] - expect:StandaloneServer_port
[junit] 2014-06-21 12:16:51,292 [myid:] - INFO [main:JMXEnv@245] - found:StandaloneServer_port org.apache.ZooKeeperService:name0=StandaloneServer_port-1
[junit] 2014-06-21 12:16:51,292 [myid:] - INFO [main:JUnit4ZKTestRunner$LoggedInvokeMethod@55] - Memory used 3183
[junit] 2014-06-21 12:16:51,292 [myid:] - INFO [main:JUnit4ZKTestRunner$LoggedInvokeMethod@60] - Number of threads 24
[junit] 2014-06-21 12:16:51,292 [myid:] - INFO [main:JUnit4ZKTestRunner$LoggedInvokeMethod@65] - FINISHED TEST METHOD testQuota
[junit] 2014-06-21 12:16:51,292 [myid:] - INFO [main:ClientBase@520] - tearDown starting
[junit] 2014-06-21 12:16:51,360 [myid:] - INFO [main:ZooKeeper@968] - Session: 0x146be5b93b00000 closed
[junit] 2014-06-21 12:16:51,360 [myid:] - INFO [main-EventThread:ClientCnxn$EventThread@529] - EventThread shut down
[junit] 2014-06-21 12:16:51,360 [myid:] - INFO [main:ClientBase@490] - STOPPING server
[junit] 2014-06-21 12:16:51,361 [myid:] - INFO [NIOServerCxnFactory.SelectorThread-0:NIOServerCnxnFactory$SelectorThread@420] - selector thread exitted run method
[junit] 2014-06-21 12:16:51,361 [myid:] - INFO [NIOServerCxnFactory.SelectorThread-1:NIOServerCnxnFactory$SelectorThread@420] - selector thread exitted run method
[junit] 2014-06-21 12:16:51,361 [myid:] - INFO [NIOServerCxnFactory.AcceptThread:0.0.0.0/0.0.0.0:11221:NIOServerCnxnFactory$AcceptThread@219] - accept thread exitted run method
[junit] 2014-06-21 12:16:51,361 [myid:] - INFO [ConnnectionExpirer:NIOServerCnxnFactory$ConnectionExpirerThread@583] - ConnnectionExpirerThread interrupted
[junit] 2014-06-21 12:16:51,361 [myid:] - INFO [main:ZooKeeperServer@428] - shutting down
[junit] 2014-06-21 12:16:51,361 [myid:] - INFO [main:SessionTrackerImpl@184] - Shutting down
[junit] 2014-06-21 12:16:51,362 [myid:] - INFO [main:PrepRequestProcessor@981] - Shutting down
[junit] 2014-06-21 12:16:51,362 [myid:] - INFO [main:SyncRequestProcessor@191] - Shutting down
[junit] 2014-06-21 12:16:51,362 [myid:] - INFO [ProcessThread(sid:0 cport:-1)::PrepRequestProcessor@155] - PrepRequestProcessor exited loop!
[junit] 2014-06-21 12:16:51,362 [myid:] - INFO [SyncThread:0:SyncRequestProcessor@169] - SyncRequestProcessor exited!
[junit] 2014-06-21 12:16:51,362 [myid:] - INFO [main:FinalRequestProcessor@476] - shutdown of request processor complete
[junit] 2014-06-21 12:16:51,362 [myid:] - INFO [main:MBeanRegistry@119] - Unregister MBean [org.apache.ZooKeeperService:name0=StandaloneServer_port-1,name1=InMemoryDataTree]
[junit] 2014-06-21 12:16:51,363 [myid:] - INFO [main:MBeanRegistry@119] - Unregister MBean [org.apache.ZooKeeperService:name0=StandaloneServer_port-1]
[junit] 2014-06-21 12:16:51,363 [myid:] - INFO [main:FourLetterWordMain@43] - connecting to 127.0.0.1 11221
[junit] 2014-06-21 12:16:51,363 [myid:] - INFO [main:JMXEnv@142] - ensureOnly:[]
[junit] 2014-06-21 12:16:51,366 [myid:] - INFO [main:ClientBase@545] - fdcount after test is: 47 at start it was 31
[junit] 2014-06-21 12:16:51,367 [myid:] - INFO [main:ClientBase@547] - sleeping for 20 secs
[junit] 2014-06-21 12:16:51,368 [myid:] - INFO [main:ZKTestCase$1@61] - SUCCEEDED testQuota
[junit] 2014-06-21 12:16:51,368 [myid:] - INFO [main:ZKTestCase$1@56] - FINISHED testQuota
[junit] Tests run: 1, Failures: 0, Errors: 0, Time elapsed: 0.536 sec
BUILD FAILED
/home/jenkins/jenkins-slave/workspace/ZooKeeper-trunk-jdk8/trunk/build.xml:1337: Tests failed!
Total time: 33 minutes 27 seconds
Build step 'Execute shell' marked build as failure
[locks-and-latches] Releasing all the locks
[locks-and-latches] All the locks released
[WARNINGS] Skipping publisher since build result is FAILURE
Recording test results
Email was triggered for: Failure
Sending email for trigger: Failure
###################################################################################
############################## FAILED TESTS (if any) ##############################
2 tests failed.
REGRESSION: org.apache.zookeeper.test.ReconfigTest.testJMXBeanAfterRoleChange
Error Message:
Mismatches ElectionAddress! expected:<[127.0.0.1]:12232> but was:<[localhost]:12232>
Stack Trace:
junit.framework.AssertionFailedError: Mismatches ElectionAddress! expected:<[127.0.0.1]:12232> but was:<[localhost]:12232>
at org.apache.zookeeper.test.ReconfigTest.assertRemotePeerMXBeanAttributes(ReconfigTest.java:965)
at org.apache.zookeeper.test.ReconfigTest.testJMXBeanAfterRoleChange(ReconfigTest.java:885)
at org.apache.zookeeper.JUnit4ZKTestRunner$LoggedInvokeMethod.evaluate(JUnit4ZKTestRunner.java:52)
FAILED: org.apache.zookeeper.server.quorum.StandaloneDisabledTest.startSingleServerTest
Error Message:
client could not connect to reestablished quorum: giving up after 30+ seconds.
Stack Trace:
junit.framework.AssertionFailedError: client could not connect to reestablished quorum: giving up after 30+ seconds.
at org.apache.zookeeper.test.ReconfigTest.testNormalOperation(ReconfigTest.java:157)
at org.apache.zookeeper.server.quorum.StandaloneDisabledTest.startSingleServerTest(StandaloneDisabledTest.java:75)
at org.apache.zookeeper.JUnit4ZKTestRunner$LoggedInvokeMethod.evaluate(JUnit4ZKTestRunner.java:52)
ZooKeeper-trunk-jdk8 - Build # 50 - Still Failing
Posted by Apache Jenkins Server <je...@builds.apache.org>.
See https://builds.apache.org/job/ZooKeeper-trunk-jdk8/50/
###################################################################################
########################## LAST 60 LINES OF THE CONSOLE ###########################
[...truncated 285932 lines...]
[junit] 2014-06-20 12:39:39,830 [myid:] - INFO [main:ClientBase@443] - STARTING server
[junit] 2014-06-20 12:39:39,830 [myid:] - INFO [main:ClientBase@364] - CREATING server instance 127.0.0.1:11221
[junit] 2014-06-20 12:39:39,831 [myid:] - INFO [main:NIOServerCnxnFactory@670] - Configuring NIO connection handler with 10s sessionless connection timeout, 2 selector thread(s), 16 worker threads, and 64 kB direct buffers.
[junit] 2014-06-20 12:39:39,831 [myid:] - INFO [main:NIOServerCnxnFactory@683] - binding to port 0.0.0.0/0.0.0.0:11221
[junit] 2014-06-20 12:39:39,831 [myid:] - INFO [main:ClientBase@339] - STARTING server instance 127.0.0.1:11221
[junit] 2014-06-20 12:39:39,831 [myid:] - INFO [main:ZooKeeperServer@766] - minSessionTimeout set to 6000
[junit] 2014-06-20 12:39:39,831 [myid:] - INFO [main:ZooKeeperServer@775] - maxSessionTimeout set to 60000
[junit] 2014-06-20 12:39:39,832 [myid:] - INFO [main:ZooKeeperServer@149] - Created server with tickTime 3000 minSessionTimeout 6000 maxSessionTimeout 60000 datadir /home/jenkins/jenkins-slave/workspace/ZooKeeper-trunk-jdk8/trunk/build/test/tmp/test2064738853826621343.junit.dir/version-2 snapdir /home/jenkins/jenkins-slave/workspace/ZooKeeper-trunk-jdk8/trunk/build/test/tmp/test2064738853826621343.junit.dir/version-2
[junit] 2014-06-20 12:39:39,832 [myid:] - INFO [main:FileSnap@83] - Reading snapshot /home/jenkins/jenkins-slave/workspace/ZooKeeper-trunk-jdk8/trunk/build/test/tmp/test2064738853826621343.junit.dir/version-2/snapshot.b
[junit] 2014-06-20 12:39:39,834 [myid:] - INFO [main:FileTxnSnapLog@298] - Snapshotting: 0xb to /home/jenkins/jenkins-slave/workspace/ZooKeeper-trunk-jdk8/trunk/build/test/tmp/test2064738853826621343.junit.dir/version-2/snapshot.b
[junit] 2014-06-20 12:39:39,835 [myid:] - INFO [main:FourLetterWordMain@43] - connecting to 127.0.0.1 11221
[junit] 2014-06-20 12:39:39,835 [myid:] - INFO [NIOServerCxnFactory.AcceptThread:0.0.0.0/0.0.0.0:11221:NIOServerCnxnFactory$AcceptThread@296] - Accepted socket connection from /127.0.0.1:38312
[junit] 2014-06-20 12:39:39,836 [myid:] - INFO [NIOWorkerThread-1:NIOServerCnxn@835] - Processing stat command from /127.0.0.1:38312
[junit] 2014-06-20 12:39:39,836 [myid:] - INFO [NIOWorkerThread-1:NIOServerCnxn$StatCommand@684] - Stat command output
[junit] 2014-06-20 12:39:39,836 [myid:] - INFO [NIOWorkerThread-1:NIOServerCnxn@1006] - Closed socket connection for client /127.0.0.1:38312 (no session established for client)
[junit] 2014-06-20 12:39:39,837 [myid:] - INFO [main:JMXEnv@224] - ensureParent:[InMemoryDataTree, StandaloneServer_port]
[junit] 2014-06-20 12:39:39,838 [myid:] - INFO [main:JMXEnv@241] - expect:InMemoryDataTree
[junit] 2014-06-20 12:39:39,838 [myid:] - INFO [main:JMXEnv@245] - found:InMemoryDataTree org.apache.ZooKeeperService:name0=StandaloneServer_port-1,name1=InMemoryDataTree
[junit] 2014-06-20 12:39:39,838 [myid:] - INFO [main:JMXEnv@241] - expect:StandaloneServer_port
[junit] 2014-06-20 12:39:39,838 [myid:] - INFO [main:JMXEnv@245] - found:StandaloneServer_port org.apache.ZooKeeperService:name0=StandaloneServer_port-1
[junit] 2014-06-20 12:39:39,838 [myid:] - INFO [main:JUnit4ZKTestRunner$LoggedInvokeMethod@55] - Memory used 3528
[junit] 2014-06-20 12:39:39,839 [myid:] - INFO [main:JUnit4ZKTestRunner$LoggedInvokeMethod@60] - Number of threads 24
[junit] 2014-06-20 12:39:39,839 [myid:] - INFO [main:JUnit4ZKTestRunner$LoggedInvokeMethod@65] - FINISHED TEST METHOD testQuota
[junit] 2014-06-20 12:39:39,839 [myid:] - INFO [main:ClientBase@520] - tearDown starting
[junit] 2014-06-20 12:39:39,909 [myid:] - INFO [main:ZooKeeper@968] - Session: 0x146b94a19920000 closed
[junit] 2014-06-20 12:39:39,909 [myid:] - INFO [main-EventThread:ClientCnxn$EventThread@529] - EventThread shut down
[junit] 2014-06-20 12:39:39,909 [myid:] - INFO [main:ClientBase@490] - STOPPING server
[junit] 2014-06-20 12:39:39,910 [myid:] - INFO [NIOServerCxnFactory.AcceptThread:0.0.0.0/0.0.0.0:11221:NIOServerCnxnFactory$AcceptThread@219] - accept thread exitted run method
[junit] 2014-06-20 12:39:39,910 [myid:] - INFO [ConnnectionExpirer:NIOServerCnxnFactory$ConnectionExpirerThread@583] - ConnnectionExpirerThread interrupted
[junit] 2014-06-20 12:39:39,910 [myid:] - INFO [NIOServerCxnFactory.SelectorThread-1:NIOServerCnxnFactory$SelectorThread@420] - selector thread exitted run method
[junit] 2014-06-20 12:39:39,910 [myid:] - INFO [NIOServerCxnFactory.SelectorThread-0:NIOServerCnxnFactory$SelectorThread@420] - selector thread exitted run method
[junit] 2014-06-20 12:39:39,910 [myid:] - INFO [main:ZooKeeperServer@428] - shutting down
[junit] 2014-06-20 12:39:39,910 [myid:] - INFO [main:SessionTrackerImpl@184] - Shutting down
[junit] 2014-06-20 12:39:39,910 [myid:] - INFO [main:PrepRequestProcessor@981] - Shutting down
[junit] 2014-06-20 12:39:39,910 [myid:] - INFO [main:SyncRequestProcessor@191] - Shutting down
[junit] 2014-06-20 12:39:39,910 [myid:] - INFO [ProcessThread(sid:0 cport:-1)::PrepRequestProcessor@155] - PrepRequestProcessor exited loop!
[junit] 2014-06-20 12:39:39,911 [myid:] - INFO [SyncThread:0:SyncRequestProcessor@169] - SyncRequestProcessor exited!
[junit] 2014-06-20 12:39:39,911 [myid:] - INFO [main:FinalRequestProcessor@476] - shutdown of request processor complete
[junit] 2014-06-20 12:39:39,911 [myid:] - INFO [main:MBeanRegistry@119] - Unregister MBean [org.apache.ZooKeeperService:name0=StandaloneServer_port-1,name1=InMemoryDataTree]
[junit] 2014-06-20 12:39:39,911 [myid:] - INFO [main:MBeanRegistry@119] - Unregister MBean [org.apache.ZooKeeperService:name0=StandaloneServer_port-1]
[junit] 2014-06-20 12:39:39,912 [myid:] - INFO [main:FourLetterWordMain@43] - connecting to 127.0.0.1 11221
[junit] 2014-06-20 12:39:39,912 [myid:] - INFO [main:JMXEnv@142] - ensureOnly:[]
[junit] 2014-06-20 12:39:39,915 [myid:] - INFO [main:ClientBase@545] - fdcount after test is: 47 at start it was 31
[junit] 2014-06-20 12:39:39,915 [myid:] - INFO [main:ClientBase@547] - sleeping for 20 secs
[junit] 2014-06-20 12:39:39,916 [myid:] - INFO [main:ZKTestCase$1@61] - SUCCEEDED testQuota
[junit] 2014-06-20 12:39:39,916 [myid:] - INFO [main:ZKTestCase$1@56] - FINISHED testQuota
[junit] Tests run: 1, Failures: 0, Errors: 0, Time elapsed: 0.511 sec
BUILD FAILED
/home/jenkins/jenkins-slave/workspace/ZooKeeper-trunk-jdk8/trunk/build.xml:1337: Tests failed!
Total time: 33 minutes 9 seconds
Build step 'Execute shell' marked build as failure
[locks-and-latches] Releasing all the locks
[locks-and-latches] All the locks released
[WARNINGS] Skipping publisher since build result is FAILURE
Recording test results
Email was triggered for: Failure
Sending email for trigger: Failure
###################################################################################
############################## FAILED TESTS (if any) ##############################
2 tests failed.
REGRESSION: org.apache.zookeeper.server.quorum.StandaloneDisabledTest.startSingleServerTest
Error Message:
client could not connect to reestablished quorum: giving up after 30+ seconds.
Stack Trace:
junit.framework.AssertionFailedError: client could not connect to reestablished quorum: giving up after 30+ seconds.
at org.apache.zookeeper.test.ReconfigTest.testNormalOperation(ReconfigTest.java:157)
at org.apache.zookeeper.server.quorum.StandaloneDisabledTest.startSingleServerTest(StandaloneDisabledTest.java:75)
at org.apache.zookeeper.JUnit4ZKTestRunner$LoggedInvokeMethod.evaluate(JUnit4ZKTestRunner.java:52)
FAILED: org.apache.zookeeper.test.ReconfigTest.testJMXBeanAfterRemoveAddOne
Error Message:
Mismatches ElectionAddress! expected:<[127.0.0.1]:12360> but was:<[localhost]:12360>
Stack Trace:
junit.framework.AssertionFailedError: Mismatches ElectionAddress! expected:<[127.0.0.1]:12360> but was:<[localhost]:12360>
at org.apache.zookeeper.test.ReconfigTest.assertRemotePeerMXBeanAttributes(ReconfigTest.java:965)
at org.apache.zookeeper.test.ReconfigTest.testJMXBeanAfterRemoveAddOne(ReconfigTest.java:807)
at org.apache.zookeeper.JUnit4ZKTestRunner$LoggedInvokeMethod.evaluate(JUnit4ZKTestRunner.java:52)