You are viewing a plain text version of this content. The canonical link for it is here.
Posted to builds@beam.apache.org by Apache Jenkins Server <je...@builds.apache.org> on 2022/02/25 06:06:33 UTC
Build failed in Jenkins: beam_PreCommit_Python_PVR_Flink_Cron #2041
See <https://ci-beam.apache.org/job/beam_PreCommit_Python_PVR_Flink_Cron/2041/display/redirect?page=changes>
Changes:
[noreply] [BEAM-13925] Add most of the supporting files for the pr management
------------------------------------------
Started by timer
Running as SYSTEM
[EnvInject] - Loading node environment variables.
Building remotely on apache-beam-jenkins-4 (beam) in workspace <https://ci-beam.apache.org/job/beam_PreCommit_Python_PVR_Flink_Cron/ws/>
The recommended git tool is: NONE
No credentials specified
Wiping out workspace first.
Cloning the remote Git repository
Cloning repository https://github.com/apache/beam.git
> git init <https://ci-beam.apache.org/job/beam_PreCommit_Python_PVR_Flink_Cron/ws/src> # timeout=10
Fetching upstream changes from https://github.com/apache/beam.git
> git --version # timeout=10
> git --version # 'git version 2.25.1'
> git fetch --tags --force --progress -- https://github.com/apache/beam.git +refs/heads/*:refs/remotes/origin/* # timeout=10
> git config remote.origin.url https://github.com/apache/beam.git # timeout=10
> git config --add remote.origin.fetch +refs/heads/*:refs/remotes/origin/* # timeout=10
> git config remote.origin.url https://github.com/apache/beam.git # timeout=10
Fetching upstream changes from https://github.com/apache/beam.git
> git fetch --tags --force --progress -- https://github.com/apache/beam.git +refs/heads/*:refs/remotes/origin/* +refs/pull/${ghprbPullId}/*:refs/remotes/origin/pr/${ghprbPullId}/* # timeout=10
> git rev-parse origin/master^{commit} # timeout=10
Checking out Revision 8fcb103a7fc246f24e1e4574e59ce4d5dd184d1d (origin/master)
> git config core.sparsecheckout # timeout=10
> git checkout -f 8fcb103a7fc246f24e1e4574e59ce4d5dd184d1d # timeout=10
Commit message: "[BEAM-13925] Add most of the supporting files for the pr management automation (#16898)"
> git rev-list --no-walk bf020ac1c620c0367244acc6161f228772559f70 # timeout=10
No emails were triggered.
[EnvInject] - Executing scripts and injecting environment variables after the SCM step.
[EnvInject] - Injecting as environment variables the properties content
SPARK_LOCAL_IP=127.0.0.1
SETUPTOOLS_USE_DISTUTILS=stdlib
[EnvInject] - Variables injected successfully.
[Gradle] - Launching build.
[src] $ <https://ci-beam.apache.org/job/beam_PreCommit_Python_PVR_Flink_Cron/ws/src/gradlew> --continue --max-workers=12 -Dorg.gradle.jvmargs=-Xms2g -Dorg.gradle.jvmargs=-Xmx4g -Dorg.gradle.vfs.watch=false -Pdocker-pull-licenses :sdks:python:test-suites:portable:flinkValidatesRunnerPrecommit
FAILURE: Build failed with an exception.
* What went wrong:
Timeout waiting to lock daemon addresses registry. It is currently in use by another Gradle instance.
Owner PID: unknown
Our PID: 2104750
Owner Operation: unknown
Our operation:
Lock file: /home/jenkins/.gradle/daemon/7.3.2/registry.bin.lock
* Try:
> Run with --stacktrace option to get the stack trace.
> Run with --info or --debug option to get more log output.
> Run with --scan to get full insights.
* Get more help at https://help.gradle.org
Build step 'Invoke Gradle script' changed build result to FAILURE
Build step 'Invoke Gradle script' marked build as failure
---------------------------------------------------------------------
To unsubscribe, e-mail: builds-unsubscribe@beam.apache.org
For additional commands, e-mail: builds-help@beam.apache.org
Jenkins build is back to normal : beam_PreCommit_Python_PVR_Flink_Cron #2044
Posted by Apache Jenkins Server <je...@builds.apache.org>.
See <https://ci-beam.apache.org/job/beam_PreCommit_Python_PVR_Flink_Cron/2044/display/redirect?page=changes>
---------------------------------------------------------------------
To unsubscribe, e-mail: builds-unsubscribe@beam.apache.org
For additional commands, e-mail: builds-help@beam.apache.org
Build failed in Jenkins: beam_PreCommit_Python_PVR_Flink_Cron #2043
Posted by Apache Jenkins Server <je...@builds.apache.org>.
See <https://ci-beam.apache.org/job/beam_PreCommit_Python_PVR_Flink_Cron/2043/display/redirect?page=changes>
Changes:
[noreply] Memoize some objects for timer processing to reduce overhead. (#16207)
[noreply] [BEAM-13965] Use TypeDeserializer if type information is available to
------------------------------------------
Started by timer
Running as SYSTEM
[EnvInject] - Loading node environment variables.
Building remotely on apache-beam-jenkins-4 (beam) in workspace <https://ci-beam.apache.org/job/beam_PreCommit_Python_PVR_Flink_Cron/ws/>
The recommended git tool is: NONE
No credentials specified
Wiping out workspace first.
Cloning the remote Git repository
Cloning repository https://github.com/apache/beam.git
> git init <https://ci-beam.apache.org/job/beam_PreCommit_Python_PVR_Flink_Cron/ws/src> # timeout=10
Fetching upstream changes from https://github.com/apache/beam.git
> git --version # timeout=10
> git --version # 'git version 2.25.1'
> git fetch --tags --force --progress -- https://github.com/apache/beam.git +refs/heads/*:refs/remotes/origin/* # timeout=10
> git config remote.origin.url https://github.com/apache/beam.git # timeout=10
> git config --add remote.origin.fetch +refs/heads/*:refs/remotes/origin/* # timeout=10
> git config remote.origin.url https://github.com/apache/beam.git # timeout=10
Fetching upstream changes from https://github.com/apache/beam.git
> git fetch --tags --force --progress -- https://github.com/apache/beam.git +refs/heads/*:refs/remotes/origin/* +refs/pull/${ghprbPullId}/*:refs/remotes/origin/pr/${ghprbPullId}/* # timeout=10
> git rev-parse origin/master^{commit} # timeout=10
Checking out Revision daabeba1e9958dea7a132c96f54754b2706e4601 (origin/master)
> git config core.sparsecheckout # timeout=10
> git checkout -f daabeba1e9958dea7a132c96f54754b2706e4601 # timeout=10
Commit message: "[BEAM-13965] Use TypeDeserializer if type information is available to support polymorphic types. (#16913)"
> git rev-list --no-walk 47ab260aaad6b1014d86dd6cf9274f1045690631 # timeout=10
No emails were triggered.
[EnvInject] - Executing scripts and injecting environment variables after the SCM step.
[EnvInject] - Injecting as environment variables the properties content
SPARK_LOCAL_IP=127.0.0.1
SETUPTOOLS_USE_DISTUTILS=stdlib
[EnvInject] - Variables injected successfully.
[Gradle] - Launching build.
[src] $ <https://ci-beam.apache.org/job/beam_PreCommit_Python_PVR_Flink_Cron/ws/src/gradlew> --continue --max-workers=12 -Dorg.gradle.jvmargs=-Xms2g -Dorg.gradle.jvmargs=-Xmx4g -Dorg.gradle.vfs.watch=false -Pdocker-pull-licenses :sdks:python:test-suites:portable:flinkValidatesRunnerPrecommit
FAILURE: Build failed with an exception.
* What went wrong:
Timeout waiting to lock daemon addresses registry. It is currently in use by another Gradle instance.
Owner PID: unknown
Our PID: 2125202
Owner Operation: unknown
Our operation:
Lock file: /home/jenkins/.gradle/daemon/7.3.2/registry.bin.lock
* Try:
> Run with --stacktrace option to get the stack trace.
> Run with --info or --debug option to get more log output.
> Run with --scan to get full insights.
* Get more help at https://help.gradle.org
Build step 'Invoke Gradle script' changed build result to FAILURE
Build step 'Invoke Gradle script' marked build as failure
---------------------------------------------------------------------
To unsubscribe, e-mail: builds-unsubscribe@beam.apache.org
For additional commands, e-mail: builds-help@beam.apache.org
Build failed in Jenkins: beam_PreCommit_Python_PVR_Flink_Cron #2042
Posted by Apache Jenkins Server <je...@builds.apache.org>.
See <https://ci-beam.apache.org/job/beam_PreCommit_Python_PVR_Flink_Cron/2042/display/redirect?page=changes>
Changes:
[noreply] Merge pull request #16846 from [BEAM-12164]: Add sad path tests for
------------------------------------------
Started by timer
Running as SYSTEM
[EnvInject] - Loading node environment variables.
Building remotely on apache-beam-jenkins-4 (beam) in workspace <https://ci-beam.apache.org/job/beam_PreCommit_Python_PVR_Flink_Cron/ws/>
The recommended git tool is: NONE
No credentials specified
Wiping out workspace first.
Cloning the remote Git repository
Cloning repository https://github.com/apache/beam.git
> git init <https://ci-beam.apache.org/job/beam_PreCommit_Python_PVR_Flink_Cron/ws/src> # timeout=10
Fetching upstream changes from https://github.com/apache/beam.git
> git --version # timeout=10
> git --version # 'git version 2.25.1'
> git fetch --tags --force --progress -- https://github.com/apache/beam.git +refs/heads/*:refs/remotes/origin/* # timeout=10
> git config remote.origin.url https://github.com/apache/beam.git # timeout=10
> git config --add remote.origin.fetch +refs/heads/*:refs/remotes/origin/* # timeout=10
> git config remote.origin.url https://github.com/apache/beam.git # timeout=10
Fetching upstream changes from https://github.com/apache/beam.git
> git fetch --tags --force --progress -- https://github.com/apache/beam.git +refs/heads/*:refs/remotes/origin/* +refs/pull/${ghprbPullId}/*:refs/remotes/origin/pr/${ghprbPullId}/* # timeout=10
> git rev-parse origin/master^{commit} # timeout=10
Checking out Revision 47ab260aaad6b1014d86dd6cf9274f1045690631 (origin/master)
> git config core.sparsecheckout # timeout=10
> git checkout -f 47ab260aaad6b1014d86dd6cf9274f1045690631 # timeout=10
Commit message: "Merge pull request #16846 from [BEAM-12164]: Add sad path tests for Cloud Spanner's ReadChangeStream"
> git rev-list --no-walk 8fcb103a7fc246f24e1e4574e59ce4d5dd184d1d # timeout=10
No emails were triggered.
[EnvInject] - Executing scripts and injecting environment variables after the SCM step.
[EnvInject] - Injecting as environment variables the properties content
SPARK_LOCAL_IP=127.0.0.1
SETUPTOOLS_USE_DISTUTILS=stdlib
[EnvInject] - Variables injected successfully.
[Gradle] - Launching build.
[src] $ <https://ci-beam.apache.org/job/beam_PreCommit_Python_PVR_Flink_Cron/ws/src/gradlew> --continue --max-workers=12 -Dorg.gradle.jvmargs=-Xms2g -Dorg.gradle.jvmargs=-Xmx4g -Dorg.gradle.vfs.watch=false -Pdocker-pull-licenses :sdks:python:test-suites:portable:flinkValidatesRunnerPrecommit
FAILURE: Build failed with an exception.
* What went wrong:
Timeout waiting to lock daemon addresses registry. It is currently in use by another Gradle instance.
Owner PID: unknown
Our PID: 2116406
Owner Operation: unknown
Our operation:
Lock file: /home/jenkins/.gradle/daemon/7.3.2/registry.bin.lock
* Try:
> Run with --stacktrace option to get the stack trace.
> Run with --info or --debug option to get more log output.
> Run with --scan to get full insights.
* Get more help at https://help.gradle.org
Build step 'Invoke Gradle script' changed build result to FAILURE
Build step 'Invoke Gradle script' marked build as failure
---------------------------------------------------------------------
To unsubscribe, e-mail: builds-unsubscribe@beam.apache.org
For additional commands, e-mail: builds-help@beam.apache.org