You are viewing a plain text version of this content. The canonical link for it is here.
Posted to commits@flex.apache.org by fl...@gmail.com on 2015/01/06 19:04:47 UTC
rc_flex-sdk_mustella - Build # 86 - Failure!
rc_flex-sdk_mustella - Build # 86 - Failure:
http://flex-mustella.cloudapp.net/job/rc_flex-sdk_mustella/86/
Changes for Build #86
No changes
--------------------------------
[...truncated 83315 lines...]
[java] getting directory from the swf file
[java] derived directory: C:\jenkins_slave\workspace\rc_flex-sdk_mustella\mustella\tests\gumbo\components\Image\swfs
[java] Launching:
[java] C:\ApacheFlex\dependencies\FlashPlayer_Debug\flashplayer_16_sa_debug.exe C:\jenkins_slave\workspace\rc_flex-sdk_mustella\mustella\tests\gumbo\components\Image\swfs\ImageMain.swf Launching: C:\ApacheFlex\dependencies\FlashPlayer_Debug\flashplayer_16_sa_debug.exe C:\jenkins_slave\workspace\rc_flex-sdk_mustella\mustella\tests\gumbo\components\Image\swfs\ImageMain.swf
[java] USING directory: C:\jenkins_slave\workspace\rc_flex-sdk_mustella\mustella\tests\gumbo\components\Image\swfs
[java] time: 13:03:44.366
[java] waited 2100
[java] ClobberProcess, it was already null
[java] Wrote file: c:/jenkins_slave/workspace/rc_flex-sdk_mustella/mustella/tests/gumbo/components/Image/swfs/../properties/baselines/Image_Scale_SDK-26600.png.bad.png length: 1515
[java] FAIL: gumbo/components/Image/properties/Image_properties_scale_align Image_Scale_SDK-26600
[java] Wrote file: c:/jenkins_slave/workspace/rc_flex-sdk_mustella/mustella/tests/gumbo/components/Image/swfs/../styles/baselines/Image_Scale_stretch_smoothingQuality.png.bad.png length: 10306
[java] FAIL: gumbo/components/Image/styles/Image_styles_smoothingQuality Image_Scale_stretch_smoothingQuality
[java] SCRIPTDONE! 13:03:49.336
[java] GET /ScriptComplete?0 HTTP/1.1
[java] Before Wait loop 13:03:49.336 waiting = 0
[java] After Wait loop 13:03:49.336 waiting = 0
[java] clobberProcess false
[java] Total Results so far: 7
[java] Grab log, do parse = false
[java] Grabbing the log from: C:\Users\ApacheFlex\AppData/Roaming\Macromedia/Flash Player/Logs/flashlog.txt to: C:\jenkins_slave\workspace\rc_flex-sdk_mustella\mustella\tests\gumbo\components\Image\swfs\ImageMain.log
[java] new test file: C:\jenkins_slave\workspace\rc_flex-sdk_mustella\mustella\tests\itemRenderers\Spark\List\SWFs\List_itemEditorTests_spark.swf
[java] ******** cmdArr before:
[java] C:\ApacheFlex\dependencies\FlashPlayer_Debug\flashplayer_16_sa_debug.exe
[java] C:\jenkins_slave\workspace\rc_flex-sdk_mustella\mustella\tests\itemRenderers\Spark\List\SWFs\List_itemEditorTests_spark.swf
[java] ******** moreParameters before:
[java] ******** cmdArr after:
[java] C:\ApacheFlex\dependencies\FlashPlayer_Debug\flashplayer_16_sa_debug.exe
[java] C:\jenkins_slave\workspace\rc_flex-sdk_mustella\mustella\tests\itemRenderers\Spark\List\SWFs\List_itemEditorTests_spark.swf
[java] getting directory from the swf file
[java] derived directory: C:\jenkins_slave\workspace\rc_flex-sdk_mustella\mustella\tests\itemRenderers\Spark\List\SWFs
[java] waited 2000
[java] ClobberProcess, it was already null
[java] Launching:
[java] C:\ApacheFlex\dependencies\FlashPlayer_Debug\flashplayer_16_sa_debug.exe C:\jenkins_slave\workspace\rc_flex-sdk_mustella\mustella\tests\itemRenderers\Spark\List\SWFs\List_itemEditorTests_spark.swf Launching: C:\ApacheFlex\dependencies\FlashPlayer_Debug\flashplayer_16_sa_debug.exe C:\jenkins_slave\workspace\rc_flex-sdk_mustella\mustella\tests\itemRenderers\Spark\List\SWFs\List_itemEditorTests_spark.swf
[java] USING directory: C:\jenkins_slave\workspace\rc_flex-sdk_mustella\mustella\tests\itemRenderers\Spark\List\SWFs
[java] time: 13:03:51.675
[java] SCRIPTDONE! 13:03:55.305
[java] GET /ScriptComplete?0 HTTP/1.1
[java] Before Wait loop 13:03:55.305 waiting = 0
[java] After Wait loop 13:03:55.305 waiting = 0
[java] clobberProcess false
[java] Total Results so far: 8
[java] waited 2000
[java] ClobberProcess, it was already null
[java] Grab log, do parse = false
[java] Grabbing the log from: C:\Users\ApacheFlex\AppData/Roaming\Macromedia/Flash Player/Logs/flashlog.txt to: C:\jenkins_slave\workspace\rc_flex-sdk_mustella\mustella\tests\itemRenderers\Spark\List\SWFs\List_itemEditorTests_spark.log
[java] new test file: C:\jenkins_slave\workspace\rc_flex-sdk_mustella\mustella\tests\itemRenderers\Spark\List\SWFs\List_itemRendererTests_spark.swf
[java] ******** cmdArr before:
[java] C:\ApacheFlex\dependencies\FlashPlayer_Debug\flashplayer_16_sa_debug.exe
[java] C:\jenkins_slave\workspace\rc_flex-sdk_mustella\mustella\tests\itemRenderers\Spark\List\SWFs\List_itemRendererTests_spark.swf
[java] ******** moreParameters before:
[java] ******** cmdArr after:
[java] C:\ApacheFlex\dependencies\FlashPlayer_Debug\flashplayer_16_sa_debug.exe
[java] C:\jenkins_slave\workspace\rc_flex-sdk_mustella\mustella\tests\itemRenderers\Spark\List\SWFs\List_itemRendererTests_spark.swf
[java] getting directory from the swf file
[java] derived directory: C:\jenkins_slave\workspace\rc_flex-sdk_mustella\mustella\tests\itemRenderers\Spark\List\SWFs
[java] Launching:
[java] C:\ApacheFlex\dependencies\FlashPlayer_Debug\flashplayer_16_sa_debug.exe C:\jenkins_slave\workspace\rc_flex-sdk_mustella\mustella\tests\itemRenderers\Spark\List\SWFs\List_itemRendererTests_spark.swf Launching: C:\ApacheFlex\dependencies\FlashPlayer_Debug\flashplayer_16_sa_debug.exe C:\jenkins_slave\workspace\rc_flex-sdk_mustella\mustella\tests\itemRenderers\Spark\List\SWFs\List_itemRendererTests_spark.swf
[java] USING directory: C:\jenkins_slave\workspace\rc_flex-sdk_mustella\mustella\tests\itemRenderers\Spark\List\SWFs
[java] time: 13:03:57.677
[java] SCRIPTDONE! 13:04:01.523
[java] GET /ScriptComplete?0 HTTP/1.1
[java] Before Wait loop 13:04:01.523 waiting = 0
[java] After Wait loop 13:04:01.523 waiting = 0
[java] clobberProcess false
[java] Total Results so far: 9
[java] Grab log, do parse = false
[java] Grabbing the log from: C:\Users\ApacheFlex\AppData/Roaming\Macromedia/Flash Player/Logs/flashlog.txt to: C:\jenkins_slave\workspace\rc_flex-sdk_mustella\mustella\tests\itemRenderers\Spark\List\SWFs\List_itemRendererTests_spark.log
[java] new test file: C:\jenkins_slave\workspace\rc_flex-sdk_mustella\mustella\tests\resources\ResourceManager\SWFs\ResourceManagerApp.swf
[java] ******** cmdArr before:
[java] C:\ApacheFlex\dependencies\FlashPlayer_Debug\flashplayer_16_sa_debug.exe
[java] C:\jenkins_slave\workspace\rc_flex-sdk_mustella\mustella\tests\resources\ResourceManager\SWFs\ResourceManagerApp.swf
[java] ******** moreParameters before:
[java] ******** cmdArr after:
[java] C:\ApacheFlex\dependencies\FlashPlayer_Debug\flashplayer_16_sa_debug.exe
[java] C:\jenkins_slave\workspace\rc_flex-sdk_mustella\mustella\tests\resources\ResourceManager\SWFs\ResourceManagerApp.swf
[java] getting directory from the swf file
[java] derived directory: C:\jenkins_slave\workspace\rc_flex-sdk_mustella\mustella\tests\resources\ResourceManager\SWFs
[java] Launching:
[java] C:\ApacheFlex\dependencies\FlashPlayer_Debug\flashplayer_16_sa_debug.exe C:\jenkins_slave\workspace\rc_flex-sdk_mustella\mustella\tests\resources\ResourceManager\SWFs\ResourceManagerApp.swf Launching: C:\ApacheFlex\dependencies\FlashPlayer_Debug\flashplayer_16_sa_debug.exe C:\jenkins_slave\workspace\rc_flex-sdk_mustella\mustella\tests\resources\ResourceManager\SWFs\ResourceManagerApp.swf
[java] USING directory: C:\jenkins_slave\workspace\rc_flex-sdk_mustella\mustella\tests\resources\ResourceManager\SWFs
[java] time: 13:04:03.787
[java] waited 2000
[java] ClobberProcess, it was already null
[java] SCRIPTDONE! 13:04:06.740
[java] GET /ScriptComplete?0 HTTP/1.1
[java] Before Wait loop 13:04:06.740 waiting = 0
[java] After Wait loop 13:04:06.740 waiting = 0
[java] clobberProcess false
[java] Total Results so far: 10
[java] Grab log, do parse = false
[java] Grabbing the log from: C:\Users\ApacheFlex\AppData/Roaming\Macromedia/Flash Player/Logs/flashlog.txt to: C:\jenkins_slave\workspace\rc_flex-sdk_mustella\mustella\tests\resources\ResourceManager\SWFs\ResourceManagerApp.log
[java] new test file: C:\jenkins_slave\workspace\rc_flex-sdk_mustella\mustella\tests\spark\core\fxg\swfs\fxgtemplate.swf
[java] ******** cmdArr before:
[java] C:\ApacheFlex\dependencies\FlashPlayer_Debug\flashplayer_16_sa_debug.exe
[java] C:\jenkins_slave\workspace\rc_flex-sdk_mustella\mustella\tests\spark\core\fxg\swfs\fxgtemplate.swf
[java] ******** moreParameters before:
[java] ******** cmdArr after:
[java] C:\ApacheFlex\dependencies\FlashPlayer_Debug\flashplayer_16_sa_debug.exe
[java] C:\jenkins_slave\workspace\rc_flex-sdk_mustella\mustella\tests\spark\core\fxg\swfs\fxgtemplate.swf
[java] getting directory from the swf file
[java] derived directory: C:\jenkins_slave\workspace\rc_flex-sdk_mustella\mustella\tests\spark\core\fxg\swfs
[java] Launching:
[java] C:\ApacheFlex\dependencies\FlashPlayer_Debug\flashplayer_16_sa_debug.exe C:\jenkins_slave\workspace\rc_flex-sdk_mustella\mustella\tests\spark\core\fxg\swfs\fxgtemplate.swf Launching: C:\ApacheFlex\dependencies\FlashPlayer_Debug\flashplayer_16_sa_debug.exe C:\jenkins_slave\workspace\rc_flex-sdk_mustella\mustella\tests\spark\core\fxg\swfs\fxgtemplate.swf
[java] USING directory: C:\jenkins_slave\workspace\rc_flex-sdk_mustella\mustella\tests\spark\core\fxg\swfs
[java] time: 13:04:09.074
[java] waited 2000
[java] ClobberProcess, it was already null
[java] Wrote file: c:/jenkins_slave/workspace/rc_flex-sdk_mustella/mustella/tests/spark/core/fxg/swfs/../properties/baselines/blendMode_colorBurn_onBitmapImage_dualOverlap.png.bad.png length: 12129
[java] FAIL: spark/core/fxg/properties/fxg_blendModes blendMode_colorBurn_onBitmapImage_dualOverlap
[java] Wrote file: c:/jenkins_slave/workspace/rc_flex-sdk_mustella/mustella/tests/spark/core/fxg/swfs/../properties/baselines/blendMode_luminosity_onBitmapImage_scaledAndRotated.png.bad.png length: 15622
[java] FAIL: spark/core/fxg/properties/fxg_blendModes blendMode_luminosity_onBitmapImage_scaledAndRotated
[java] Wrote file: c:/jenkins_slave/workspace/rc_flex-sdk_mustella/mustella/tests/spark/core/fxg/swfs/../properties/baselines/mask_mask_transform@win.png.bad.png length: 20692
[java] FAIL: spark/core/fxg/properties/fxgtemplate_masks mask_mask_transform
[java] Wrote file: c:/jenkins_slave/workspace/rc_flex-sdk_mustella/mustella/tests/spark/core/fxg/swfs/../properties/baselines/bitmapgraphics_bitmapgraphic_overlap_visibility2@win.png.bad.png length: 43831
[java] FAIL: spark/core/fxg/properties/fxgtemplate_tester bitmapgraphics_bitmapgraphic_overlap_visibility2
[java] Wrote file: c:/jenkins_slave/workspace/rc_flex-sdk_mustella/mustella/tests/spark/core/fxg/swfs/../properties/baselines/bitmapgraphics_bitmapgraphic_xform2@win.png.bad.png length: 62591
[java] FAIL: spark/core/fxg/properties/fxgtemplate_tester bitmapgraphics_bitmapgraphic_xform2
[java] Wrote file: c:/jenkins_slave/workspace/rc_flex-sdk_mustella/mustella/tests/spark/core/fxg/swfs/../properties/baselines/fill_bitmap_fill_bitmap_fill_path@win.png.bad.png length: 127298
[java] FAIL: spark/core/fxg/properties/fxgtemplate_tester fill_bitmap_fill_bitmap_fill_path
[java] Wrote file: c:/jenkins_slave/workspace/rc_flex-sdk_mustella/mustella/tests/spark/core/fxg/swfs/../properties/baselines/fill_bitmap_fill_bitmap_fill_shape_no_tiling@win.png.bad.png length: 7506
[java] FAIL: spark/core/fxg/properties/fxgtemplate_tester fill_bitmap_fill_bitmap_fill_shape_no_tiling
[java] Wrote file: c:/jenkins_slave/workspace/rc_flex-sdk_mustella/mustella/tests/spark/core/fxg/swfs/../properties/baselines/fill_bitmap_fill_bitmap_matrix_fill_path@win.png.bad.png length: 17545
[java] FAIL: spark/core/fxg/properties/fxgtemplate_tester fill_bitmap_fill_bitmap_matrix_fill_path
[java] Wrote file: c:/jenkins_slave/workspace/rc_flex-sdk_mustella/mustella/tests/spark/core/fxg/swfs/../properties/baselines/fill_bitmap_fill_bitmap_matrix_fill_path_no_tiling@win.png.bad.png length: 9390
[java] FAIL: spark/core/fxg/properties/fxgtemplate_tester fill_bitmap_fill_bitmap_matrix_fill_path_no_tiling
[java] Wrote file: c:/jenkins_slave/workspace/rc_flex-sdk_mustella/mustella/tests/spark/core/fxg/swfs/../properties/baselines/fill_bitmap_fill_bitmap_matrix_fill_shape@win.png.bad.png length: 256512
[java] FAIL: spark/core/fxg/properties/fxgtemplate_tester fill_bitmap_fill_bitmap_matrix_fill_shape
[java] Wrote file: c:/jenkins_slave/workspace/rc_flex-sdk_mustella/mustella/tests/spark/core/fxg/swfs/../properties/baselines/fill_bitmap_fill_bitmap_matrix_fill_shape_no_tiling@win.png.bad.png length: 51223
[java] FAIL: spark/core/fxg/properties/fxgtemplate_tester fill_bitmap_fill_bitmap_matrix_fill_shape_no_tiling
[java] Wrote file: c:/jenkins_slave/workspace/rc_flex-sdk_mustella/mustella/tests/spark/core/fxg/swfs/../properties/baselines/filters_bevelfilter4@win.png.bad.png length: 11193
[java] FAIL: spark/core/fxg/properties/fxgtemplate_tester filters_bevelfilter4
[java] Wrote file: c:/jenkins_slave/workspace/rc_flex-sdk_mustella/mustella/tests/spark/core/fxg/swfs/../properties/baselines/filters_dropshadowfilter@win.png.bad.png length: 54951
[java] FAIL: spark/core/fxg/properties/fxgtemplate_tester filters_dropshadowfilter
[java] Wrote file: c:/jenkins_slave/workspace/rc_flex-sdk_mustella/mustella/tests/spark/core/fxg/swfs/../properties/baselines/filters_glowfilter4@win.png.bad.png length: 9678
[java] FAIL: spark/core/fxg/properties/fxgtemplate_tester filters_glowfilter4
[java] Wrote file: c:/jenkins_slave/workspace/rc_flex-sdk_mustella/mustella/tests/spark/core/fxg/swfs/../properties/baselines/filters_gradientglowfilter4@win.png.bad.png length: 8643
[java] FAIL: spark/core/fxg/properties/fxgtemplate_tester filters_gradientglowfilter4
[java] Wrote file: c:/jenkins_slave/workspace/rc_flex-sdk_mustella/mustella/tests/spark/core/fxg/swfs/../properties/baselines/mask_mask_transform@win.png.bad.png length: 20692
[java] FAIL: spark/core/fxg/properties/fxgtemplate_tester mask_mask_transform
[java] SCRIPTDONE! 13:04:41.529
[java] GET /ScriptComplete?0 HTTP/1.1
[java] Before Wait loop 13:04:41.529 waiting = 0
[java] After Wait loop 13:04:41.529 waiting = 0
[java] clobberProcess false
[java] Total Results so far: 26
[java] waited 2000
[java] ClobberProcess, it was already null
[java] Grab log, do parse = false
[java] Grabbing the log from: C:\Users\ApacheFlex\AppData/Roaming\Macromedia/Flash Player/Logs/flashlog.txt to: C:\jenkins_slave\workspace\rc_flex-sdk_mustella\mustella\tests\spark\core\fxg\swfs\fxgtemplate.log
[java] at the end of main
[java] Shutting down the results server
[java] shutting down the baseline server
[java] done waiting for results...bye
[java] =====================================================
[java] Passes: 8
[java] Fails: 18
[java] =====================================================
[java]
[java] =====================================================
[java] =====================================================
[java] Passed:
[java] =====================================================
[java] MarshallPlan/ManagerTests/MP_NestedSWF_FocusManager_Tests NestedSWF_FocusManager_ShiftTab_fromLocalhost Passed
[java] containers/TitleWindow/Mirroring/TitleWindow_Mirroring_tester1 TitleWindow_layout_style1 Passed
[java] containers/TitleWindow/Mirroring/TitleWindow_Mirroring_tester1 TitleWindow_layout_style2 Passed
[java] gumbo/components/Application/properties/Application_Properties Application_Properties_skin_test7 Passed
[java] gumbo/components/Image/styles/Image_styles_smoothingQuality Image_Scale_stretch_smoothingQuality_high Passed
[java] itemRenderers/Spark/List/test_scripts/List_itemEditor_spark DateFieldItemEditor_Scrolling Passed
[java] itemRenderers/Spark/List/test_scripts/List_itemRenderer_spark DateFieldRenderer_Scrolling Passed
[java] resources/ResourceManager/Integration/ResourceManager_Integration_UIComponent_resourcesChanged ResourceManager_Integration_UIComponent_resourcesChanged_localeChain Passed
[java] =====================================================
[java] Failed:
[java] =====================================================
[java] gumbo/components/Image/properties/Image_properties_scale_align Image_Scale_SDK-26600 Failed CompareBitmap(body:step 8) compare returned[object BitmapData]
[java] gumbo/components/Image/styles/Image_styles_smoothingQuality Image_Scale_stretch_smoothingQuality Failed CompareBitmap(body:step 5) compare returned[object BitmapData]
[java] spark/core/fxg/properties/fxg_blendModes blendMode_colorBurn_onBitmapImage_dualOverlap Failed CompareBitmap(body:step 1) compare returned[object BitmapData]
[java] spark/core/fxg/properties/fxg_blendModes blendMode_luminosity_onBitmapImage_scaledAndRotated Failed CompareBitmap(body:step 1) compare returned[object BitmapData]
[java] spark/core/fxg/properties/fxgtemplate_masks mask_mask_transform Failed CompareBitmap(body:step 1) compare returned[object BitmapData]
[java] spark/core/fxg/properties/fxgtemplate_tester bitmapgraphics_bitmapgraphic_overlap_visibility2 Failed CompareBitmap(body:step 1) compare returned[object BitmapData]
[java] spark/core/fxg/properties/fxgtemplate_tester bitmapgraphics_bitmapgraphic_xform2 Failed CompareBitmap(body:step 1) compare returned[object BitmapData]
[java] spark/core/fxg/properties/fxgtemplate_tester fill_bitmap_fill_bitmap_fill_path Failed CompareBitmap(body:step 1) compare returned[object BitmapData]
[java] spark/core/fxg/properties/fxgtemplate_tester fill_bitmap_fill_bitmap_fill_shape_no_tiling Failed CompareBitmap(body:step 1) compare returned[object BitmapData]
[java] spark/core/fxg/properties/fxgtemplate_tester fill_bitmap_fill_bitmap_matrix_fill_path Failed CompareBitmap(body:step 1) compare returned[object BitmapData]
[java] spark/core/fxg/properties/fxgtemplate_tester fill_bitmap_fill_bitmap_matrix_fill_path_no_tiling Failed CompareBitmap(body:step 1) compare returned[object BitmapData]
[java] spark/core/fxg/properties/fxgtemplate_tester fill_bitmap_fill_bitmap_matrix_fill_shape Failed CompareBitmap(body:step 1) compare returned[object BitmapData]
[java] spark/core/fxg/properties/fxgtemplate_tester fill_bitmap_fill_bitmap_matrix_fill_shape_no_tiling Failed CompareBitmap(body:step 1) compare returned[object BitmapData]
[java] spark/core/fxg/properties/fxgtemplate_tester filters_bevelfilter4 Failed CompareBitmap(body:step 1) compare returned[object BitmapData]
[java] spark/core/fxg/properties/fxgtemplate_tester filters_dropshadowfilter Failed CompareBitmap(body:step 1) compare returned[object BitmapData]
[java] spark/core/fxg/properties/fxgtemplate_tester filters_glowfilter4 Failed CompareBitmap(body:step 1) compare returned[object BitmapData]
[java] spark/core/fxg/properties/fxgtemplate_tester filters_gradientglowfilter4 Failed CompareBitmap(body:step 1) compare returned[object BitmapData]
[java] spark/core/fxg/properties/fxgtemplate_tester mask_mask_transform Failed CompareBitmap(body:step 1) compare returned[object BitmapData]
[java]
[java]
[java] =====================================================
[java] Passes: 8
[java] Fails: 18
[java] =====================================================
[java]
[java]
[java] Wrote summary to results.txt
[java] Wrote failures to failures.txt
BUILD FAILED
C:\jenkins_slave\workspace\rc_flex-sdk_mustella\mustella\build.xml:1547: The following error occurred while executing this line:
C:\jenkins_slave\workspace\rc_flex-sdk_mustella\mustella\build.xml:1665: Java returned: 1
Total time: 3 minutes 11 seconds
============ JENKINS MUSTELLA RUN REPORT ============
Date/Time: 01-06-2015 18:04
Run duration: 0 days 8 hours 20 mins 57 seconds
Settings:
player.version = 16.0
air.version = 16
FLASHPLAYER_DEBUGGER = C:\ApacheFlex\dependencies\FlashPlayer_Debug\flashplayer_16_sa_debug.exe
AIR_HOME = C:\ApacheFlex\dependencies\AdobeAIRSDK\16
Build:
type = main
command = -timeout=60000
set = -all
Log:
- Made Cygwin ignore carriage returns
- Set FLASH_VERSION to '16.0' and AIR_VERSION to '16'
- Set AIR_HOME to 'C:\ApacheFlex\dependencies\AdobeAIRSDK\16'
- Set FLASHPLAYER_DEBUGGER to 'C:\ApacheFlex\dependencies\FlashPlayer_Debug\flashplayer_16_sa_debug.exe'
- Cleaned up 'local.properties' files from previous runs
- Created fresh 'local.properties' files with containing run specific values
- Ran 'clean', 'main' and 'other.locales' ant targets to prepare the SDK for testing
- Ran Mustella on the SDK with these parameters: '-timeout=60000 -all'
- Some tests failed: running '-failures'
- Some of tests failed, even after running '-failures'...
=====================================================
Build step 'Execute shell' marked build as failure
Archiving artifacts
Email was triggered for: Failure - Any
Sending email for trigger: Failure - Any
(sent from ext-email)
rc_flex-sdk_mustella - Build # 87 - Fixed!
Posted by fl...@gmail.com.
rc_flex-sdk_mustella - Build # 87 - Fixed:
http://flex-mustella.cloudapp.net/job/rc_flex-sdk_mustella/87/
Changes for Build #86
No changes
Changes for Build #87
No changes
--------------------------------
[...truncated 83062 lines...]
[java] exclude_filename: C:/jenkins_slave/workspace/rc_flex-sdk_mustella/mustella/tests/ExcludeListWin.txt
[java] os_version: ${os_version}
[java] target_os_name: windows
[java] device_name: ${device_name}
[java] result_include: -includes=SendResultsToRunner
[java] Choosing local runner bitmap save
[java] Choosing local runner bitmap save
[java] Choosing local runner bitmap save
[java] Choosing local runner bitmap save
[java] okey doke, going to compile C:\jenkins_slave\workspace\rc_flex-sdk_mustella\mustella\tests\gumbo\components\Application\SWFs\Application_Properties_App1.mxml
[java] okey doke, going to compile C:\jenkins_slave\workspace\rc_flex-sdk_mustella\mustella\tests\resources\ResourceManager\SWFs\ResourceManagerApp.mxml
[java] okey doke, going to compile C:\jenkins_slave\workspace\rc_flex-sdk_mustella\mustella\tests\containers\TitleWindow\SWFs\TitleWindow_Mirroring_Basic.mxml
[java] okey doke, going to compile C:\jenkins_slave\workspace\rc_flex-sdk_mustella\mustella\tests\itemRenderers\Spark\List\SWFs\List_itemRendererTests_spark.mxml
[java] Loading configuration file C:\jenkins_slave\workspace\rc_flex-sdk_mustella\frameworks\flex-config.xml
[java] Loading configuration file C:\jenkins_slave\workspace\rc_flex-sdk_mustella\frameworks\flex-config.xml
[java] Loading configuration file C:\jenkins_slave\workspace\rc_flex-sdk_mustella\frameworks\flex-config.xml
[java] Loading configuration file C:\jenkins_slave\workspace\rc_flex-sdk_mustella\frameworks\flex-config.xml
[java] C:\jenkins_slave\workspace\rc_flex-sdk_mustella\mustella\tests\resources\ResourceManager\SWFs\ResourceManagerApp.swf (763776 bytes)
[java] nothing left to do
[java] C:\jenkins_slave\workspace\rc_flex-sdk_mustella\mustella\tests\itemRenderers\Spark\List\SWFs\List_itemRendererTests_spark.swf (1413912 bytes)
[java] C:\jenkins_slave\workspace\rc_flex-sdk_mustella\mustella\tests\containers\TitleWindow\SWFs\TitleWindow_Mirroring_Basic.swf (1083435 bytes)
[java] C:\jenkins_slave\workspace\rc_flex-sdk_mustella\mustella\tests\gumbo\components\Application\SWFs\Application_Properties_App1.mxml(181): Warning: The CSS type selector 'spark.components.CheckBox' was not processed, because the type was not used in the application.
[java]
[java] s|CheckBox{
[java]
[java] C:\jenkins_slave\workspace\rc_flex-sdk_mustella\mustella\tests\gumbo\components\Application\SWFs\Application_Properties_App1.swf (1524292 bytes)
[java] All done with the compile
[java] leaving the compile, elapsed: 19
[java] ...via exit
[echo] compileswfs jreturn is 0
[loadfile] C:\jenkins_slave\workspace\rc_flex-sdk_mustella\mustella\local.properties doesn't exist
do_fail:
compileswfs:
getExcludes:
getExcludeIds:
populateExcludeTable:
[echo] populate exclude, got this for db time: 2015/01/06 23:11:26
justrun:
[loadfile] C:\jenkins_slave\workspace\rc_flex-sdk_mustella\mustella\local.properties doesn't exist
delete_cache:
[echo] delete cache: /Users/ApacheFlex/Library/Caches/Adobe/Flash Player/AssetCache
[loadfile] C:\jenkins_slave\workspace\rc_flex-sdk_mustella\mustella\local.properties doesn't exist
delete_cache:
[echo] delete cache: /Users/ApacheFlex/AppData/Roaming/Adobe/Flash Player/AssetCache
[delete] Deleting directory C:\Users\ApacheFlex\AppData\Roaming\Adobe\Flash Player\AssetCache\8NA39HCC
[delete] Deleting directory C:\Users\ApacheFlex\AppData\Roaming\Adobe\Flash Player\AssetCache
[loadfile] C:\jenkins_slave\workspace\rc_flex-sdk_mustella\mustella\local.properties doesn't exist
delete_cache:
[echo] delete cache: C:\Users\ApacheFlex/Application Data/Adobe/Flash Player/AssetCache
[loadfile] C:\jenkins_slave\workspace\rc_flex-sdk_mustella\mustella\local.properties doesn't exist
android_runner:
ios_runner:
qnx_runner:
desktop_runner:
[echo] **** Willkommen auf Runner ****
[java] starting results server
[java] starting baseline server
[java] test script count: 4
[java] new test file: C:\jenkins_slave\workspace\rc_flex-sdk_mustella\mustella\tests\containers\TitleWindow\SWFs\TitleWindow_Mirroring_Basic.swf
[java] starting the baseline server: Tue Jan 06 23:12:34 ACT 2015
[java] ******** cmdArr before:
[java] C:\ApacheFlex\dependencies\FlashPlayer_Debug\flashplayer11_1r102_55_win_sa_debug_32bit.exe
[java] C:\jenkins_slave\workspace\rc_flex-sdk_mustella\mustella\tests\containers\TitleWindow\SWFs\TitleWindow_Mirroring_Basic.swf
[java] ******** moreParameters before:
[java] ******** cmdArr after:
[java] C:\ApacheFlex\dependencies\FlashPlayer_Debug\flashplayer11_1r102_55_win_sa_debug_32bit.exe
[java] C:\jenkins_slave\workspace\rc_flex-sdk_mustella\mustella\tests\containers\TitleWindow\SWFs\TitleWindow_Mirroring_Basic.swf
[java] getting directory from the swf file
[java] derived directory: C:\jenkins_slave\workspace\rc_flex-sdk_mustella\mustella\tests\containers\TitleWindow\SWFs
[java] Launching:
[java] C:\ApacheFlex\dependencies\FlashPlayer_Debug\flashplayer11_1r102_55_win_sa_debug_32bit.exe C:\jenkins_slave\workspace\rc_flex-sdk_mustella\mustella\tests\containers\TitleWindow\SWFs\TitleWindow_Mirroring_Basic.swf Launching: C:\ApacheFlex\dependencies\FlashPlayer_Debug\flashplayer11_1r102_55_win_sa_debug_32bit.exe C:\jenkins_slave\workspace\rc_flex-sdk_mustella\mustella\tests\containers\TitleWindow\SWFs\TitleWindow_Mirroring_Basic.swf
[java] USING directory: C:\jenkins_slave\workspace\rc_flex-sdk_mustella\mustella\tests\containers\TitleWindow\SWFs
[java] time: 23:12:34.935
[java] SCRIPTDONE! 23:12:39.248
[java] GET /ScriptComplete?0 HTTP/1.1
[java] Before Wait loop 23:12:39.248 waiting = 0
[java] After Wait loop 23:12:39.248 waiting = 0
[java] clobberProcess false
[java] Total Results so far: 2
[java] Grab log, do parse = false
[java] Grabbing the log from: C:\Users\ApacheFlex\AppData/Roaming\Macromedia/Flash Player/Logs/flashlog.txt to: C:\jenkins_slave\workspace\rc_flex-sdk_mustella\mustella\tests\containers\TitleWindow\SWFs\TitleWindow_Mirroring_Basic.log
[java] new test file: C:\jenkins_slave\workspace\rc_flex-sdk_mustella\mustella\tests\gumbo\components\Application\SWFs\Application_Properties_App1.swf
[java] ******** cmdArr before:
[java] C:\ApacheFlex\dependencies\FlashPlayer_Debug\flashplayer11_1r102_55_win_sa_debug_32bit.exe
[java] C:\jenkins_slave\workspace\rc_flex-sdk_mustella\mustella\tests\gumbo\components\Application\SWFs\Application_Properties_App1.swf
[java] ******** moreParameters before:
[java] ******** cmdArr after:
[java] C:\ApacheFlex\dependencies\FlashPlayer_Debug\flashplayer11_1r102_55_win_sa_debug_32bit.exe
[java] C:\jenkins_slave\workspace\rc_flex-sdk_mustella\mustella\tests\gumbo\components\Application\SWFs\Application_Properties_App1.swf
[java] getting directory from the swf file
[java] derived directory: C:\jenkins_slave\workspace\rc_flex-sdk_mustella\mustella\tests\gumbo\components\Application\SWFs
[java] Launching:
[java] C:\ApacheFlex\dependencies\FlashPlayer_Debug\flashplayer11_1r102_55_win_sa_debug_32bit.exe C:\jenkins_slave\workspace\rc_flex-sdk_mustella\mustella\tests\gumbo\components\Application\SWFs\Application_Properties_App1.swf Launching: C:\ApacheFlex\dependencies\FlashPlayer_Debug\flashplayer11_1r102_55_win_sa_debug_32bit.exe C:\jenkins_slave\workspace\rc_flex-sdk_mustella\mustella\tests\gumbo\components\Application\SWFs\Application_Properties_App1.swf
[java] USING directory: C:\jenkins_slave\workspace\rc_flex-sdk_mustella\mustella\tests\gumbo\components\Application\SWFs
[java] time: 23:12:41.591
[java] waited 2000
[java] ClobberProcess, it was already null
[java] SCRIPTDONE! 23:12:45.073
[java] GET /ScriptComplete?0 HTTP/1.1
[java] Before Wait loop 23:12:45.073 waiting = 0
[java] After Wait loop 23:12:45.073 waiting = 0
[java] clobberProcess false
[java] Total Results so far: 3
[java] Grab log, do parse = false
[java] Grabbing the log from: C:\Users\ApacheFlex\AppData/Roaming\Macromedia/Flash Player/Logs/flashlog.txt to: C:\jenkins_slave\workspace\rc_flex-sdk_mustella\mustella\tests\gumbo\components\Application\SWFs\Application_Properties_App1.log
[java] new test file: C:\jenkins_slave\workspace\rc_flex-sdk_mustella\mustella\tests\itemRenderers\Spark\List\SWFs\List_itemRendererTests_spark.swf
[java] ******** cmdArr before:
[java] C:\ApacheFlex\dependencies\FlashPlayer_Debug\flashplayer11_1r102_55_win_sa_debug_32bit.exe
[java] C:\jenkins_slave\workspace\rc_flex-sdk_mustella\mustella\tests\itemRenderers\Spark\List\SWFs\List_itemRendererTests_spark.swf
[java] ******** moreParameters before:
[java] ******** cmdArr after:
[java] C:\ApacheFlex\dependencies\FlashPlayer_Debug\flashplayer11_1r102_55_win_sa_debug_32bit.exe
[java] C:\jenkins_slave\workspace\rc_flex-sdk_mustella\mustella\tests\itemRenderers\Spark\List\SWFs\List_itemRendererTests_spark.swf
[java] getting directory from the swf file
[java] derived directory: C:\jenkins_slave\workspace\rc_flex-sdk_mustella\mustella\tests\itemRenderers\Spark\List\SWFs
[java] Launching:
[java] C:\ApacheFlex\dependencies\FlashPlayer_Debug\flashplayer11_1r102_55_win_sa_debug_32bit.exe C:\jenkins_slave\workspace\rc_flex-sdk_mustella\mustella\tests\itemRenderers\Spark\List\SWFs\List_itemRendererTests_spark.swf Launching: C:\ApacheFlex\dependencies\FlashPlayer_Debug\flashplayer11_1r102_55_win_sa_debug_32bit.exe C:\jenkins_slave\workspace\rc_flex-sdk_mustella\mustella\tests\itemRenderers\Spark\List\SWFs\List_itemRendererTests_spark.swf
[java] USING directory: C:\jenkins_slave\workspace\rc_flex-sdk_mustella\mustella\tests\itemRenderers\Spark\List\SWFs
[java] time: 23:12:47.445
[java] waited 2100
[java] ClobberProcess, it was already null
[java] SCRIPTDONE! 23:12:51.349
[java] GET /ScriptComplete?0 HTTP/1.1
[java] Before Wait loop 23:12:51.349 waiting = 0
[java] After Wait loop 23:12:51.349 waiting = 0
[java] clobberProcess false
[java] Total Results so far: 4
[java] Grab log, do parse = false
[java] Grabbing the log from: C:\Users\ApacheFlex\AppData/Roaming\Macromedia/Flash Player/Logs/flashlog.txt to: C:\jenkins_slave\workspace\rc_flex-sdk_mustella\mustella\tests\itemRenderers\Spark\List\SWFs\List_itemRendererTests_spark.log
[java] new test file: C:\jenkins_slave\workspace\rc_flex-sdk_mustella\mustella\tests\resources\ResourceManager\SWFs\ResourceManagerApp.swf
[java] ******** cmdArr before:
[java] C:\ApacheFlex\dependencies\FlashPlayer_Debug\flashplayer11_1r102_55_win_sa_debug_32bit.exe
[java] C:\jenkins_slave\workspace\rc_flex-sdk_mustella\mustella\tests\resources\ResourceManager\SWFs\ResourceManagerApp.swf
[java] ******** moreParameters before:
[java] ******** cmdArr after:
[java] C:\ApacheFlex\dependencies\FlashPlayer_Debug\flashplayer11_1r102_55_win_sa_debug_32bit.exe
[java] C:\jenkins_slave\workspace\rc_flex-sdk_mustella\mustella\tests\resources\ResourceManager\SWFs\ResourceManagerApp.swf
[java] getting directory from the swf file
[java] derived directory: C:\jenkins_slave\workspace\rc_flex-sdk_mustella\mustella\tests\resources\ResourceManager\SWFs
[java] Launching:
[java] C:\ApacheFlex\dependencies\FlashPlayer_Debug\flashplayer11_1r102_55_win_sa_debug_32bit.exe C:\jenkins_slave\workspace\rc_flex-sdk_mustella\mustella\tests\resources\ResourceManager\SWFs\ResourceManagerApp.swf Launching: C:\ApacheFlex\dependencies\FlashPlayer_Debug\flashplayer11_1r102_55_win_sa_debug_32bit.exe C:\jenkins_slave\workspace\rc_flex-sdk_mustella\mustella\tests\resources\ResourceManager\SWFs\ResourceManagerApp.swf
[java] USING directory: C:\jenkins_slave\workspace\rc_flex-sdk_mustella\mustella\tests\resources\ResourceManager\SWFs
[java] time: 23:12:53.779
[java] waited 2100
[java] ClobberProcess, it was already null
[java] SCRIPTDONE! 23:12:56.781
[java] GET /ScriptComplete?0 HTTP/1.1
[java] Before Wait loop 23:12:56.781 waiting = 0
[java] After Wait loop 23:12:56.781 waiting = 0
[java] clobberProcess false
[java] Total Results so far: 5
[java] waited 2000
[java] ClobberProcess, it was already null
[java] Grab log, do parse = false
[java] Grabbing the log from: C:\Users\ApacheFlex\AppData/Roaming\Macromedia/Flash Player/Logs/flashlog.txt to: C:\jenkins_slave\workspace\rc_flex-sdk_mustella\mustella\tests\resources\ResourceManager\SWFs\ResourceManagerApp.log
[java] at the end of main
[java] Shutting down the results server
[java] shutting down the baseline server
[java] done waiting for results...bye
[java] =====================================================
[java] Passes: 5
[java] Fails: 0
[java] =====================================================
[java]
[java] =====================================================
[java] =====================================================
[java] Passed:
[java] =====================================================
[java] containers/TitleWindow/Mirroring/TitleWindow_Mirroring_tester1 TitleWindow_layout_style1 Passed
[java] containers/TitleWindow/Mirroring/TitleWindow_Mirroring_tester1 TitleWindow_layout_style2 Passed
[java] gumbo/components/Application/properties/Application_Properties Application_Properties_skin_test7 Passed
[java] itemRenderers/Spark/List/test_scripts/List_itemRenderer_spark DateFieldRenderer_Scrolling Passed
[java] resources/ResourceManager/Integration/ResourceManager_Integration_UIComponent_resourcesChanged ResourceManager_Integration_UIComponent_resourcesChanged_localeChain Passed
[java] =====================================================
[java] Failed:
[java] =====================================================
[java]
[java]
[java] =====================================================
[java] Passes: 5
[java] Fails: 0
[java] =====================================================
[java]
[java]
[java] Wrote summary to results.txt
[java] Wrote failures to failures.txt
call_runners:
run:
BUILD SUCCESSFUL
Total time: 1 minute 53 seconds
============ JENKINS MUSTELLA RUN REPORT ============
Date/Time: 01-07-2015 04:12
Run duration: 0 days 7 hours 58 mins 39 seconds
Settings:
player.version = 11.1
air.version = 3.7
FLASHPLAYER_DEBUGGER = C:\ApacheFlex\dependencies\FlashPlayer_Debug\flashplayer11_1r102_55_win_sa_debug_32bit.exe
AIR_HOME = C:\ApacheFlex\dependencies\AdobeAIRSDK\3.7
Build:
type = main
command = -timeout=60000
set = -all
Log:
- Made Cygwin ignore carriage returns
- Set FLASH_VERSION to '11.1' and AIR_VERSION to '3.7'
- Set AIR_HOME to 'C:\ApacheFlex\dependencies\AdobeAIRSDK\3.7'
- Set FLASHPLAYER_DEBUGGER to 'C:\ApacheFlex\dependencies\FlashPlayer_Debug\flashplayer11_1r102_55_win_sa_debug_32bit.exe'
- Cleaned up 'local.properties' files from previous runs
- Created fresh 'local.properties' files with containing run specific values
- Ran 'clean', 'main' and 'other.locales' ant targets to prepare the SDK for testing
- Ran Mustella on the SDK with these parameters: '-timeout=60000 -all'
- Some tests failed: running '-failures'
- All tests passed after running '-failures'
=====================================================
Archiving artifacts
WARN: No artifacts found that match the file pattern "mustella/tests/**/*.bad.png". Configuration error?
WARN: java.lang.InterruptedException: no matches found within 10000
Email was triggered for: Fixed
Trigger Success was overridden by another trigger and will not send an email.
Sending email for trigger: Fixed
(sent from ext-email)
Re: rc_flex-sdk_mustella - Build # 86 - Failure!
Posted by Erik de Bruin <er...@ixsoftware.nl>.
I've followed the above steps and committed the *.png.xml files.
>From what I see (and understand), all should be well... We'll see ;-)
EdB
On Wed, Jan 7, 2015 at 3:43 PM, Alex Harui <ah...@adobe.com> wrote:
>
>
> On 1/7/15, 12:16 AM, "Erik de Bruin" <er...@ixsoftware.nl> wrote:
>
>>OK, this makes it 'official': these tests only fail on FP 16!
>>
>>Given that nugget of info, can anyone suggest a 'solution'?
>
> Should be something like this:
>
> 1) See if any of the images are OS specific. If so, find one of those
> machines, otherwise you can use your machine. Set it up with an older
> player.
>
> 2) Get failures.txt from the failing workspace and put it in the mustella
> folder. Save a copy of failures.txt somewhere, then run ./mini_run.sh
> -failures -createImages
>
> 3) Run git status. Hopefully none of the .png files changed. If they
> did, then we have to find out why.
>
> 4) Commit the png.xml files for the images that failed.
>
> 5) Delete any other png.xml files. Restore failures.txt. Run
> ./mini_run.sh -failures. They should now pass.
>
> 6) Switch to the new player. They should now all pass as well.
>
> -Alex
>
--
Ix Multimedia Software
Jan Luykenstraat 27
3521 VB Utrecht
T. 06-51952295
I. www.ixsoftware.nl
Re: rc_flex-sdk_mustella - Build # 86 - Failure!
Posted by Alex Harui <ah...@adobe.com>.
On 1/7/15, 12:16 AM, "Erik de Bruin" <er...@ixsoftware.nl> wrote:
>OK, this makes it 'official': these tests only fail on FP 16!
>
>Given that nugget of info, can anyone suggest a 'solution'?
Should be something like this:
1) See if any of the images are OS specific. If so, find one of those
machines, otherwise you can use your machine. Set it up with an older
player.
2) Get failures.txt from the failing workspace and put it in the mustella
folder. Save a copy of failures.txt somewhere, then run ./mini_run.sh
-failures -createImages
3) Run git status. Hopefully none of the .png files changed. If they
did, then we have to find out why.
4) Commit the png.xml files for the images that failed.
5) Delete any other png.xml files. Restore failures.txt. Run
./mini_run.sh -failures. They should now pass.
6) Switch to the new player. They should now all pass as well.
-Alex
Re: rc_flex-sdk_mustella - Build # 86 - Failure!
Posted by Erik de Bruin <er...@ixsoftware.nl>.
OK, this makes it 'official': these tests only fail on FP 16!
Given that nugget of info, can anyone suggest a 'solution'?
EdB
On Tue, Jan 6, 2015 at 7:04 PM, <fl...@gmail.com> wrote:
> rc_flex-sdk_mustella - Build # 86 - Failure:
>
> http://flex-mustella.cloudapp.net/job/rc_flex-sdk_mustella/86/
>
> Changes for Build #86
> No changes
>
>
> --------------------------------
>
> [...truncated 83315 lines...]
> [java] getting directory from the swf file
> [java] derived directory: C:\jenkins_slave\workspace\rc_flex-sdk_mustella\mustella\tests\gumbo\components\Image\swfs
> [java] Launching:
> [java] C:\ApacheFlex\dependencies\FlashPlayer_Debug\flashplayer_16_sa_debug.exe C:\jenkins_slave\workspace\rc_flex-sdk_mustella\mustella\tests\gumbo\components\Image\swfs\ImageMain.swf Launching: C:\ApacheFlex\dependencies\FlashPlayer_Debug\flashplayer_16_sa_debug.exe C:\jenkins_slave\workspace\rc_flex-sdk_mustella\mustella\tests\gumbo\components\Image\swfs\ImageMain.swf
> [java] USING directory: C:\jenkins_slave\workspace\rc_flex-sdk_mustella\mustella\tests\gumbo\components\Image\swfs
> [java] time: 13:03:44.366
> [java] waited 2100
> [java] ClobberProcess, it was already null
> [java] Wrote file: c:/jenkins_slave/workspace/rc_flex-sdk_mustella/mustella/tests/gumbo/components/Image/swfs/../properties/baselines/Image_Scale_SDK-26600.png.bad.png length: 1515
> [java] FAIL: gumbo/components/Image/properties/Image_properties_scale_align Image_Scale_SDK-26600
> [java] Wrote file: c:/jenkins_slave/workspace/rc_flex-sdk_mustella/mustella/tests/gumbo/components/Image/swfs/../styles/baselines/Image_Scale_stretch_smoothingQuality.png.bad.png length: 10306
> [java] FAIL: gumbo/components/Image/styles/Image_styles_smoothingQuality Image_Scale_stretch_smoothingQuality
> [java] SCRIPTDONE! 13:03:49.336
> [java] GET /ScriptComplete?0 HTTP/1.1
> [java] Before Wait loop 13:03:49.336 waiting = 0
> [java] After Wait loop 13:03:49.336 waiting = 0
> [java] clobberProcess false
> [java] Total Results so far: 7
> [java] Grab log, do parse = false
> [java] Grabbing the log from: C:\Users\ApacheFlex\AppData/Roaming\Macromedia/Flash Player/Logs/flashlog.txt to: C:\jenkins_slave\workspace\rc_flex-sdk_mustella\mustella\tests\gumbo\components\Image\swfs\ImageMain.log
> [java] new test file: C:\jenkins_slave\workspace\rc_flex-sdk_mustella\mustella\tests\itemRenderers\Spark\List\SWFs\List_itemEditorTests_spark.swf
> [java] ******** cmdArr before:
> [java] C:\ApacheFlex\dependencies\FlashPlayer_Debug\flashplayer_16_sa_debug.exe
> [java] C:\jenkins_slave\workspace\rc_flex-sdk_mustella\mustella\tests\itemRenderers\Spark\List\SWFs\List_itemEditorTests_spark.swf
> [java] ******** moreParameters before:
> [java] ******** cmdArr after:
> [java] C:\ApacheFlex\dependencies\FlashPlayer_Debug\flashplayer_16_sa_debug.exe
> [java] C:\jenkins_slave\workspace\rc_flex-sdk_mustella\mustella\tests\itemRenderers\Spark\List\SWFs\List_itemEditorTests_spark.swf
> [java] getting directory from the swf file
> [java] derived directory: C:\jenkins_slave\workspace\rc_flex-sdk_mustella\mustella\tests\itemRenderers\Spark\List\SWFs
> [java] waited 2000
> [java] ClobberProcess, it was already null
> [java] Launching:
> [java] C:\ApacheFlex\dependencies\FlashPlayer_Debug\flashplayer_16_sa_debug.exe C:\jenkins_slave\workspace\rc_flex-sdk_mustella\mustella\tests\itemRenderers\Spark\List\SWFs\List_itemEditorTests_spark.swf Launching: C:\ApacheFlex\dependencies\FlashPlayer_Debug\flashplayer_16_sa_debug.exe C:\jenkins_slave\workspace\rc_flex-sdk_mustella\mustella\tests\itemRenderers\Spark\List\SWFs\List_itemEditorTests_spark.swf
> [java] USING directory: C:\jenkins_slave\workspace\rc_flex-sdk_mustella\mustella\tests\itemRenderers\Spark\List\SWFs
> [java] time: 13:03:51.675
> [java] SCRIPTDONE! 13:03:55.305
> [java] GET /ScriptComplete?0 HTTP/1.1
> [java] Before Wait loop 13:03:55.305 waiting = 0
> [java] After Wait loop 13:03:55.305 waiting = 0
> [java] clobberProcess false
> [java] Total Results so far: 8
> [java] waited 2000
> [java] ClobberProcess, it was already null
> [java] Grab log, do parse = false
> [java] Grabbing the log from: C:\Users\ApacheFlex\AppData/Roaming\Macromedia/Flash Player/Logs/flashlog.txt to: C:\jenkins_slave\workspace\rc_flex-sdk_mustella\mustella\tests\itemRenderers\Spark\List\SWFs\List_itemEditorTests_spark.log
> [java] new test file: C:\jenkins_slave\workspace\rc_flex-sdk_mustella\mustella\tests\itemRenderers\Spark\List\SWFs\List_itemRendererTests_spark.swf
> [java] ******** cmdArr before:
> [java] C:\ApacheFlex\dependencies\FlashPlayer_Debug\flashplayer_16_sa_debug.exe
> [java] C:\jenkins_slave\workspace\rc_flex-sdk_mustella\mustella\tests\itemRenderers\Spark\List\SWFs\List_itemRendererTests_spark.swf
> [java] ******** moreParameters before:
> [java] ******** cmdArr after:
> [java] C:\ApacheFlex\dependencies\FlashPlayer_Debug\flashplayer_16_sa_debug.exe
> [java] C:\jenkins_slave\workspace\rc_flex-sdk_mustella\mustella\tests\itemRenderers\Spark\List\SWFs\List_itemRendererTests_spark.swf
> [java] getting directory from the swf file
> [java] derived directory: C:\jenkins_slave\workspace\rc_flex-sdk_mustella\mustella\tests\itemRenderers\Spark\List\SWFs
> [java] Launching:
> [java] C:\ApacheFlex\dependencies\FlashPlayer_Debug\flashplayer_16_sa_debug.exe C:\jenkins_slave\workspace\rc_flex-sdk_mustella\mustella\tests\itemRenderers\Spark\List\SWFs\List_itemRendererTests_spark.swf Launching: C:\ApacheFlex\dependencies\FlashPlayer_Debug\flashplayer_16_sa_debug.exe C:\jenkins_slave\workspace\rc_flex-sdk_mustella\mustella\tests\itemRenderers\Spark\List\SWFs\List_itemRendererTests_spark.swf
> [java] USING directory: C:\jenkins_slave\workspace\rc_flex-sdk_mustella\mustella\tests\itemRenderers\Spark\List\SWFs
> [java] time: 13:03:57.677
> [java] SCRIPTDONE! 13:04:01.523
> [java] GET /ScriptComplete?0 HTTP/1.1
> [java] Before Wait loop 13:04:01.523 waiting = 0
> [java] After Wait loop 13:04:01.523 waiting = 0
> [java] clobberProcess false
> [java] Total Results so far: 9
> [java] Grab log, do parse = false
> [java] Grabbing the log from: C:\Users\ApacheFlex\AppData/Roaming\Macromedia/Flash Player/Logs/flashlog.txt to: C:\jenkins_slave\workspace\rc_flex-sdk_mustella\mustella\tests\itemRenderers\Spark\List\SWFs\List_itemRendererTests_spark.log
> [java] new test file: C:\jenkins_slave\workspace\rc_flex-sdk_mustella\mustella\tests\resources\ResourceManager\SWFs\ResourceManagerApp.swf
> [java] ******** cmdArr before:
> [java] C:\ApacheFlex\dependencies\FlashPlayer_Debug\flashplayer_16_sa_debug.exe
> [java] C:\jenkins_slave\workspace\rc_flex-sdk_mustella\mustella\tests\resources\ResourceManager\SWFs\ResourceManagerApp.swf
> [java] ******** moreParameters before:
> [java] ******** cmdArr after:
> [java] C:\ApacheFlex\dependencies\FlashPlayer_Debug\flashplayer_16_sa_debug.exe
> [java] C:\jenkins_slave\workspace\rc_flex-sdk_mustella\mustella\tests\resources\ResourceManager\SWFs\ResourceManagerApp.swf
> [java] getting directory from the swf file
> [java] derived directory: C:\jenkins_slave\workspace\rc_flex-sdk_mustella\mustella\tests\resources\ResourceManager\SWFs
> [java] Launching:
> [java] C:\ApacheFlex\dependencies\FlashPlayer_Debug\flashplayer_16_sa_debug.exe C:\jenkins_slave\workspace\rc_flex-sdk_mustella\mustella\tests\resources\ResourceManager\SWFs\ResourceManagerApp.swf Launching: C:\ApacheFlex\dependencies\FlashPlayer_Debug\flashplayer_16_sa_debug.exe C:\jenkins_slave\workspace\rc_flex-sdk_mustella\mustella\tests\resources\ResourceManager\SWFs\ResourceManagerApp.swf
> [java] USING directory: C:\jenkins_slave\workspace\rc_flex-sdk_mustella\mustella\tests\resources\ResourceManager\SWFs
> [java] time: 13:04:03.787
> [java] waited 2000
> [java] ClobberProcess, it was already null
> [java] SCRIPTDONE! 13:04:06.740
> [java] GET /ScriptComplete?0 HTTP/1.1
> [java] Before Wait loop 13:04:06.740 waiting = 0
> [java] After Wait loop 13:04:06.740 waiting = 0
> [java] clobberProcess false
> [java] Total Results so far: 10
> [java] Grab log, do parse = false
> [java] Grabbing the log from: C:\Users\ApacheFlex\AppData/Roaming\Macromedia/Flash Player/Logs/flashlog.txt to: C:\jenkins_slave\workspace\rc_flex-sdk_mustella\mustella\tests\resources\ResourceManager\SWFs\ResourceManagerApp.log
> [java] new test file: C:\jenkins_slave\workspace\rc_flex-sdk_mustella\mustella\tests\spark\core\fxg\swfs\fxgtemplate.swf
> [java] ******** cmdArr before:
> [java] C:\ApacheFlex\dependencies\FlashPlayer_Debug\flashplayer_16_sa_debug.exe
> [java] C:\jenkins_slave\workspace\rc_flex-sdk_mustella\mustella\tests\spark\core\fxg\swfs\fxgtemplate.swf
> [java] ******** moreParameters before:
> [java] ******** cmdArr after:
> [java] C:\ApacheFlex\dependencies\FlashPlayer_Debug\flashplayer_16_sa_debug.exe
> [java] C:\jenkins_slave\workspace\rc_flex-sdk_mustella\mustella\tests\spark\core\fxg\swfs\fxgtemplate.swf
> [java] getting directory from the swf file
> [java] derived directory: C:\jenkins_slave\workspace\rc_flex-sdk_mustella\mustella\tests\spark\core\fxg\swfs
> [java] Launching:
> [java] C:\ApacheFlex\dependencies\FlashPlayer_Debug\flashplayer_16_sa_debug.exe C:\jenkins_slave\workspace\rc_flex-sdk_mustella\mustella\tests\spark\core\fxg\swfs\fxgtemplate.swf Launching: C:\ApacheFlex\dependencies\FlashPlayer_Debug\flashplayer_16_sa_debug.exe C:\jenkins_slave\workspace\rc_flex-sdk_mustella\mustella\tests\spark\core\fxg\swfs\fxgtemplate.swf
> [java] USING directory: C:\jenkins_slave\workspace\rc_flex-sdk_mustella\mustella\tests\spark\core\fxg\swfs
> [java] time: 13:04:09.074
> [java] waited 2000
> [java] ClobberProcess, it was already null
> [java] Wrote file: c:/jenkins_slave/workspace/rc_flex-sdk_mustella/mustella/tests/spark/core/fxg/swfs/../properties/baselines/blendMode_colorBurn_onBitmapImage_dualOverlap.png.bad.png length: 12129
> [java] FAIL: spark/core/fxg/properties/fxg_blendModes blendMode_colorBurn_onBitmapImage_dualOverlap
> [java] Wrote file: c:/jenkins_slave/workspace/rc_flex-sdk_mustella/mustella/tests/spark/core/fxg/swfs/../properties/baselines/blendMode_luminosity_onBitmapImage_scaledAndRotated.png.bad.png length: 15622
> [java] FAIL: spark/core/fxg/properties/fxg_blendModes blendMode_luminosity_onBitmapImage_scaledAndRotated
> [java] Wrote file: c:/jenkins_slave/workspace/rc_flex-sdk_mustella/mustella/tests/spark/core/fxg/swfs/../properties/baselines/mask_mask_transform@win.png.bad.png length: 20692
> [java] FAIL: spark/core/fxg/properties/fxgtemplate_masks mask_mask_transform
> [java] Wrote file: c:/jenkins_slave/workspace/rc_flex-sdk_mustella/mustella/tests/spark/core/fxg/swfs/../properties/baselines/bitmapgraphics_bitmapgraphic_overlap_visibility2@win.png.bad.png length: 43831
> [java] FAIL: spark/core/fxg/properties/fxgtemplate_tester bitmapgraphics_bitmapgraphic_overlap_visibility2
> [java] Wrote file: c:/jenkins_slave/workspace/rc_flex-sdk_mustella/mustella/tests/spark/core/fxg/swfs/../properties/baselines/bitmapgraphics_bitmapgraphic_xform2@win.png.bad.png length: 62591
> [java] FAIL: spark/core/fxg/properties/fxgtemplate_tester bitmapgraphics_bitmapgraphic_xform2
> [java] Wrote file: c:/jenkins_slave/workspace/rc_flex-sdk_mustella/mustella/tests/spark/core/fxg/swfs/../properties/baselines/fill_bitmap_fill_bitmap_fill_path@win.png.bad.png length: 127298
> [java] FAIL: spark/core/fxg/properties/fxgtemplate_tester fill_bitmap_fill_bitmap_fill_path
> [java] Wrote file: c:/jenkins_slave/workspace/rc_flex-sdk_mustella/mustella/tests/spark/core/fxg/swfs/../properties/baselines/fill_bitmap_fill_bitmap_fill_shape_no_tiling@win.png.bad.png length: 7506
> [java] FAIL: spark/core/fxg/properties/fxgtemplate_tester fill_bitmap_fill_bitmap_fill_shape_no_tiling
> [java] Wrote file: c:/jenkins_slave/workspace/rc_flex-sdk_mustella/mustella/tests/spark/core/fxg/swfs/../properties/baselines/fill_bitmap_fill_bitmap_matrix_fill_path@win.png.bad.png length: 17545
> [java] FAIL: spark/core/fxg/properties/fxgtemplate_tester fill_bitmap_fill_bitmap_matrix_fill_path
> [java] Wrote file: c:/jenkins_slave/workspace/rc_flex-sdk_mustella/mustella/tests/spark/core/fxg/swfs/../properties/baselines/fill_bitmap_fill_bitmap_matrix_fill_path_no_tiling@win.png.bad.png length: 9390
> [java] FAIL: spark/core/fxg/properties/fxgtemplate_tester fill_bitmap_fill_bitmap_matrix_fill_path_no_tiling
> [java] Wrote file: c:/jenkins_slave/workspace/rc_flex-sdk_mustella/mustella/tests/spark/core/fxg/swfs/../properties/baselines/fill_bitmap_fill_bitmap_matrix_fill_shape@win.png.bad.png length: 256512
> [java] FAIL: spark/core/fxg/properties/fxgtemplate_tester fill_bitmap_fill_bitmap_matrix_fill_shape
> [java] Wrote file: c:/jenkins_slave/workspace/rc_flex-sdk_mustella/mustella/tests/spark/core/fxg/swfs/../properties/baselines/fill_bitmap_fill_bitmap_matrix_fill_shape_no_tiling@win.png.bad.png length: 51223
> [java] FAIL: spark/core/fxg/properties/fxgtemplate_tester fill_bitmap_fill_bitmap_matrix_fill_shape_no_tiling
> [java] Wrote file: c:/jenkins_slave/workspace/rc_flex-sdk_mustella/mustella/tests/spark/core/fxg/swfs/../properties/baselines/filters_bevelfilter4@win.png.bad.png length: 11193
> [java] FAIL: spark/core/fxg/properties/fxgtemplate_tester filters_bevelfilter4
> [java] Wrote file: c:/jenkins_slave/workspace/rc_flex-sdk_mustella/mustella/tests/spark/core/fxg/swfs/../properties/baselines/filters_dropshadowfilter@win.png.bad.png length: 54951
> [java] FAIL: spark/core/fxg/properties/fxgtemplate_tester filters_dropshadowfilter
> [java] Wrote file: c:/jenkins_slave/workspace/rc_flex-sdk_mustella/mustella/tests/spark/core/fxg/swfs/../properties/baselines/filters_glowfilter4@win.png.bad.png length: 9678
> [java] FAIL: spark/core/fxg/properties/fxgtemplate_tester filters_glowfilter4
> [java] Wrote file: c:/jenkins_slave/workspace/rc_flex-sdk_mustella/mustella/tests/spark/core/fxg/swfs/../properties/baselines/filters_gradientglowfilter4@win.png.bad.png length: 8643
> [java] FAIL: spark/core/fxg/properties/fxgtemplate_tester filters_gradientglowfilter4
> [java] Wrote file: c:/jenkins_slave/workspace/rc_flex-sdk_mustella/mustella/tests/spark/core/fxg/swfs/../properties/baselines/mask_mask_transform@win.png.bad.png length: 20692
> [java] FAIL: spark/core/fxg/properties/fxgtemplate_tester mask_mask_transform
> [java] SCRIPTDONE! 13:04:41.529
> [java] GET /ScriptComplete?0 HTTP/1.1
> [java] Before Wait loop 13:04:41.529 waiting = 0
> [java] After Wait loop 13:04:41.529 waiting = 0
> [java] clobberProcess false
> [java] Total Results so far: 26
> [java] waited 2000
> [java] ClobberProcess, it was already null
> [java] Grab log, do parse = false
> [java] Grabbing the log from: C:\Users\ApacheFlex\AppData/Roaming\Macromedia/Flash Player/Logs/flashlog.txt to: C:\jenkins_slave\workspace\rc_flex-sdk_mustella\mustella\tests\spark\core\fxg\swfs\fxgtemplate.log
> [java] at the end of main
> [java] Shutting down the results server
> [java] shutting down the baseline server
> [java] done waiting for results...bye
> [java] =====================================================
> [java] Passes: 8
> [java] Fails: 18
> [java] =====================================================
> [java]
> [java] =====================================================
> [java] =====================================================
> [java] Passed:
> [java] =====================================================
> [java] MarshallPlan/ManagerTests/MP_NestedSWF_FocusManager_Tests NestedSWF_FocusManager_ShiftTab_fromLocalhost Passed
> [java] containers/TitleWindow/Mirroring/TitleWindow_Mirroring_tester1 TitleWindow_layout_style1 Passed
> [java] containers/TitleWindow/Mirroring/TitleWindow_Mirroring_tester1 TitleWindow_layout_style2 Passed
> [java] gumbo/components/Application/properties/Application_Properties Application_Properties_skin_test7 Passed
> [java] gumbo/components/Image/styles/Image_styles_smoothingQuality Image_Scale_stretch_smoothingQuality_high Passed
> [java] itemRenderers/Spark/List/test_scripts/List_itemEditor_spark DateFieldItemEditor_Scrolling Passed
> [java] itemRenderers/Spark/List/test_scripts/List_itemRenderer_spark DateFieldRenderer_Scrolling Passed
> [java] resources/ResourceManager/Integration/ResourceManager_Integration_UIComponent_resourcesChanged ResourceManager_Integration_UIComponent_resourcesChanged_localeChain Passed
> [java] =====================================================
> [java] Failed:
> [java] =====================================================
> [java] gumbo/components/Image/properties/Image_properties_scale_align Image_Scale_SDK-26600 Failed CompareBitmap(body:step 8) compare returned[object BitmapData]
> [java] gumbo/components/Image/styles/Image_styles_smoothingQuality Image_Scale_stretch_smoothingQuality Failed CompareBitmap(body:step 5) compare returned[object BitmapData]
> [java] spark/core/fxg/properties/fxg_blendModes blendMode_colorBurn_onBitmapImage_dualOverlap Failed CompareBitmap(body:step 1) compare returned[object BitmapData]
> [java] spark/core/fxg/properties/fxg_blendModes blendMode_luminosity_onBitmapImage_scaledAndRotated Failed CompareBitmap(body:step 1) compare returned[object BitmapData]
> [java] spark/core/fxg/properties/fxgtemplate_masks mask_mask_transform Failed CompareBitmap(body:step 1) compare returned[object BitmapData]
> [java] spark/core/fxg/properties/fxgtemplate_tester bitmapgraphics_bitmapgraphic_overlap_visibility2 Failed CompareBitmap(body:step 1) compare returned[object BitmapData]
> [java] spark/core/fxg/properties/fxgtemplate_tester bitmapgraphics_bitmapgraphic_xform2 Failed CompareBitmap(body:step 1) compare returned[object BitmapData]
> [java] spark/core/fxg/properties/fxgtemplate_tester fill_bitmap_fill_bitmap_fill_path Failed CompareBitmap(body:step 1) compare returned[object BitmapData]
> [java] spark/core/fxg/properties/fxgtemplate_tester fill_bitmap_fill_bitmap_fill_shape_no_tiling Failed CompareBitmap(body:step 1) compare returned[object BitmapData]
> [java] spark/core/fxg/properties/fxgtemplate_tester fill_bitmap_fill_bitmap_matrix_fill_path Failed CompareBitmap(body:step 1) compare returned[object BitmapData]
> [java] spark/core/fxg/properties/fxgtemplate_tester fill_bitmap_fill_bitmap_matrix_fill_path_no_tiling Failed CompareBitmap(body:step 1) compare returned[object BitmapData]
> [java] spark/core/fxg/properties/fxgtemplate_tester fill_bitmap_fill_bitmap_matrix_fill_shape Failed CompareBitmap(body:step 1) compare returned[object BitmapData]
> [java] spark/core/fxg/properties/fxgtemplate_tester fill_bitmap_fill_bitmap_matrix_fill_shape_no_tiling Failed CompareBitmap(body:step 1) compare returned[object BitmapData]
> [java] spark/core/fxg/properties/fxgtemplate_tester filters_bevelfilter4 Failed CompareBitmap(body:step 1) compare returned[object BitmapData]
> [java] spark/core/fxg/properties/fxgtemplate_tester filters_dropshadowfilter Failed CompareBitmap(body:step 1) compare returned[object BitmapData]
> [java] spark/core/fxg/properties/fxgtemplate_tester filters_glowfilter4 Failed CompareBitmap(body:step 1) compare returned[object BitmapData]
> [java] spark/core/fxg/properties/fxgtemplate_tester filters_gradientglowfilter4 Failed CompareBitmap(body:step 1) compare returned[object BitmapData]
> [java] spark/core/fxg/properties/fxgtemplate_tester mask_mask_transform Failed CompareBitmap(body:step 1) compare returned[object BitmapData]
> [java]
> [java]
> [java] =====================================================
> [java] Passes: 8
> [java] Fails: 18
> [java] =====================================================
> [java]
> [java]
> [java] Wrote summary to results.txt
> [java] Wrote failures to failures.txt
>
> BUILD FAILED
> C:\jenkins_slave\workspace\rc_flex-sdk_mustella\mustella\build.xml:1547: The following error occurred while executing this line:
> C:\jenkins_slave\workspace\rc_flex-sdk_mustella\mustella\build.xml:1665: Java returned: 1
>
> Total time: 3 minutes 11 seconds
>
>
>
> ============ JENKINS MUSTELLA RUN REPORT ============
>
> Date/Time: 01-06-2015 18:04
>
> Run duration: 0 days 8 hours 20 mins 57 seconds
>
> Settings:
> player.version = 16.0
> air.version = 16
> FLASHPLAYER_DEBUGGER = C:\ApacheFlex\dependencies\FlashPlayer_Debug\flashplayer_16_sa_debug.exe
> AIR_HOME = C:\ApacheFlex\dependencies\AdobeAIRSDK\16
>
> Build:
> type = main
> command = -timeout=60000
> set = -all
>
> Log:
> - Made Cygwin ignore carriage returns
> - Set FLASH_VERSION to '16.0' and AIR_VERSION to '16'
> - Set AIR_HOME to 'C:\ApacheFlex\dependencies\AdobeAIRSDK\16'
> - Set FLASHPLAYER_DEBUGGER to 'C:\ApacheFlex\dependencies\FlashPlayer_Debug\flashplayer_16_sa_debug.exe'
> - Cleaned up 'local.properties' files from previous runs
> - Created fresh 'local.properties' files with containing run specific values
> - Ran 'clean', 'main' and 'other.locales' ant targets to prepare the SDK for testing
> - Ran Mustella on the SDK with these parameters: '-timeout=60000 -all'
> - Some tests failed: running '-failures'
> - Some of tests failed, even after running '-failures'...
>
>
> =====================================================
>
>
>
> Build step 'Execute shell' marked build as failure
> Archiving artifacts
> Email was triggered for: Failure - Any
> Sending email for trigger: Failure - Any
>
>
> (sent from ext-email)
--
Ix Multimedia Software
Jan Luykenstraat 27
3521 VB Utrecht
T. 06-51952295
I. www.ixsoftware.nl