You are viewing a plain text version of this content. The canonical link for it is here.
Posted to builds@beam.apache.org by Apache Jenkins Server <je...@builds.apache.org> on 2023/03/22 23:36:15 UTC
Build failed in Jenkins: beam_PostCommit_XVR_Flink #6645
See <https://ci-beam.apache.org/job/beam_PostCommit_XVR_Flink/6645/display/redirect>
Changes:
------------------------------------------
[...truncated 2.66 MB...]
return StockUnpickler.find_class(self, module, name)
ModuleNotFoundError: No module named 'dill'
During handling of the above exception, another exception occurred:
Traceback (most recent call last):
File "/usr/local/lib/python3.10/site-packages/apache_beam/runners/worker/sdk_worker.py", line 295, in _execute
response = task()
File "/usr/local/lib/python3.10/site-packages/apache_beam/runners/worker/sdk_worker.py", line 370, in <lambda>
lambda: self.create_worker().do_instruction(request), request)
File "/usr/local/lib/python3.10/site-packages/apache_beam/runners/worker/sdk_worker.py", line 629, in do_instruction
return getattr(self, request_type)(
File "/usr/local/lib/python3.10/site-packages/apache_beam/runners/worker/sdk_worker.py", line 660, in process_bundle
bundle_processor = self.bundle_processor_cache.get(
File "/usr/local/lib/python3.10/site-packages/apache_beam/runners/worker/sdk_worker.py", line 491, in get
processor = bundle_processor.BundleProcessor(
File "/usr/local/lib/python3.10/site-packages/apache_beam/runners/worker/bundle_processor.py", line 904, in __init__
self.ops = self.create_execution_tree(self.process_bundle_descriptor)
File "/usr/local/lib/python3.10/site-packages/apache_beam/runners/worker/bundle_processor.py", line 983, in create_execution_tree
return collections.OrderedDict([(
File "/usr/local/lib/python3.10/site-packages/apache_beam/runners/worker/bundle_processor.py", line 986, in <listcomp>
get_operation(transform_id))) for transform_id in sorted(
File "/usr/local/lib/python3.10/site-packages/apache_beam/runners/worker/bundle_processor.py", line 819, in wrapper
result = cache[args] = func(*args)
File "/usr/local/lib/python3.10/site-packages/apache_beam/runners/worker/bundle_processor.py", line 965, in get_operation
transform_consumers = {
File "/usr/local/lib/python3.10/site-packages/apache_beam/runners/worker/bundle_processor.py", line 966, in <dictcomp>
tag: [get_operation(op) for op in pcoll_consumers[pcoll_id]]
File "/usr/local/lib/python3.10/site-packages/apache_beam/runners/worker/bundle_processor.py", line 966, in <listcomp>
tag: [get_operation(op) for op in pcoll_consumers[pcoll_id]]
File "/usr/local/lib/python3.10/site-packages/apache_beam/runners/worker/bundle_processor.py", line 819, in wrapper
result = cache[args] = func(*args)
File "/usr/local/lib/python3.10/site-packages/apache_beam/runners/worker/bundle_processor.py", line 970, in get_operation
return transform_factory.create_operation(
File "/usr/local/lib/python3.10/site-packages/apache_beam/runners/worker/bundle_processor.py", line 1267, in create_operation
return creator(self, transform_id, transform_proto, payload, consumers)
File "/usr/local/lib/python3.10/site-packages/apache_beam/runners/worker/bundle_processor.py", line 1614, in create_par_do
return _create_pardo_operation(
File "/usr/local/lib/python3.10/site-packages/apache_beam/runners/worker/bundle_processor.py", line 1657, in _create_pardo_operation
dofn_data = pickler.loads(serialized_fn)
File "/usr/local/lib/python3.10/site-packages/apache_beam/internal/pickler.py", line 51, in loads
return desired_pickle_lib.loads(
File "/usr/local/lib/python3.10/site-packages/apache_beam/internal/dill_pickler.py", line 281, in loads
return dill.loads(s)
File "/usr/local/lib/python3.10/site-packages/apache_beam/vendor/dill/_dill.py", line 275, in loads
return load(file, ignore, **kwds)
File "/usr/local/lib/python3.10/site-packages/apache_beam/vendor/dill/_dill.py", line 270, in load
return Unpickler(file, ignore=ignore, **kwds).load()
File "/usr/local/lib/python3.10/site-packages/apache_beam/vendor/dill/_dill.py", line 472, in load
obj = StockUnpickler.load(self)
File "/usr/local/lib/python3.10/site-packages/apache_beam/vendor/dill/_dill.py", line 462, in find_class
return StockUnpickler.find_class(self, module, name)
ModuleNotFoundError: No module named 'dill'
FAILED apache_beam/transforms/sql_test.py::SqlTransformTest::test_windowing_before_sql - RuntimeError: Pipeline BeamApp-jenkins-0322233533-3af72cb5_3c4a28ae-098b-4d04-871a-4a8036892519 failed in state FAILED: java.lang.RuntimeException: Error received from SDK harness for instruction 3: Traceback (most recent call last):
File "/usr/local/lib/python3.10/site-packages/apache_beam/internal/dill_pickler.py", line 277, in loads
return dill.loads(s)
File "/usr/local/lib/python3.10/site-packages/apache_beam/vendor/dill/_dill.py", line 275, in loads
return load(file, ignore, **kwds)
File "/usr/local/lib/python3.10/site-packages/apache_beam/vendor/dill/_dill.py", line 270, in load
return Unpickler(file, ignore=ignore, **kwds).load()
File "/usr/local/lib/python3.10/site-packages/apache_beam/vendor/dill/_dill.py", line 472, in load
obj = StockUnpickler.load(self)
File "/usr/local/lib/python3.10/site-packages/apache_beam/vendor/dill/_dill.py", line 462, in find_class
return StockUnpickler.find_class(self, module, name)
ModuleNotFoundError: No module named 'dill'
During handling of the above exception, another exception occurred:
Traceback (most recent call last):
File "/usr/local/lib/python3.10/site-packages/apache_beam/runners/worker/sdk_worker.py", line 295, in _execute
response = task()
File "/usr/local/lib/python3.10/site-packages/apache_beam/runners/worker/sdk_worker.py", line 370, in <lambda>
lambda: self.create_worker().do_instruction(request), request)
File "/usr/local/lib/python3.10/site-packages/apache_beam/runners/worker/sdk_worker.py", line 629, in do_instruction
return getattr(self, request_type)(
File "/usr/local/lib/python3.10/site-packages/apache_beam/runners/worker/sdk_worker.py", line 660, in process_bundle
bundle_processor = self.bundle_processor_cache.get(
File "/usr/local/lib/python3.10/site-packages/apache_beam/runners/worker/sdk_worker.py", line 491, in get
processor = bundle_processor.BundleProcessor(
File "/usr/local/lib/python3.10/site-packages/apache_beam/runners/worker/bundle_processor.py", line 904, in __init__
self.ops = self.create_execution_tree(self.process_bundle_descriptor)
File "/usr/local/lib/python3.10/site-packages/apache_beam/runners/worker/bundle_processor.py", line 983, in create_execution_tree
return collections.OrderedDict([(
File "/usr/local/lib/python3.10/site-packages/apache_beam/runners/worker/bundle_processor.py", line 986, in <listcomp>
get_operation(transform_id))) for transform_id in sorted(
File "/usr/local/lib/python3.10/site-packages/apache_beam/runners/worker/bundle_processor.py", line 819, in wrapper
result = cache[args] = func(*args)
File "/usr/local/lib/python3.10/site-packages/apache_beam/runners/worker/bundle_processor.py", line 965, in get_operation
transform_consumers = {
File "/usr/local/lib/python3.10/site-packages/apache_beam/runners/worker/bundle_processor.py", line 966, in <dictcomp>
tag: [get_operation(op) for op in pcoll_consumers[pcoll_id]]
File "/usr/local/lib/python3.10/site-packages/apache_beam/runners/worker/bundle_processor.py", line 966, in <listcomp>
tag: [get_operation(op) for op in pcoll_consumers[pcoll_id]]
File "/usr/local/lib/python3.10/site-packages/apache_beam/runners/worker/bundle_processor.py", line 819, in wrapper
result = cache[args] = func(*args)
File "/usr/local/lib/python3.10/site-packages/apache_beam/runners/worker/bundle_processor.py", line 970, in get_operation
return transform_factory.create_operation(
File "/usr/local/lib/python3.10/site-packages/apache_beam/runners/worker/bundle_processor.py", line 1267, in create_operation
return creator(self, transform_id, transform_proto, payload, consumers)
File "/usr/local/lib/python3.10/site-packages/apache_beam/runners/worker/bundle_processor.py", line 1614, in create_par_do
return _create_pardo_operation(
File "/usr/local/lib/python3.10/site-packages/apache_beam/runners/worker/bundle_processor.py", line 1657, in _create_pardo_operation
dofn_data = pickler.loads(serialized_fn)
File "/usr/local/lib/python3.10/site-packages/apache_beam/internal/pickler.py", line 51, in loads
return desired_pickle_lib.loads(
File "/usr/local/lib/python3.10/site-packages/apache_beam/internal/dill_pickler.py", line 281, in loads
return dill.loads(s)
File "/usr/local/lib/python3.10/site-packages/apache_beam/vendor/dill/_dill.py", line 275, in loads
return load(file, ignore, **kwds)
File "/usr/local/lib/python3.10/site-packages/apache_beam/vendor/dill/_dill.py", line 270, in load
return Unpickler(file, ignore=ignore, **kwds).load()
File "/usr/local/lib/python3.10/site-packages/apache_beam/vendor/dill/_dill.py", line 472, in load
obj = StockUnpickler.load(self)
File "/usr/local/lib/python3.10/site-packages/apache_beam/vendor/dill/_dill.py", line 462, in find_class
return StockUnpickler.find_class(self, module, name)
ModuleNotFoundError: No module named 'dill'
FAILED apache_beam/transforms/sql_test.py::SqlTransformTest::test_zetasql_generate_data - RuntimeError: Pipeline BeamApp-jenkins-0322233600-cf9b6b7_79cadecd-f076-4cc3-9773-90881b567985 failed in state FAILED: java.lang.RuntimeException: Error received from SDK harness for instruction 4: Traceback (most recent call last):
File "/usr/local/lib/python3.10/site-packages/apache_beam/internal/dill_pickler.py", line 277, in loads
return dill.loads(s)
File "/usr/local/lib/python3.10/site-packages/apache_beam/vendor/dill/_dill.py", line 275, in loads
return load(file, ignore, **kwds)
File "/usr/local/lib/python3.10/site-packages/apache_beam/vendor/dill/_dill.py", line 270, in load
return Unpickler(file, ignore=ignore, **kwds).load()
File "/usr/local/lib/python3.10/site-packages/apache_beam/vendor/dill/_dill.py", line 472, in load
obj = StockUnpickler.load(self)
File "/usr/local/lib/python3.10/site-packages/apache_beam/vendor/dill/_dill.py", line 462, in find_class
return StockUnpickler.find_class(self, module, name)
ModuleNotFoundError: No module named 'dill'
During handling of the above exception, another exception occurred:
Traceback (most recent call last):
File "/usr/local/lib/python3.10/site-packages/apache_beam/runners/worker/sdk_worker.py", line 295, in _execute
response = task()
File "/usr/local/lib/python3.10/site-packages/apache_beam/runners/worker/sdk_worker.py", line 370, in <lambda>
lambda: self.create_worker().do_instruction(request), request)
File "/usr/local/lib/python3.10/site-packages/apache_beam/runners/worker/sdk_worker.py", line 629, in do_instruction
return getattr(self, request_type)(
File "/usr/local/lib/python3.10/site-packages/apache_beam/runners/worker/sdk_worker.py", line 660, in process_bundle
bundle_processor = self.bundle_processor_cache.get(
File "/usr/local/lib/python3.10/site-packages/apache_beam/runners/worker/sdk_worker.py", line 491, in get
processor = bundle_processor.BundleProcessor(
File "/usr/local/lib/python3.10/site-packages/apache_beam/runners/worker/bundle_processor.py", line 904, in __init__
self.ops = self.create_execution_tree(self.process_bundle_descriptor)
File "/usr/local/lib/python3.10/site-packages/apache_beam/runners/worker/bundle_processor.py", line 983, in create_execution_tree
return collections.OrderedDict([(
File "/usr/local/lib/python3.10/site-packages/apache_beam/runners/worker/bundle_processor.py", line 986, in <listcomp>
get_operation(transform_id))) for transform_id in sorted(
File "/usr/local/lib/python3.10/site-packages/apache_beam/runners/worker/bundle_processor.py", line 819, in wrapper
result = cache[args] = func(*args)
File "/usr/local/lib/python3.10/site-packages/apache_beam/runners/worker/bundle_processor.py", line 965, in get_operation
transform_consumers = {
File "/usr/local/lib/python3.10/site-packages/apache_beam/runners/worker/bundle_processor.py", line 966, in <dictcomp>
tag: [get_operation(op) for op in pcoll_consumers[pcoll_id]]
File "/usr/local/lib/python3.10/site-packages/apache_beam/runners/worker/bundle_processor.py", line 966, in <listcomp>
tag: [get_operation(op) for op in pcoll_consumers[pcoll_id]]
File "/usr/local/lib/python3.10/site-packages/apache_beam/runners/worker/bundle_processor.py", line 819, in wrapper
result = cache[args] = func(*args)
File "/usr/local/lib/python3.10/site-packages/apache_beam/runners/worker/bundle_processor.py", line 965, in get_operation
transform_consumers = {
File "/usr/local/lib/python3.10/site-packages/apache_beam/runners/worker/bundle_processor.py", line 966, in <dictcomp>
tag: [get_operation(op) for op in pcoll_consumers[pcoll_id]]
File "/usr/local/lib/python3.10/site-packages/apache_beam/runners/worker/bundle_processor.py", line 966, in <listcomp>
tag: [get_operation(op) for op in pcoll_consumers[pcoll_id]]
File "/usr/local/lib/python3.10/site-packages/apache_beam/runners/worker/bundle_processor.py", line 819, in wrapper
result = cache[args] = func(*args)
File "/usr/local/lib/python3.10/site-packages/apache_beam/runners/worker/bundle_processor.py", line 965, in get_operation
transform_consumers = {
File "/usr/local/lib/python3.10/site-packages/apache_beam/runners/worker/bundle_processor.py", line 966, in <dictcomp>
tag: [get_operation(op) for op in pcoll_consumers[pcoll_id]]
File "/usr/local/lib/python3.10/site-packages/apache_beam/runners/worker/bundle_processor.py", line 966, in <listcomp>
tag: [get_operation(op) for op in pcoll_consumers[pcoll_id]]
File "/usr/local/lib/python3.10/site-packages/apache_beam/runners/worker/bundle_processor.py", line 819, in wrapper
result = cache[args] = func(*args)
File "/usr/local/lib/python3.10/site-packages/apache_beam/runners/worker/bundle_processor.py", line 970, in get_operation
return transform_factory.create_operation(
File "/usr/local/lib/python3.10/site-packages/apache_beam/runners/worker/bundle_processor.py", line 1267, in create_operation
return creator(self, transform_id, transform_proto, payload, consumers)
File "/usr/local/lib/python3.10/site-packages/apache_beam/runners/worker/bundle_processor.py", line 1614, in create_par_do
return _create_pardo_operation(
File "/usr/local/lib/python3.10/site-packages/apache_beam/runners/worker/bundle_processor.py", line 1657, in _create_pardo_operation
dofn_data = pickler.loads(serialized_fn)
File "/usr/local/lib/python3.10/site-packages/apache_beam/internal/pickler.py", line 51, in loads
return desired_pickle_lib.loads(
File "/usr/local/lib/python3.10/site-packages/apache_beam/internal/dill_pickler.py", line 281, in loads
return dill.loads(s)
File "/usr/local/lib/python3.10/site-packages/apache_beam/vendor/dill/_dill.py", line 275, in loads
return load(file, ignore, **kwds)
File "/usr/local/lib/python3.10/site-packages/apache_beam/vendor/dill/_dill.py", line 270, in load
return Unpickler(file, ignore=ignore, **kwds).load()
File "/usr/local/lib/python3.10/site-packages/apache_beam/vendor/dill/_dill.py", line 472, in load
obj = StockUnpickler.load(self)
File "/usr/local/lib/python3.10/site-packages/apache_beam/vendor/dill/_dill.py", line 462, in find_class
return StockUnpickler.find_class(self, module, name)
ModuleNotFoundError: No module named 'dill'
==== 9 failed, 9 skipped, 6849 deselected, 45 warnings in 230.89s (0:03:50) ====
> Task :runners:flink:1.15:job-server:validatesCrossLanguageRunnerPythonUsingSql FAILED
> Task :runners:flink:1.15:job-server:flinkJobServerCleanup
Stopping job server pid: 794272.
> Task :runners:flink:1.15:job-server:validatesCrossLanguageRunnerCleanup
Stopping expansion service pid: 814732.
Stopping expansion service pid: 814733.
FAILURE: Build completed with 2 failures.
1: Task failed with an exception.
-----------
* What went wrong:
Execution failed for task ':runners:flink:1.15:job-server:validatesCrossLanguageRunnerPythonUsingJava'.
> Process 'command 'sh'' finished with non-zero exit value 1
* Try:
> Run with --stacktrace option to get the stack trace.
> Run with --info or --debug option to get more log output.
==============================================================================
2: Task failed with an exception.
-----------
* What went wrong:
Execution failed for task ':runners:flink:1.15:job-server:validatesCrossLanguageRunnerPythonUsingSql'.
> Process 'command 'sh'' finished with non-zero exit value 1
* Try:
> Run with --stacktrace option to get the stack trace.
> Run with --info or --debug option to get more log output.
==============================================================================
* Get more help at https://help.gradle.org
Deprecated Gradle features were used in this build, making it incompatible with Gradle 8.0.
You can use '--warning-mode all' to show the individual deprecation warnings and determine if they come from your own scripts or plugins.
See https://docs.gradle.org/7.5.1/userguide/command_line_interface.html#sec:command_line_warnings
Execution optimizations have been disabled for 1 invalid unit(s) of work during this build to ensure correctness.
Please consult deprecation warnings for more details.
BUILD FAILED in 32m 9s
190 actionable tasks: 26 executed, 164 up-to-date
Publishing build scan...
https://gradle.com/s/bl7oflqrnu6hs
Build step 'Invoke Gradle script' changed build result to FAILURE
Build step 'Invoke Gradle script' marked build as failure
---------------------------------------------------------------------
To unsubscribe, e-mail: builds-unsubscribe@beam.apache.org
For additional commands, e-mail: builds-help@beam.apache.org
Jenkins build is back to normal : beam_PostCommit_XVR_Flink #6646
Posted by Apache Jenkins Server <je...@builds.apache.org>.
See <https://ci-beam.apache.org/job/beam_PostCommit_XVR_Flink/6646/display/redirect>
---------------------------------------------------------------------
To unsubscribe, e-mail: builds-unsubscribe@beam.apache.org
For additional commands, e-mail: builds-help@beam.apache.org