You are viewing a plain text version of this content. The canonical link for it is here.
Posted to dev@kafka.apache.org by Apache Jenkins Server <je...@builds.apache.org> on 2024/05/30 22:36:37 UTC

Build failed in Jenkins: Kafka » Kafka Branch Builder » trunk #2949

See <https://ci-builds.apache.org/job/Kafka/job/kafka/job/trunk/2949/display/redirect>

Changes:


------------------------------------------
[...truncated 518591 lines...]
[2024-05-30T22:10:21.542Z] Gradle Test Run :core:test > Gradle Test Executor 96 > ZkConfigMigrationClientTest > testMigrationBrokerConfigs() STARTED
[2024-05-30T22:10:21.542Z] 
[2024-05-30T22:10:21.542Z] Gradle Test Run :core:test > Gradle Test Executor 96 > ZkConfigMigrationClientTest > testMigrationBrokerConfigs() PASSED
[2024-05-30T22:10:21.542Z] 
[2024-05-30T22:10:21.542Z] Gradle Test Run :core:test > Gradle Test Executor 96 > ZkConfigMigrationClientTest > testMigrateClientQuotas() STARTED
[2024-05-30T22:10:21.542Z] 
[2024-05-30T22:10:21.542Z] Gradle Test Run :core:test > Gradle Test Executor 96 > ZkConfigMigrationClientTest > testMigrateClientQuotas() PASSED
[2024-05-30T22:10:21.542Z] 
[2024-05-30T22:10:21.542Z] Gradle Test Run :core:test > Gradle Test Executor 96 > ZkConfigMigrationClientTest > testWriteNewTopicConfigs() STARTED
[2024-05-30T22:10:21.542Z] 
[2024-05-30T22:10:21.542Z] Gradle Test Run :core:test > Gradle Test Executor 96 > ZkConfigMigrationClientTest > testWriteNewTopicConfigs() PASSED
[2024-05-30T22:10:21.542Z] 
[2024-05-30T22:10:21.542Z] Gradle Test Run :core:test > Gradle Test Executor 96 > ZkConfigMigrationClientTest > testDelegationTokens() STARTED
[2024-05-30T22:10:21.542Z] 
[2024-05-30T22:10:21.542Z] Gradle Test Run :core:test > Gradle Test Executor 96 > ZkConfigMigrationClientTest > testDelegationTokens() PASSED
[2024-05-30T22:10:21.542Z] 
[2024-05-30T22:10:21.542Z] Gradle Test Run :core:test > Gradle Test Executor 96 > ZkConfigMigrationClientTest > testWriteNewClientQuotas() STARTED
[2024-05-30T22:10:21.542Z] 
[2024-05-30T22:10:21.542Z] Gradle Test Run :core:test > Gradle Test Executor 96 > ZkConfigMigrationClientTest > testWriteNewClientQuotas() PASSED
[2024-05-30T22:10:21.542Z] 
[2024-05-30T22:10:21.542Z] Gradle Test Run :core:test > Gradle Test Executor 96 > ZkConfigMigrationClientTest > testWriteExistingTopicConfigs() STARTED
[2024-05-30T22:10:21.542Z] 
[2024-05-30T22:10:21.542Z] Gradle Test Run :core:test > Gradle Test Executor 96 > ZkConfigMigrationClientTest > testWriteExistingTopicConfigs() PASSED
[2024-05-30T22:10:21.542Z] 
[2024-05-30T22:10:21.542Z] Gradle Test Run :core:test > Gradle Test Executor 96 > ZkConfigMigrationClientTest > testWriteExistingClientQuotas() STARTED
[2024-05-30T22:10:21.542Z] 
[2024-05-30T22:10:21.542Z] Gradle Test Run :core:test > Gradle Test Executor 96 > ZkConfigMigrationClientTest > testWriteExistingClientQuotas() PASSED
[2024-05-30T22:10:21.542Z] 
[2024-05-30T22:10:21.542Z] Gradle Test Run :core:test > Gradle Test Executor 96 > ZkConfigMigrationClientTest > testScramAndQuotaChangesInSnapshot() STARTED
[2024-05-30T22:10:21.542Z] 
[2024-05-30T22:10:21.542Z] Gradle Test Run :core:test > Gradle Test Executor 96 > ZkConfigMigrationClientTest > testScramAndQuotaChangesInSnapshot() PASSED
[2024-05-30T22:10:21.542Z] 
[2024-05-30T22:10:21.542Z] Gradle Test Run :core:test > Gradle Test Executor 96 > VerificationGuardTest > testEqualsAndHashCode() STARTED
[2024-05-30T22:10:21.542Z] 
[2024-05-30T22:10:21.542Z] Gradle Test Run :core:test > Gradle Test Executor 96 > VerificationGuardTest > testEqualsAndHashCode() PASSED
[2024-05-30T22:10:21.542Z] 
[2024-05-30T22:10:21.542Z] Gradle Test Run :core:test > Gradle Test Executor 96 > VerificationGuardTest > testVerify() STARTED
[2024-05-30T22:10:21.542Z] 
[2024-05-30T22:10:21.542Z] Gradle Test Run :core:test > Gradle Test Executor 96 > VerificationGuardTest > testVerify() PASSED
[2024-05-30T22:10:30.617Z] 
[2024-05-30T22:10:30.617Z] Gradle Test Run :core:test > Gradle Test Executor 103 > ProducerIdExpirationTest > testTransactionAfterTransactionIdExpiresButProducerIdRemains(String) > "testTransactionAfterTransactionIdExpiresButProducerIdRemains(String).quorum=zk" STARTED
[2024-05-30T22:10:30.617Z] 
[2024-05-30T22:10:30.617Z] Gradle Test Run :core:test > Gradle Test Executor 102 > RemoteLogManagerTest > testCopyQuotaManagerConfig() STARTED
[2024-05-30T22:10:31.733Z] kafka.log.remote.RemoteLogManagerTest.testCopyQuotaManagerConfig() failed, log available in /home/jenkins/jenkins-agent/workspace/Kafka_kafka_trunk/core/build/reports/testOutput/kafka.log.remote.RemoteLogManagerTest.testCopyQuotaManagerConfig().test.stdout
[2024-05-30T22:10:31.733Z] 
[2024-05-30T22:10:31.733Z] Gradle Test Run :core:test > Gradle Test Executor 102 > RemoteLogManagerTest > testCopyQuotaManagerConfig() FAILED
[2024-05-30T22:10:31.733Z]     org.opentest4j.AssertionFailedError: expected: <61> but was: <11>
[2024-05-30T22:10:31.733Z]         at org.junit.jupiter.api.AssertionFailureBuilder.build(AssertionFailureBuilder.java:151)
[2024-05-30T22:10:31.733Z]         at org.junit.jupiter.api.AssertionFailureBuilder.buildAndThrow(AssertionFailureBuilder.java:132)
[2024-05-30T22:10:31.733Z]         at org.junit.jupiter.api.AssertEquals.failNotEqual(AssertEquals.java:197)
[2024-05-30T22:10:31.733Z]         at org.junit.jupiter.api.AssertEquals.assertEquals(AssertEquals.java:150)
[2024-05-30T22:10:31.733Z]         at org.junit.jupiter.api.AssertEquals.assertEquals(AssertEquals.java:145)
[2024-05-30T22:10:31.733Z]         at org.junit.jupiter.api.Assertions.assertEquals(Assertions.java:531)
[2024-05-30T22:10:31.733Z]         at kafka.log.remote.RemoteLogManagerTest.testCopyQuotaManagerConfig(RemoteLogManagerTest.java:2682)
[2024-05-30T22:10:31.733Z] 
[2024-05-30T22:10:31.733Z] Gradle Test Run :core:test > Gradle Test Executor 102 > ZkMigrationIntegrationTest > testMigrateTopicDeletions(ClusterInstance) > testMigrateTopicDeletions [1] Type=ZK, MetadataVersion=3.4-IV0,Security=PLAINTEXT STARTED
[2024-05-30T22:10:36.688Z] 
[2024-05-30T22:10:36.688Z] Gradle Test Run :core:test > Gradle Test Executor 101 > ZkMigrationIntegrationTest > testMigrateTopicDeletions(ClusterInstance) > testMigrateTopicDeletions [4] Type=ZK, MetadataVersion=3.7-IV0,Security=PLAINTEXT SKIPPED
[2024-05-30T22:10:36.688Z] 
[2024-05-30T22:10:36.688Z] Gradle Test Run :core:test > Gradle Test Executor 101 > ZkMigrationIntegrationTest > testMigrateTopicDeletions(ClusterInstance) > testMigrateTopicDeletions [5] Type=ZK, MetadataVersion=3.7-IV1,Security=PLAINTEXT STARTED
[2024-05-30T22:10:41.203Z] 
[2024-05-30T22:10:41.203Z] Gradle Test Run :core:test > Gradle Test Executor 110 > ConsumerBounceTest > testConsumptionWithBrokerFailures() PASSED
[2024-05-30T22:10:41.203Z] 
[2024-05-30T22:10:41.203Z] 5652 tests completed, 3 failed, 14 skipped
[2024-05-30T22:10:43.804Z] There were failing tests. See the report at: file:///home/jenkins/jenkins-agent/workspace/Kafka_kafka_trunk/core/build/reports/tests/test/index.html
[2024-05-30T22:10:44.903Z] 
[2024-05-30T22:10:44.903Z] Gradle Test Run :core:test > Gradle Test Executor 103 > ProducerIdExpirationTest > testTransactionAfterTransactionIdExpiresButProducerIdRemains(String) > "testTransactionAfterTransactionIdExpiresButProducerIdRemains(String).quorum=zk" PASSED
[2024-05-30T22:10:44.903Z] 
[2024-05-30T22:10:44.903Z] Gradle Test Run :core:test > Gradle Test Executor 103 > ProducerIdExpirationTest > testTransactionAfterTransactionIdExpiresButProducerIdRemains(String) > "testTransactionAfterTransactionIdExpiresButProducerIdRemains(String).quorum=kraft" STARTED
[2024-05-30T22:10:45.046Z] 
[2024-05-30T22:10:45.046Z] Deprecated Gradle features were used in this build, making it incompatible with Gradle 9.0.
[2024-05-30T22:10:45.046Z] 
[2024-05-30T22:10:45.046Z] You can use '--warning-mode all' to show the individual deprecation warnings and determine if they come from your own scripts or plugins.
[2024-05-30T22:10:45.046Z] 
[2024-05-30T22:10:45.046Z] For more on this, please refer to https://docs.gradle.org/8.7/userguide/command_line_interface.html#sec:command_line_warnings in the Gradle documentation.
[2024-05-30T22:10:45.046Z] 
[2024-05-30T22:10:45.046Z] BUILD SUCCESSFUL in 3h 49m 21s
[2024-05-30T22:10:45.046Z] 321 actionable tasks: 119 executed, 202 up-to-date
[2024-05-30T22:10:45.046Z] 
[2024-05-30T22:10:45.046Z] Publishing build scan...
[2024-05-30T22:10:46.305Z] https://ge.apache.org/s/yeh6tn4p2eivw
[2024-05-30T22:10:46.305Z] 
[2024-05-30T22:10:46.305Z] 
[2024-05-30T22:10:46.305Z] See the profiling report at: file:///home/jenkins/jenkins-agent/workspace/Kafka_kafka_trunk/build/reports/profile/profile-2024-05-30-18-21-28.html
[2024-05-30T22:10:46.305Z] A fine-grained performance profile is available: use the --scan option.
[Pipeline] junit
[2024-05-30T22:10:47.516Z] Recording test results
[2024-05-30T22:10:59.433Z] 
[2024-05-30T22:10:59.433Z] Gradle Test Run :core:test > Gradle Test Executor 103 > ProducerIdExpirationTest > testTransactionAfterTransactionIdExpiresButProducerIdRemains(String) > "testTransactionAfterTransactionIdExpiresButProducerIdRemains(String).quorum=kraft" PASSED
[2024-05-30T22:11:03.233Z] 
[2024-05-30T22:11:03.233Z] Gradle Test Run :core:test > Gradle Test Executor 101 > ZkMigrationIntegrationTest > testMigrateTopicDeletions(ClusterInstance) > testMigrateTopicDeletions [5] Type=ZK, MetadataVersion=3.7-IV1,Security=PLAINTEXT SKIPPED
[2024-05-30T22:11:03.233Z] 
[2024-05-30T22:11:03.233Z] Gradle Test Run :core:test > Gradle Test Executor 101 > ZkMigrationIntegrationTest > testMigrateTopicDeletions(ClusterInstance) > testMigrateTopicDeletions [6] Type=ZK, MetadataVersion=3.7-IV2,Security=PLAINTEXT STARTED
[2024-05-30T22:11:05.472Z] 
[2024-05-30T22:11:05.472Z] Gradle Test Run :core:test > Gradle Test Executor 102 > ZkMigrationIntegrationTest > testMigrateTopicDeletions(ClusterInstance) > testMigrateTopicDeletions [1] Type=ZK, MetadataVersion=3.4-IV0,Security=PLAINTEXT SKIPPED
[2024-05-30T22:11:05.472Z] 
[2024-05-30T22:11:05.472Z] Gradle Test Run :core:test > Gradle Test Executor 102 > ZkMigrationIntegrationTest > testMigrateTopicDeletions(ClusterInstance) > testMigrateTopicDeletions [2] Type=ZK, MetadataVersion=3.5-IV2,Security=PLAINTEXT STARTED
[2024-05-30T22:11:30.534Z] 
[2024-05-30T22:11:30.534Z] Gradle Test Run :core:test > Gradle Test Executor 101 > ZkMigrationIntegrationTest > testMigrateTopicDeletions(ClusterInstance) > testMigrateTopicDeletions [6] Type=ZK, MetadataVersion=3.7-IV2,Security=PLAINTEXT SKIPPED
[2024-05-30T22:11:30.534Z] 
[2024-05-30T22:11:30.534Z] Gradle Test Run :core:test > Gradle Test Executor 101 > ZkMigrationIntegrationTest > testMigrateTopicDeletions(ClusterInstance) > testMigrateTopicDeletions [7] Type=ZK, MetadataVersion=3.7-IV4,Security=PLAINTEXT STARTED
[2024-05-30T22:11:32.643Z] 
[2024-05-30T22:11:32.643Z] Gradle Test Run :core:test > Gradle Test Executor 102 > ZkMigrationIntegrationTest > testMigrateTopicDeletions(ClusterInstance) > testMigrateTopicDeletions [2] Type=ZK, MetadataVersion=3.5-IV2,Security=PLAINTEXT SKIPPED
[2024-05-30T22:11:32.643Z] 
[2024-05-30T22:11:32.643Z] Gradle Test Run :core:test > Gradle Test Executor 102 > ZkMigrationIntegrationTest > testMigrateTopicDeletions(ClusterInstance) > testMigrateTopicDeletions [3] Type=ZK, MetadataVersion=3.6-IV2,Security=PLAINTEXT STARTED
[2024-05-30T22:11:35.541Z] [Checks API] No suitable checks publisher found.
[Pipeline] echo
[2024-05-30T22:11:35.544Z] Skipping Kafka Streams archetype test for Java 17
[Pipeline] }
[Pipeline] // withEnv
[Pipeline] }
[Pipeline] // withEnv
[Pipeline] }
[Pipeline] // withEnv
[Pipeline] }
[Pipeline] // node
[Pipeline] }
[Pipeline] // timestamps
[Pipeline] }
[Pipeline] // timeout
[Pipeline] }
[Pipeline] // stage
[Pipeline] }
[2024-05-30T22:11:59.571Z] 
[2024-05-30T22:11:59.571Z] Gradle Test Run :core:test > Gradle Test Executor 101 > ZkMigrationIntegrationTest > testMigrateTopicDeletions(ClusterInstance) > testMigrateTopicDeletions [7] Type=ZK, MetadataVersion=3.7-IV4,Security=PLAINTEXT SKIPPED
[2024-05-30T22:11:59.571Z] 
[2024-05-30T22:11:59.571Z] Gradle Test Run :core:test > Gradle Test Executor 101 > ZkMigrationIntegrationTest > testMigrateTopicDeletions(ClusterInstance) > testMigrateTopicDeletions [8] Type=ZK, MetadataVersion=3.8-IV0,Security=PLAINTEXT STARTED
[2024-05-30T22:12:01.117Z] 
[2024-05-30T22:12:01.117Z] Gradle Test Run :core:test > Gradle Test Executor 102 > ZkMigrationIntegrationTest > testMigrateTopicDeletions(ClusterInstance) > testMigrateTopicDeletions [3] Type=ZK, MetadataVersion=3.6-IV2,Security=PLAINTEXT SKIPPED
[2024-05-30T22:12:01.117Z] 
[2024-05-30T22:12:01.117Z] Gradle Test Run :core:test > Gradle Test Executor 102 > ZkMigrationIntegrationTest > testMigrateTopicDeletions(ClusterInstance) > testMigrateTopicDeletions [4] Type=ZK, MetadataVersion=3.7-IV0,Security=PLAINTEXT STARTED
[2024-05-30T22:12:22.153Z] 
[2024-05-30T22:12:22.153Z] Gradle Test Run :core:test > Gradle Test Executor 101 > ZkMigrationIntegrationTest > testMigrateTopicDeletions(ClusterInstance) > testMigrateTopicDeletions [8] Type=ZK, MetadataVersion=3.8-IV0,Security=PLAINTEXT SKIPPED
[2024-05-30T22:12:22.153Z] 
[2024-05-30T22:12:22.153Z] 5666 tests completed, 8 failed, 21 skipped
[2024-05-30T22:12:29.072Z] 
[2024-05-30T22:12:29.072Z] Gradle Test Run :core:test > Gradle Test Executor 102 > ZkMigrationIntegrationTest > testMigrateTopicDeletions(ClusterInstance) > testMigrateTopicDeletions [4] Type=ZK, MetadataVersion=3.7-IV0,Security=PLAINTEXT SKIPPED
[2024-05-30T22:12:29.072Z] 
[2024-05-30T22:12:29.072Z] Gradle Test Run :core:test > Gradle Test Executor 102 > ZkMigrationIntegrationTest > testMigrateTopicDeletions(ClusterInstance) > testMigrateTopicDeletions [5] Type=ZK, MetadataVersion=3.7-IV1,Security=PLAINTEXT STARTED
[2024-05-30T22:12:30.865Z] There were failing tests. See the report at: file:///home/jenkins/workspace/Kafka_kafka_trunk/core/build/reports/tests/test/index.html
[2024-05-30T22:12:32.435Z] 
[2024-05-30T22:12:32.435Z] Deprecated Gradle features were used in this build, making it incompatible with Gradle 9.0.
[2024-05-30T22:12:32.435Z] 
[2024-05-30T22:12:32.435Z] You can use '--warning-mode all' to show the individual deprecation warnings and determine if they come from your own scripts or plugins.
[2024-05-30T22:12:32.435Z] 
[2024-05-30T22:12:32.436Z] For more on this, please refer to https://docs.gradle.org/8.7/userguide/command_line_interface.html#sec:command_line_warnings in the Gradle documentation.
[2024-05-30T22:12:32.436Z] 
[2024-05-30T22:12:32.436Z] BUILD SUCCESSFUL in 3h 53m 54s
[2024-05-30T22:12:32.436Z] 321 actionable tasks: 119 executed, 202 up-to-date
[2024-05-30T22:12:33.832Z] 
[2024-05-30T22:12:33.832Z] Publishing build scan...
[2024-05-30T22:12:36.816Z] https://ge.apache.org/s/ibxrwptrclbnq
[2024-05-30T22:12:36.816Z] 
[2024-05-30T22:12:36.816Z] 
[2024-05-30T22:12:36.816Z] See the profiling report at: file:///home/jenkins/workspace/Kafka_kafka_trunk/build/reports/profile/profile-2024-05-30-18-18-45.html
[2024-05-30T22:12:36.816Z] A fine-grained performance profile is available: use the --scan option.
[Pipeline] junit
[2024-05-30T22:12:38.015Z] Recording test results
[2024-05-30T22:13:18.175Z] [Checks API] No suitable checks publisher found.
[Pipeline] echo
[2024-05-30T22:13:18.177Z] Skipping Kafka Streams archetype test for Java 21
[Pipeline] }
[Pipeline] // withEnv
[Pipeline] }
[Pipeline] // withEnv
[Pipeline] }
[Pipeline] // withEnv
[Pipeline] }
[Pipeline] // node
[Pipeline] }
[Pipeline] // timestamps
[Pipeline] }
[Pipeline] // timeout
[Pipeline] }
[Pipeline] // stage
[Pipeline] }
[2024-05-30T22:13:28.549Z] kafka.zk.ZkMigrationIntegrationTest.testMigrateTopicDeletions(ClusterInstance)[5] failed, log available in /home/jenkins/jenkins-agent/workspace/Kafka_kafka_trunk/core/build/reports/testOutput/kafka.zk.ZkMigrationIntegrationTest.testMigrateTopicDeletions(ClusterInstance)[5].test.stdout
[2024-05-30T22:13:28.549Z] 
[2024-05-30T22:13:28.549Z] Gradle Test Run :core:test > Gradle Test Executor 102 > ZkMigrationIntegrationTest > testMigrateTopicDeletions(ClusterInstance) > testMigrateTopicDeletions [5] Type=ZK, MetadataVersion=3.7-IV1,Security=PLAINTEXT FAILED
[2024-05-30T22:13:28.549Z]     org.opentest4j.AssertionFailedError: Timed out waiting for topics to be deleted
[2024-05-30T22:13:28.549Z]         at org.junit.jupiter.api.AssertionUtils.fail(AssertionUtils.java:38)
[2024-05-30T22:13:28.549Z]         at org.junit.jupiter.api.Assertions.fail(Assertions.java:138)
[2024-05-30T22:13:28.549Z]         at kafka.zk.ZkMigrationIntegrationTest.testMigrateTopicDeletions(ZkMigrationIntegrationTest.scala:371)
[2024-05-30T22:13:28.549Z] 
[2024-05-30T22:13:28.549Z] Gradle Test Run :core:test > Gradle Test Executor 102 > ZkMigrationIntegrationTest > testMigrateTopicDeletions(ClusterInstance) > testMigrateTopicDeletions [6] Type=ZK, MetadataVersion=3.7-IV2,Security=PLAINTEXT STARTED
[2024-05-30T22:14:05.218Z] 
[2024-05-30T22:14:05.218Z] Gradle Test Run :core:test > Gradle Test Executor 102 > ZkMigrationIntegrationTest > testMigrateTopicDeletions(ClusterInstance) > testMigrateTopicDeletions [6] Type=ZK, MetadataVersion=3.7-IV2,Security=PLAINTEXT SKIPPED
[2024-05-30T22:14:05.218Z] 
[2024-05-30T22:14:05.218Z] Gradle Test Run :core:test > Gradle Test Executor 102 > ZkMigrationIntegrationTest > testMigrateTopicDeletions(ClusterInstance) > testMigrateTopicDeletions [7] Type=ZK, MetadataVersion=3.7-IV4,Security=PLAINTEXT STARTED
[2024-05-30T22:15:08.179Z] kafka.zk.ZkMigrationIntegrationTest.testMigrateTopicDeletions(ClusterInstance)[7] failed, log available in /home/jenkins/jenkins-agent/workspace/Kafka_kafka_trunk/core/build/reports/testOutput/kafka.zk.ZkMigrationIntegrationTest.testMigrateTopicDeletions(ClusterInstance)[7].test.stdout
[2024-05-30T22:15:08.179Z] 
[2024-05-30T22:15:08.179Z] Gradle Test Run :core:test > Gradle Test Executor 102 > ZkMigrationIntegrationTest > testMigrateTopicDeletions(ClusterInstance) > testMigrateTopicDeletions [7] Type=ZK, MetadataVersion=3.7-IV4,Security=PLAINTEXT FAILED
[2024-05-30T22:15:08.179Z]     org.opentest4j.AssertionFailedError: Timed out waiting for topics to be deleted
[2024-05-30T22:15:08.179Z]         at org.junit.jupiter.api.AssertionUtils.fail(AssertionUtils.java:38)
[2024-05-30T22:15:08.179Z]         at org.junit.jupiter.api.Assertions.fail(Assertions.java:138)
[2024-05-30T22:15:08.179Z]         at kafka.zk.ZkMigrationIntegrationTest.testMigrateTopicDeletions(ZkMigrationIntegrationTest.scala:371)
[2024-05-30T22:15:08.179Z] 
[2024-05-30T22:15:08.179Z] Gradle Test Run :core:test > Gradle Test Executor 102 > ZkMigrationIntegrationTest > testMigrateTopicDeletions(ClusterInstance) > testMigrateTopicDeletions [8] Type=ZK, MetadataVersion=3.8-IV0,Security=PLAINTEXT STARTED
[2024-05-30T22:15:37.217Z] 
[2024-05-30T22:15:37.217Z] Gradle Test Run :core:test > Gradle Test Executor 102 > ZkMigrationIntegrationTest > testMigrateTopicDeletions(ClusterInstance) > testMigrateTopicDeletions [8] Type=ZK, MetadataVersion=3.8-IV0,Security=PLAINTEXT PASSED
[2024-05-30T22:15:39.173Z] 
[2024-05-30T22:15:39.173Z] 5661 tests completed, 6 failed, 20 skipped
[2024-05-30T22:15:51.224Z] There were failing tests. See the report at: file:///home/jenkins/jenkins-agent/workspace/Kafka_kafka_trunk/core/build/reports/tests/test/index.html
[2024-05-30T22:15:55.677Z] 
[2024-05-30T22:15:55.677Z] Deprecated Gradle features were used in this build, making it incompatible with Gradle 9.0.
[2024-05-30T22:15:55.677Z] 
[2024-05-30T22:15:55.677Z] You can use '--warning-mode all' to show the individual deprecation warnings and determine if they come from your own scripts or plugins.
[2024-05-30T22:15:55.677Z] 
[2024-05-30T22:15:55.677Z] For more on this, please refer to https://docs.gradle.org/8.7/userguide/command_line_interface.html#sec:command_line_warnings in the Gradle documentation.
[2024-05-30T22:15:55.677Z] 
[2024-05-30T22:15:55.677Z] BUILD SUCCESSFUL in 3h 58m 46s
[2024-05-30T22:15:55.677Z] 321 actionable tasks: 119 executed, 202 up-to-date
[2024-05-30T22:15:55.677Z] 
[2024-05-30T22:15:55.677Z] Publishing build scan...
[2024-05-30T22:15:58.574Z] https://ge.apache.org/s/ssh5gbzxbtfkg
[2024-05-30T22:15:58.574Z] 
[2024-05-30T22:15:58.574Z] 
[2024-05-30T22:15:58.574Z] See the profiling report at: file:///home/jenkins/jenkins-agent/workspace/Kafka_kafka_trunk/build/reports/profile/profile-2024-05-30-18-17-13.html
[2024-05-30T22:15:58.574Z] A fine-grained performance profile is available: use the --scan option.
[Pipeline] junit
[2024-05-30T22:16:01.082Z] Recording test results
[2024-05-30T22:36:37.558Z] hudson.remoting.Channel$OrderlyShutdown: Command Close created at
[Pipeline] }
[Pipeline] // withEnv
[Pipeline] }
[Pipeline] // withEnv
[Pipeline] }
[Pipeline] // withEnv
[Pipeline] }
[Pipeline] // node
[Pipeline] }
[Pipeline] // timestamps
[Pipeline] }
[Pipeline] // timeout
[Pipeline] }
[Pipeline] // stage
[Pipeline] }
Failed in branch JDK 8 and Scala 2.12
[Pipeline] // parallel
[Pipeline] }
[Pipeline] // stage
[Pipeline] stage
[Pipeline] { (Declarative: Post Actions)
[Pipeline] script
[Pipeline] {
[Pipeline] node
Running on builds35 in /home/jenkins/workspace/Kafka_kafka_trunk
[Pipeline] {
[Pipeline] step

Jenkins build is still unstable: Kafka » Kafka Branch Builder » trunk #2954

Posted by Apache Jenkins Server <je...@builds.apache.org>.
See <https://ci-builds.apache.org/job/Kafka/job/kafka/job/trunk/2954/display/redirect>


Jenkins build is still unstable: Kafka » Kafka Branch Builder » trunk #2953

Posted by Apache Jenkins Server <je...@builds.apache.org>.
See <https://ci-builds.apache.org/job/Kafka/job/kafka/job/trunk/2953/display/redirect>


Jenkins build is still unstable: Kafka » Kafka Branch Builder » trunk #2952

Posted by Apache Jenkins Server <je...@builds.apache.org>.
See <https://ci-builds.apache.org/job/Kafka/job/kafka/job/trunk/2952/display/redirect>


Jenkins build is still unstable: Kafka » Kafka Branch Builder » trunk #2951

Posted by Apache Jenkins Server <je...@builds.apache.org>.
See <https://ci-builds.apache.org/job/Kafka/job/kafka/job/trunk/2951/display/redirect>


Jenkins build is unstable: Kafka » Kafka Branch Builder » trunk #2950

Posted by Apache Jenkins Server <je...@builds.apache.org>.
See <https://ci-builds.apache.org/job/Kafka/job/kafka/job/trunk/2950/display/redirect>