You are viewing a plain text version of this content. The canonical link for it is here.
Posted to builds@beam.apache.org by Apache Jenkins Server <je...@builds.apache.org> on 2018/11/15 20:54:26 UTC

Build failed in Jenkins: beam_PostCommit_Py_ValCont #1431

See <https://builds.apache.org/job/beam_PostCommit_Py_ValCont/1431/display/redirect?page=changes>

Changes:

[ankurgoenka] [BEAM-4524] Use SHA256 for artifact validation

[ankurgoenka] [BEAM-4524] use hex encoding for artifact hash

------------------------------------------
[...truncated 171.88 KB...]
copying apache_beam/runners/worker/worker_id_interceptor_test.py -> apache-beam-2.9.0.dev0/apache_beam/runners/worker
copying apache_beam/testing/__init__.py -> apache-beam-2.9.0.dev0/apache_beam/testing
copying apache_beam/testing/pipeline_verifiers.py -> apache-beam-2.9.0.dev0/apache_beam/testing
copying apache_beam/testing/pipeline_verifiers_test.py -> apache-beam-2.9.0.dev0/apache_beam/testing
copying apache_beam/testing/synthetic_pipeline.py -> apache-beam-2.9.0.dev0/apache_beam/testing
copying apache_beam/testing/synthetic_pipeline_test.py -> apache-beam-2.9.0.dev0/apache_beam/testing
copying apache_beam/testing/test_pipeline.py -> apache-beam-2.9.0.dev0/apache_beam/testing
copying apache_beam/testing/test_pipeline_test.py -> apache-beam-2.9.0.dev0/apache_beam/testing
copying apache_beam/testing/test_stream.py -> apache-beam-2.9.0.dev0/apache_beam/testing
copying apache_beam/testing/test_stream_test.py -> apache-beam-2.9.0.dev0/apache_beam/testing
copying apache_beam/testing/test_utils.py -> apache-beam-2.9.0.dev0/apache_beam/testing
copying apache_beam/testing/test_utils_test.py -> apache-beam-2.9.0.dev0/apache_beam/testing
copying apache_beam/testing/util.py -> apache-beam-2.9.0.dev0/apache_beam/testing
copying apache_beam/testing/util_test.py -> apache-beam-2.9.0.dev0/apache_beam/testing
copying apache_beam/testing/benchmarks/__init__.py -> apache-beam-2.9.0.dev0/apache_beam/testing/benchmarks
copying apache_beam/testing/benchmarks/nexmark/__init__.py -> apache-beam-2.9.0.dev0/apache_beam/testing/benchmarks/nexmark
copying apache_beam/testing/benchmarks/nexmark/nexmark_launcher.py -> apache-beam-2.9.0.dev0/apache_beam/testing/benchmarks/nexmark
copying apache_beam/testing/benchmarks/nexmark/nexmark_util.py -> apache-beam-2.9.0.dev0/apache_beam/testing/benchmarks/nexmark
copying apache_beam/testing/benchmarks/nexmark/models/__init__.py -> apache-beam-2.9.0.dev0/apache_beam/testing/benchmarks/nexmark/models
copying apache_beam/testing/benchmarks/nexmark/models/nexmark_model.py -> apache-beam-2.9.0.dev0/apache_beam/testing/benchmarks/nexmark/models
copying apache_beam/testing/benchmarks/nexmark/queries/__init__.py -> apache-beam-2.9.0.dev0/apache_beam/testing/benchmarks/nexmark/queries
copying apache_beam/testing/benchmarks/nexmark/queries/query0.py -> apache-beam-2.9.0.dev0/apache_beam/testing/benchmarks/nexmark/queries
copying apache_beam/testing/benchmarks/nexmark/queries/query1.py -> apache-beam-2.9.0.dev0/apache_beam/testing/benchmarks/nexmark/queries
copying apache_beam/testing/benchmarks/nexmark/queries/query2.py -> apache-beam-2.9.0.dev0/apache_beam/testing/benchmarks/nexmark/queries
copying apache_beam/testing/data/standard_coders.yaml -> apache-beam-2.9.0.dev0/apache_beam/testing/data
copying apache_beam/testing/data/trigger_transcripts.yaml -> apache-beam-2.9.0.dev0/apache_beam/testing/data
copying apache_beam/testing/load_tests/__init__.py -> apache-beam-2.9.0.dev0/apache_beam/testing/load_tests
copying apache_beam/testing/load_tests/co_group_by_key_test.py -> apache-beam-2.9.0.dev0/apache_beam/testing/load_tests
copying apache_beam/testing/load_tests/combine_test.py -> apache-beam-2.9.0.dev0/apache_beam/testing/load_tests
copying apache_beam/testing/load_tests/group_by_key_test.py -> apache-beam-2.9.0.dev0/apache_beam/testing/load_tests
copying apache_beam/testing/load_tests/load_test_metrics_utils.py -> apache-beam-2.9.0.dev0/apache_beam/testing/load_tests
copying apache_beam/testing/load_tests/pardo_test.py -> apache-beam-2.9.0.dev0/apache_beam/testing/load_tests
copying apache_beam/tools/__init__.py -> apache-beam-2.9.0.dev0/apache_beam/tools
copying apache_beam/tools/coders_microbenchmark.py -> apache-beam-2.9.0.dev0/apache_beam/tools
copying apache_beam/tools/distribution_counter_microbenchmark.py -> apache-beam-2.9.0.dev0/apache_beam/tools
copying apache_beam/tools/map_fn_microbenchmark.py -> apache-beam-2.9.0.dev0/apache_beam/tools
copying apache_beam/tools/microbenchmarks_test.py -> apache-beam-2.9.0.dev0/apache_beam/tools
copying apache_beam/tools/sideinput_microbenchmark.py -> apache-beam-2.9.0.dev0/apache_beam/tools
copying apache_beam/tools/utils.py -> apache-beam-2.9.0.dev0/apache_beam/tools
copying apache_beam/transforms/__init__.py -> apache-beam-2.9.0.dev0/apache_beam/transforms
copying apache_beam/transforms/combiners.py -> apache-beam-2.9.0.dev0/apache_beam/transforms
copying apache_beam/transforms/combiners_test.py -> apache-beam-2.9.0.dev0/apache_beam/transforms
copying apache_beam/transforms/core.py -> apache-beam-2.9.0.dev0/apache_beam/transforms
copying apache_beam/transforms/create_source.py -> apache-beam-2.9.0.dev0/apache_beam/transforms
copying apache_beam/transforms/create_test.py -> apache-beam-2.9.0.dev0/apache_beam/transforms
copying apache_beam/transforms/cy_combiners.pxd -> apache-beam-2.9.0.dev0/apache_beam/transforms
copying apache_beam/transforms/cy_combiners.py -> apache-beam-2.9.0.dev0/apache_beam/transforms
copying apache_beam/transforms/cy_dataflow_distribution_counter.pxd -> apache-beam-2.9.0.dev0/apache_beam/transforms
copying apache_beam/transforms/cy_dataflow_distribution_counter.pyx -> apache-beam-2.9.0.dev0/apache_beam/transforms
copying apache_beam/transforms/dataflow_distribution_counter_test.py -> apache-beam-2.9.0.dev0/apache_beam/transforms
copying apache_beam/transforms/display.py -> apache-beam-2.9.0.dev0/apache_beam/transforms
copying apache_beam/transforms/display_test.py -> apache-beam-2.9.0.dev0/apache_beam/transforms
copying apache_beam/transforms/ptransform.py -> apache-beam-2.9.0.dev0/apache_beam/transforms
copying apache_beam/transforms/ptransform_test.py -> apache-beam-2.9.0.dev0/apache_beam/transforms
copying apache_beam/transforms/py_dataflow_distribution_counter.py -> apache-beam-2.9.0.dev0/apache_beam/transforms
copying apache_beam/transforms/sideinputs.py -> apache-beam-2.9.0.dev0/apache_beam/transforms
copying apache_beam/transforms/sideinputs_test.py -> apache-beam-2.9.0.dev0/apache_beam/transforms
copying apache_beam/transforms/timeutil.py -> apache-beam-2.9.0.dev0/apache_beam/transforms
copying apache_beam/transforms/trigger.py -> apache-beam-2.9.0.dev0/apache_beam/transforms
copying apache_beam/transforms/trigger_test.py -> apache-beam-2.9.0.dev0/apache_beam/transforms
copying apache_beam/transforms/userstate.py -> apache-beam-2.9.0.dev0/apache_beam/transforms
copying apache_beam/transforms/userstate_test.py -> apache-beam-2.9.0.dev0/apache_beam/transforms
copying apache_beam/transforms/util.py -> apache-beam-2.9.0.dev0/apache_beam/transforms
copying apache_beam/transforms/util_test.py -> apache-beam-2.9.0.dev0/apache_beam/transforms
copying apache_beam/transforms/window.py -> apache-beam-2.9.0.dev0/apache_beam/transforms
copying apache_beam/transforms/window_test.py -> apache-beam-2.9.0.dev0/apache_beam/transforms
copying apache_beam/transforms/write_ptransform_test.py -> apache-beam-2.9.0.dev0/apache_beam/transforms
copying apache_beam/typehints/__init__.py -> apache-beam-2.9.0.dev0/apache_beam/typehints
copying apache_beam/typehints/decorators.py -> apache-beam-2.9.0.dev0/apache_beam/typehints
copying apache_beam/typehints/native_type_compatibility.py -> apache-beam-2.9.0.dev0/apache_beam/typehints
copying apache_beam/typehints/native_type_compatibility_test.py -> apache-beam-2.9.0.dev0/apache_beam/typehints
copying apache_beam/typehints/opcodes.py -> apache-beam-2.9.0.dev0/apache_beam/typehints
copying apache_beam/typehints/trivial_inference.py -> apache-beam-2.9.0.dev0/apache_beam/typehints
copying apache_beam/typehints/trivial_inference_test.py -> apache-beam-2.9.0.dev0/apache_beam/typehints
copying apache_beam/typehints/typecheck.py -> apache-beam-2.9.0.dev0/apache_beam/typehints
copying apache_beam/typehints/typed_pipeline_test.py -> apache-beam-2.9.0.dev0/apache_beam/typehints
copying apache_beam/typehints/typehints.py -> apache-beam-2.9.0.dev0/apache_beam/typehints
copying apache_beam/typehints/typehints_test.py -> apache-beam-2.9.0.dev0/apache_beam/typehints
copying apache_beam/utils/__init__.py -> apache-beam-2.9.0.dev0/apache_beam/utils
copying apache_beam/utils/annotations.py -> apache-beam-2.9.0.dev0/apache_beam/utils
copying apache_beam/utils/annotations_test.py -> apache-beam-2.9.0.dev0/apache_beam/utils
copying apache_beam/utils/counters.pxd -> apache-beam-2.9.0.dev0/apache_beam/utils
copying apache_beam/utils/counters.py -> apache-beam-2.9.0.dev0/apache_beam/utils
copying apache_beam/utils/counters_test.py -> apache-beam-2.9.0.dev0/apache_beam/utils
copying apache_beam/utils/plugin.py -> apache-beam-2.9.0.dev0/apache_beam/utils
copying apache_beam/utils/processes.py -> apache-beam-2.9.0.dev0/apache_beam/utils
copying apache_beam/utils/processes_test.py -> apache-beam-2.9.0.dev0/apache_beam/utils
copying apache_beam/utils/profiler.py -> apache-beam-2.9.0.dev0/apache_beam/utils
copying apache_beam/utils/proto_utils.py -> apache-beam-2.9.0.dev0/apache_beam/utils
copying apache_beam/utils/retry.py -> apache-beam-2.9.0.dev0/apache_beam/utils
copying apache_beam/utils/retry_test.py -> apache-beam-2.9.0.dev0/apache_beam/utils
copying apache_beam/utils/timestamp.py -> apache-beam-2.9.0.dev0/apache_beam/utils
copying apache_beam/utils/timestamp_test.py -> apache-beam-2.9.0.dev0/apache_beam/utils
copying apache_beam/utils/urns.py -> apache-beam-2.9.0.dev0/apache_beam/utils
copying apache_beam/utils/windowed_value.pxd -> apache-beam-2.9.0.dev0/apache_beam/utils
copying apache_beam/utils/windowed_value.py -> apache-beam-2.9.0.dev0/apache_beam/utils
copying apache_beam/utils/windowed_value_test.py -> apache-beam-2.9.0.dev0/apache_beam/utils
Writing apache-beam-2.9.0.dev0/setup.cfg
creating dist
Creating tar archive
removing 'apache-beam-2.9.0.dev0' (and everything under it)
SDK_LOCATION=$(find dist/apache-beam-*.tar.gz)
find dist/apache-beam-*.tar.gz

# Run ValidatesRunner tests on Google Cloud Dataflow service
echo ">>> RUNNING DATAFLOW RUNNER VALIDATESCONTAINER TEST"
>>> RUNNING DATAFLOW RUNNER VALIDATESCONTAINER TEST
python setup.py nosetests \
  --attr ValidatesContainer \
  --nologcapture \
  --processes=1 \
  --process-timeout=900 \
  --test-pipeline-options=" \
    --runner=TestDataflowRunner \
    --project=$PROJECT \
    --worker_harness_container_image=$CONTAINER:$TAG \
    --staging_location=$GCS_LOCATION/staging-validatesrunner-test \
    --temp_location=$GCS_LOCATION/temp-validatesrunner-test \
    --output=$GCS_LOCATION/output \
    --sdk_location=$SDK_LOCATION \
    --num_workers=1"
<https://builds.apache.org/job/beam_PostCommit_Py_ValCont/ws/src/sdks/python/container/local/lib/python2.7/site-packages/setuptools/dist.py>:470: UserWarning: Normalizing '2.9.0.dev' to '2.9.0.dev0'
  normalized_version,
running nosetests
running egg_info
<https://builds.apache.org/job/beam_PostCommit_Py_ValCont/ws/src/sdks/python/gen_protos.py>:52: UserWarning: Installing grpcio-tools is recommended for development.
  warnings.warn('Installing grpcio-tools is recommended for development.')
writing requirements to apache_beam.egg-info/requires.txt
writing apache_beam.egg-info/PKG-INFO
writing top-level names to apache_beam.egg-info/top_level.txt
writing dependency_links to apache_beam.egg-info/dependency_links.txt
writing entry points to apache_beam.egg-info/entry_points.txt
reading manifest file 'apache_beam.egg-info/SOURCES.txt'
reading manifest template 'MANIFEST.in'
warning: no files found matching 'README.md'
warning: no files found matching 'NOTICE'
warning: no files found matching 'LICENSE'
writing manifest file 'apache_beam.egg-info/SOURCES.txt'
WARNING:root:python-snappy is not installed; some tests will be skipped.
WARNING:root:Tensorflow is not installed, so skipping some tests.
<https://builds.apache.org/job/beam_PostCommit_Py_ValCont/ws/src/sdks/python/apache_beam/runners/dataflow/dataflow_runner.py>:800: BeamDeprecationWarning: options is deprecated since First stable release. References to <pipeline>.options will not be supported
  options = pbegin.pipeline.options.view_as(DebugOptions)
test_wordcount_fnapi_it (apache_beam.examples.wordcount_it_test.WordCountIT) ... ERROR

======================================================================
ERROR: test_wordcount_fnapi_it (apache_beam.examples.wordcount_it_test.WordCountIT)
----------------------------------------------------------------------
Traceback (most recent call last):
  File "<https://builds.apache.org/job/beam_PostCommit_Py_ValCont/ws/src/sdks/python/container/local/lib/python2.7/site-packages/nose/plugins/multiprocess.py",> line 812, in run
    test(orig)
  File "<https://builds.apache.org/job/beam_PostCommit_Py_ValCont/ws/src/sdks/python/container/local/lib/python2.7/site-packages/nose/case.py",> line 45, in __call__
    return self.run(*arg, **kwarg)
  File "<https://builds.apache.org/job/beam_PostCommit_Py_ValCont/ws/src/sdks/python/container/local/lib/python2.7/site-packages/nose/case.py",> line 133, in run
    self.runTest(result)
  File "<https://builds.apache.org/job/beam_PostCommit_Py_ValCont/ws/src/sdks/python/container/local/lib/python2.7/site-packages/nose/case.py",> line 151, in runTest
    test(result)
  File "/usr/lib/python2.7/unittest/case.py", line 393, in __call__
    return self.run(*args, **kwds)
  File "/usr/lib/python2.7/unittest/case.py", line 329, in run
    testMethod()
  File "<https://builds.apache.org/job/beam_PostCommit_Py_ValCont/ws/src/sdks/python/apache_beam/examples/wordcount_it_test.py",> line 51, in test_wordcount_fnapi_it
    self._run_wordcount_it(experiment='beam_fn_api')
  File "<https://builds.apache.org/job/beam_PostCommit_Py_ValCont/ws/src/sdks/python/apache_beam/examples/wordcount_it_test.py",> line 75, in _run_wordcount_it
    wordcount.run(test_pipeline.get_full_options_as_args(**extra_opts))
  File "<https://builds.apache.org/job/beam_PostCommit_Py_ValCont/ws/src/sdks/python/apache_beam/examples/wordcount.py",> line 115, in run
    result = p.run()
  File "<https://builds.apache.org/job/beam_PostCommit_Py_ValCont/ws/src/sdks/python/apache_beam/pipeline.py",> line 405, in run
    self._options).run(False)
  File "<https://builds.apache.org/job/beam_PostCommit_Py_ValCont/ws/src/sdks/python/apache_beam/pipeline.py",> line 418, in run
    return self.runner.run_pipeline(self)
  File "<https://builds.apache.org/job/beam_PostCommit_Py_ValCont/ws/src/sdks/python/apache_beam/runners/dataflow/test_dataflow_runner.py",> line 70, in run_pipeline
    self.result.cancel()
  File "<https://builds.apache.org/job/beam_PostCommit_Py_ValCont/ws/src/sdks/python/apache_beam/runners/dataflow/dataflow_runner.py",> line 1201, in cancel
    self.job_id(), 'JOB_STATE_CANCELLED'):
  File "<https://builds.apache.org/job/beam_PostCommit_Py_ValCont/ws/src/sdks/python/apache_beam/utils/retry.py",> line 184, in wrapper
    return fun(*args, **kwargs)
  File "<https://builds.apache.org/job/beam_PostCommit_Py_ValCont/ws/src/sdks/python/apache_beam/runners/dataflow/internal/apiclient.py",> line 609, in modify_job_state
    self._client.projects_locations_jobs.Update(request)
  File "<https://builds.apache.org/job/beam_PostCommit_Py_ValCont/ws/src/sdks/python/apache_beam/runners/dataflow/internal/clients/dataflow/dataflow_v1b3_client.py",> line 682, in Update
    config, request, global_params=global_params)
  File "<https://builds.apache.org/job/beam_PostCommit_Py_ValCont/ws/src/sdks/python/container/local/lib/python2.7/site-packages/apitools/base/py/base_api.py",> line 729, in _RunMethod
    http, http_request, **opts)
  File "<https://builds.apache.org/job/beam_PostCommit_Py_ValCont/ws/src/sdks/python/container/local/lib/python2.7/site-packages/apitools/base/py/http_wrapper.py",> line 346, in MakeRequest
    check_response_func=check_response_func)
  File "<https://builds.apache.org/job/beam_PostCommit_Py_ValCont/ws/src/sdks/python/container/local/lib/python2.7/site-packages/apitools/base/py/http_wrapper.py",> line 396, in _MakeRequestNoRetry
    redirections=redirections, connection_type=connection_type)
  File "<https://builds.apache.org/job/beam_PostCommit_Py_ValCont/ws/src/sdks/python/container/local/lib/python2.7/site-packages/oauth2client/transport.py",> line 175, in new_request
    redirections, connection_type)
  File "<https://builds.apache.org/job/beam_PostCommit_Py_ValCont/ws/src/sdks/python/container/local/lib/python2.7/site-packages/oauth2client/transport.py",> line 282, in request
    connection_type=connection_type)
  File "<https://builds.apache.org/job/beam_PostCommit_Py_ValCont/ws/src/sdks/python/container/local/lib/python2.7/site-packages/oauth2client/transport.py",> line 175, in new_request
    redirections, connection_type)
  File "<https://builds.apache.org/job/beam_PostCommit_Py_ValCont/ws/src/sdks/python/container/local/lib/python2.7/site-packages/oauth2client/transport.py",> line 282, in request
    connection_type=connection_type)
  File "<https://builds.apache.org/job/beam_PostCommit_Py_ValCont/ws/src/sdks/python/container/local/lib/python2.7/site-packages/httplib2/__init__.py",> line 1694, in request
    (response, content) = self._request(conn, authority, uri, request_uri, method, body, headers, redirections, cachekey)
  File "<https://builds.apache.org/job/beam_PostCommit_Py_ValCont/ws/src/sdks/python/container/local/lib/python2.7/site-packages/httplib2/__init__.py",> line 1434, in _request
    (response, content) = self._conn_request(conn, request_uri, method, body, headers)
  File "<https://builds.apache.org/job/beam_PostCommit_Py_ValCont/ws/src/sdks/python/container/local/lib/python2.7/site-packages/httplib2/__init__.py",> line 1390, in _conn_request
    response = conn.getresponse()
  File "/usr/lib/python2.7/httplib.py", line 1136, in getresponse
    response.begin()
  File "/usr/lib/python2.7/httplib.py", line 453, in begin
    version, status, reason = self._read_status()
  File "/usr/lib/python2.7/httplib.py", line 409, in _read_status
    line = self.fp.readline(_MAXLINE + 1)
  File "/usr/lib/python2.7/socket.py", line 480, in readline
    data = self._sock.recv(self._rbufsize)
  File "/usr/lib/python2.7/ssl.py", line 756, in recv
    return self.read(buflen)
  File "/usr/lib/python2.7/ssl.py", line 643, in read
    v = self._sslobj.read(len)
  File "<https://builds.apache.org/job/beam_PostCommit_Py_ValCont/ws/src/sdks/python/container/local/lib/python2.7/site-packages/nose/plugins/multiprocess.py",> line 276, in signalhandler
    raise TimedOutException()
TimedOutException: 'test_wordcount_fnapi_it (apache_beam.examples.wordcount_it_test.WordCountIT)'

----------------------------------------------------------------------
XML: <https://builds.apache.org/job/beam_PostCommit_Py_ValCont/ws/src/sdks/python/nosetests.xml>
----------------------------------------------------------------------
Ran 1 test in 902.332s

FAILED (errors=1)
cleanup_container
Untagged: us.gcr.io/apache-beam-testing/jenkins/python:20181115-203255
Untagged: us.gcr.io/apache-beam-testing/jenkins/python@sha256:06577c833f24de30118252756d090490e808b06ed88a45e6fb25c8959ff1d56a
Deleted: sha256:b501a7a0654f53667bb1f633766d3d93ee0917dbc7357a87f25db21311b52fc9
Deleted: sha256:bac6b0b5b50a2d1624652c3bd5c53701a9010428261e576df9cf54f10d40e69d
Deleted: sha256:47e07c88ab64be29f59a9d5a9d06a7291e656f37f4980a45a17ba60e028c22f6
Deleted: sha256:fd49cf7c253e8bf0951b659a86b69e3896a0c2804078d435cb312984b5e8d7b8
Deleted: sha256:89ab4164d319d9e4d10d905154cf12c20e7d3556528686a792dd45e98fc111ef
Deleted: sha256:4bdab7a76d762f236a1f673e69461e0acab1954721f39b75224c8d503be4c909
Deleted: sha256:94d1c0afd1672dfd98bdb2f91d1b958e70984d2b0e22f8d886087f09681861f0
Deleted: sha256:4e0c97c393eb44c2be5d2d3e5d216f9505a4342cf56a299a0cec67abcb343769
Deleted: sha256:ab3fb79ff1381914444eb26d394b3b22d40cccb00affde49d9be184ea0baf057
Deleted: sha256:1b97304f366bbf6e531bc20b72ccbda56315390b57ce747771fb1e76ae399bd9
Deleted: sha256:d7d27f39092354faf0eccf9fcab97fb928f658a29da8a52856ebc7132f992cee
Deleted: sha256:532dbd0eeefd4e883e529977e9bb2fb539be6317ba927f84d518f490a6a9c67e
Deleted: sha256:aba3db750d5efd5e7d30dc97529802f96dc6a5db3b15508feef513d57381edb5
Deleted: sha256:aa468d7cc93bf8400da90413b8f4b93014fbfd42e7ad899372896481006cbc80
Digests:
- us.gcr.io/apache-beam-testing/jenkins/python@sha256:06577c833f24de30118252756d090490e808b06ed88a45e6fb25c8959ff1d56a
  Associated tags:
 - 20181115-203255
Tags:
- us.gcr.io/apache-beam-testing/jenkins/python:20181115-203255
Deleted [us.gcr.io/apache-beam-testing/jenkins/python:20181115-203255].
Deleted [us.gcr.io/apache-beam-testing/jenkins/python@sha256:06577c833f24de30118252756d090490e808b06ed88a45e6fb25c8959ff1d56a].
Removed the container
Build step 'Execute shell' marked build as failure

---------------------------------------------------------------------
To unsubscribe, e-mail: builds-unsubscribe@beam.apache.org
For additional commands, e-mail: builds-help@beam.apache.org


Jenkins build is back to normal : beam_PostCommit_Py_ValCont #1442

Posted by Apache Jenkins Server <je...@builds.apache.org>.
See <https://builds.apache.org/job/beam_PostCommit_Py_ValCont/1442/display/redirect?page=changes>


---------------------------------------------------------------------
To unsubscribe, e-mail: builds-unsubscribe@beam.apache.org
For additional commands, e-mail: builds-help@beam.apache.org


Build failed in Jenkins: beam_PostCommit_Py_ValCont #1441

Posted by Apache Jenkins Server <je...@builds.apache.org>.
See <https://builds.apache.org/job/beam_PostCommit_Py_ValCont/1441/display/redirect?page=changes>

Changes:

[lcwik] [BEAM-5674] Add withKeyType to DataflowRunner.Deduplicate internals to

------------------------------------------
[...truncated 172.94 KB...]
copying apache_beam/testing/synthetic_pipeline.py -> apache-beam-2.9.0.dev0/apache_beam/testing
copying apache_beam/testing/synthetic_pipeline_test.py -> apache-beam-2.9.0.dev0/apache_beam/testing
copying apache_beam/testing/test_pipeline.py -> apache-beam-2.9.0.dev0/apache_beam/testing
copying apache_beam/testing/test_pipeline_test.py -> apache-beam-2.9.0.dev0/apache_beam/testing
copying apache_beam/testing/test_stream.py -> apache-beam-2.9.0.dev0/apache_beam/testing
copying apache_beam/testing/test_stream_test.py -> apache-beam-2.9.0.dev0/apache_beam/testing
copying apache_beam/testing/test_utils.py -> apache-beam-2.9.0.dev0/apache_beam/testing
copying apache_beam/testing/test_utils_test.py -> apache-beam-2.9.0.dev0/apache_beam/testing
copying apache_beam/testing/util.py -> apache-beam-2.9.0.dev0/apache_beam/testing
copying apache_beam/testing/util_test.py -> apache-beam-2.9.0.dev0/apache_beam/testing
copying apache_beam/testing/benchmarks/__init__.py -> apache-beam-2.9.0.dev0/apache_beam/testing/benchmarks
copying apache_beam/testing/benchmarks/nexmark/__init__.py -> apache-beam-2.9.0.dev0/apache_beam/testing/benchmarks/nexmark
copying apache_beam/testing/benchmarks/nexmark/nexmark_launcher.py -> apache-beam-2.9.0.dev0/apache_beam/testing/benchmarks/nexmark
copying apache_beam/testing/benchmarks/nexmark/nexmark_util.py -> apache-beam-2.9.0.dev0/apache_beam/testing/benchmarks/nexmark
copying apache_beam/testing/benchmarks/nexmark/models/__init__.py -> apache-beam-2.9.0.dev0/apache_beam/testing/benchmarks/nexmark/models
copying apache_beam/testing/benchmarks/nexmark/models/nexmark_model.py -> apache-beam-2.9.0.dev0/apache_beam/testing/benchmarks/nexmark/models
copying apache_beam/testing/benchmarks/nexmark/queries/__init__.py -> apache-beam-2.9.0.dev0/apache_beam/testing/benchmarks/nexmark/queries
copying apache_beam/testing/benchmarks/nexmark/queries/query0.py -> apache-beam-2.9.0.dev0/apache_beam/testing/benchmarks/nexmark/queries
copying apache_beam/testing/benchmarks/nexmark/queries/query1.py -> apache-beam-2.9.0.dev0/apache_beam/testing/benchmarks/nexmark/queries
copying apache_beam/testing/benchmarks/nexmark/queries/query2.py -> apache-beam-2.9.0.dev0/apache_beam/testing/benchmarks/nexmark/queries
copying apache_beam/testing/data/standard_coders.yaml -> apache-beam-2.9.0.dev0/apache_beam/testing/data
copying apache_beam/testing/data/trigger_transcripts.yaml -> apache-beam-2.9.0.dev0/apache_beam/testing/data
copying apache_beam/testing/load_tests/__init__.py -> apache-beam-2.9.0.dev0/apache_beam/testing/load_tests
copying apache_beam/testing/load_tests/co_group_by_key_test.py -> apache-beam-2.9.0.dev0/apache_beam/testing/load_tests
copying apache_beam/testing/load_tests/combine_test.py -> apache-beam-2.9.0.dev0/apache_beam/testing/load_tests
copying apache_beam/testing/load_tests/group_by_key_test.py -> apache-beam-2.9.0.dev0/apache_beam/testing/load_tests
copying apache_beam/testing/load_tests/load_test_metrics_utils.py -> apache-beam-2.9.0.dev0/apache_beam/testing/load_tests
copying apache_beam/testing/load_tests/pardo_test.py -> apache-beam-2.9.0.dev0/apache_beam/testing/load_tests
copying apache_beam/tools/__init__.py -> apache-beam-2.9.0.dev0/apache_beam/tools
copying apache_beam/tools/coders_microbenchmark.py -> apache-beam-2.9.0.dev0/apache_beam/tools
copying apache_beam/tools/distribution_counter_microbenchmark.py -> apache-beam-2.9.0.dev0/apache_beam/tools
copying apache_beam/tools/map_fn_microbenchmark.py -> apache-beam-2.9.0.dev0/apache_beam/tools
copying apache_beam/tools/microbenchmarks_test.py -> apache-beam-2.9.0.dev0/apache_beam/tools
copying apache_beam/tools/sideinput_microbenchmark.py -> apache-beam-2.9.0.dev0/apache_beam/tools
copying apache_beam/tools/utils.py -> apache-beam-2.9.0.dev0/apache_beam/tools
copying apache_beam/transforms/__init__.py -> apache-beam-2.9.0.dev0/apache_beam/transforms
copying apache_beam/transforms/combiners.py -> apache-beam-2.9.0.dev0/apache_beam/transforms
copying apache_beam/transforms/combiners_test.py -> apache-beam-2.9.0.dev0/apache_beam/transforms
copying apache_beam/transforms/core.py -> apache-beam-2.9.0.dev0/apache_beam/transforms
copying apache_beam/transforms/create_source.py -> apache-beam-2.9.0.dev0/apache_beam/transforms
copying apache_beam/transforms/create_test.py -> apache-beam-2.9.0.dev0/apache_beam/transforms
copying apache_beam/transforms/cy_combiners.pxd -> apache-beam-2.9.0.dev0/apache_beam/transforms
copying apache_beam/transforms/cy_combiners.py -> apache-beam-2.9.0.dev0/apache_beam/transforms
copying apache_beam/transforms/cy_dataflow_distribution_counter.pxd -> apache-beam-2.9.0.dev0/apache_beam/transforms
copying apache_beam/transforms/cy_dataflow_distribution_counter.pyx -> apache-beam-2.9.0.dev0/apache_beam/transforms
copying apache_beam/transforms/dataflow_distribution_counter_test.py -> apache-beam-2.9.0.dev0/apache_beam/transforms
copying apache_beam/transforms/display.py -> apache-beam-2.9.0.dev0/apache_beam/transforms
copying apache_beam/transforms/display_test.py -> apache-beam-2.9.0.dev0/apache_beam/transforms
copying apache_beam/transforms/ptransform.py -> apache-beam-2.9.0.dev0/apache_beam/transforms
copying apache_beam/transforms/ptransform_test.py -> apache-beam-2.9.0.dev0/apache_beam/transforms
copying apache_beam/transforms/py_dataflow_distribution_counter.py -> apache-beam-2.9.0.dev0/apache_beam/transforms
copying apache_beam/transforms/sideinputs.py -> apache-beam-2.9.0.dev0/apache_beam/transforms
copying apache_beam/transforms/sideinputs_test.py -> apache-beam-2.9.0.dev0/apache_beam/transforms
copying apache_beam/transforms/timeutil.py -> apache-beam-2.9.0.dev0/apache_beam/transforms
copying apache_beam/transforms/trigger.py -> apache-beam-2.9.0.dev0/apache_beam/transforms
copying apache_beam/transforms/trigger_test.py -> apache-beam-2.9.0.dev0/apache_beam/transforms
copying apache_beam/transforms/userstate.py -> apache-beam-2.9.0.dev0/apache_beam/transforms
copying apache_beam/transforms/userstate_test.py -> apache-beam-2.9.0.dev0/apache_beam/transforms
copying apache_beam/transforms/util.py -> apache-beam-2.9.0.dev0/apache_beam/transforms
copying apache_beam/transforms/util_test.py -> apache-beam-2.9.0.dev0/apache_beam/transforms
copying apache_beam/transforms/window.py -> apache-beam-2.9.0.dev0/apache_beam/transforms
copying apache_beam/transforms/window_test.py -> apache-beam-2.9.0.dev0/apache_beam/transforms
copying apache_beam/transforms/write_ptransform_test.py -> apache-beam-2.9.0.dev0/apache_beam/transforms
copying apache_beam/typehints/__init__.py -> apache-beam-2.9.0.dev0/apache_beam/typehints
copying apache_beam/typehints/decorators.py -> apache-beam-2.9.0.dev0/apache_beam/typehints
copying apache_beam/typehints/native_type_compatibility.py -> apache-beam-2.9.0.dev0/apache_beam/typehints
copying apache_beam/typehints/native_type_compatibility_test.py -> apache-beam-2.9.0.dev0/apache_beam/typehints
copying apache_beam/typehints/opcodes.py -> apache-beam-2.9.0.dev0/apache_beam/typehints
copying apache_beam/typehints/trivial_inference.py -> apache-beam-2.9.0.dev0/apache_beam/typehints
copying apache_beam/typehints/trivial_inference_test.py -> apache-beam-2.9.0.dev0/apache_beam/typehints
copying apache_beam/typehints/typecheck.py -> apache-beam-2.9.0.dev0/apache_beam/typehints
copying apache_beam/typehints/typed_pipeline_test.py -> apache-beam-2.9.0.dev0/apache_beam/typehints
copying apache_beam/typehints/typehints.py -> apache-beam-2.9.0.dev0/apache_beam/typehints
copying apache_beam/typehints/typehints_test.py -> apache-beam-2.9.0.dev0/apache_beam/typehints
copying apache_beam/utils/__init__.py -> apache-beam-2.9.0.dev0/apache_beam/utils
copying apache_beam/utils/annotations.py -> apache-beam-2.9.0.dev0/apache_beam/utils
copying apache_beam/utils/annotations_test.py -> apache-beam-2.9.0.dev0/apache_beam/utils
copying apache_beam/utils/counters.pxd -> apache-beam-2.9.0.dev0/apache_beam/utils
copying apache_beam/utils/counters.py -> apache-beam-2.9.0.dev0/apache_beam/utils
copying apache_beam/utils/counters_test.py -> apache-beam-2.9.0.dev0/apache_beam/utils
copying apache_beam/utils/plugin.py -> apache-beam-2.9.0.dev0/apache_beam/utils
copying apache_beam/utils/processes.py -> apache-beam-2.9.0.dev0/apache_beam/utils
copying apache_beam/utils/processes_test.py -> apache-beam-2.9.0.dev0/apache_beam/utils
copying apache_beam/utils/profiler.py -> apache-beam-2.9.0.dev0/apache_beam/utils
copying apache_beam/utils/proto_utils.py -> apache-beam-2.9.0.dev0/apache_beam/utils
copying apache_beam/utils/retry.py -> apache-beam-2.9.0.dev0/apache_beam/utils
copying apache_beam/utils/retry_test.py -> apache-beam-2.9.0.dev0/apache_beam/utils
copying apache_beam/utils/timestamp.py -> apache-beam-2.9.0.dev0/apache_beam/utils
copying apache_beam/utils/timestamp_test.py -> apache-beam-2.9.0.dev0/apache_beam/utils
copying apache_beam/utils/urns.py -> apache-beam-2.9.0.dev0/apache_beam/utils
copying apache_beam/utils/windowed_value.pxd -> apache-beam-2.9.0.dev0/apache_beam/utils
copying apache_beam/utils/windowed_value.py -> apache-beam-2.9.0.dev0/apache_beam/utils
copying apache_beam/utils/windowed_value_test.py -> apache-beam-2.9.0.dev0/apache_beam/utils
Writing apache-beam-2.9.0.dev0/setup.cfg
creating dist
Creating tar archive
removing 'apache-beam-2.9.0.dev0' (and everything under it)
SDK_LOCATION=$(find dist/apache-beam-*.tar.gz)
find dist/apache-beam-*.tar.gz

# Run ValidatesRunner tests on Google Cloud Dataflow service
echo ">>> RUNNING DATAFLOW RUNNER VALIDATESCONTAINER TEST"
>>> RUNNING DATAFLOW RUNNER VALIDATESCONTAINER TEST
python setup.py nosetests \
  --attr ValidatesContainer \
  --nologcapture \
  --processes=1 \
  --process-timeout=900 \
  --test-pipeline-options=" \
    --runner=TestDataflowRunner \
    --project=$PROJECT \
    --worker_harness_container_image=$CONTAINER:$TAG \
    --staging_location=$GCS_LOCATION/staging-validatesrunner-test \
    --temp_location=$GCS_LOCATION/temp-validatesrunner-test \
    --output=$GCS_LOCATION/output \
    --sdk_location=$SDK_LOCATION \
    --num_workers=1"
<https://builds.apache.org/job/beam_PostCommit_Py_ValCont/ws/src/sdks/python/container/local/lib/python2.7/site-packages/setuptools/dist.py>:470: UserWarning: Normalizing '2.9.0.dev' to '2.9.0.dev0'
  normalized_version,
running nosetests
running egg_info
<https://builds.apache.org/job/beam_PostCommit_Py_ValCont/ws/src/sdks/python/gen_protos.py>:52: UserWarning: Installing grpcio-tools is recommended for development.
  warnings.warn('Installing grpcio-tools is recommended for development.')
writing requirements to apache_beam.egg-info/requires.txt
writing apache_beam.egg-info/PKG-INFO
writing top-level names to apache_beam.egg-info/top_level.txt
writing dependency_links to apache_beam.egg-info/dependency_links.txt
writing entry points to apache_beam.egg-info/entry_points.txt
reading manifest file 'apache_beam.egg-info/SOURCES.txt'
reading manifest template 'MANIFEST.in'
warning: no files found matching 'README.md'
warning: no files found matching 'NOTICE'
warning: no files found matching 'LICENSE'
writing manifest file 'apache_beam.egg-info/SOURCES.txt'
WARNING:root:python-snappy is not installed; some tests will be skipped.
WARNING:root:Tensorflow is not installed, so skipping some tests.
<https://builds.apache.org/job/beam_PostCommit_Py_ValCont/ws/src/sdks/python/apache_beam/runners/dataflow/dataflow_runner.py>:800: BeamDeprecationWarning: options is deprecated since First stable release. References to <pipeline>.options will not be supported
  options = pbegin.pipeline.options.view_as(DebugOptions)
test_wordcount_fnapi_it (apache_beam.examples.wordcount_it_test.WordCountIT) ... ERROR

======================================================================
ERROR: test_wordcount_fnapi_it (apache_beam.examples.wordcount_it_test.WordCountIT)
----------------------------------------------------------------------
Traceback (most recent call last):
  File "<https://builds.apache.org/job/beam_PostCommit_Py_ValCont/ws/src/sdks/python/container/local/lib/python2.7/site-packages/nose/plugins/multiprocess.py",> line 812, in run
    test(orig)
  File "<https://builds.apache.org/job/beam_PostCommit_Py_ValCont/ws/src/sdks/python/container/local/lib/python2.7/site-packages/nose/case.py",> line 45, in __call__
    return self.run(*arg, **kwarg)
  File "<https://builds.apache.org/job/beam_PostCommit_Py_ValCont/ws/src/sdks/python/container/local/lib/python2.7/site-packages/nose/case.py",> line 133, in run
    self.runTest(result)
  File "<https://builds.apache.org/job/beam_PostCommit_Py_ValCont/ws/src/sdks/python/container/local/lib/python2.7/site-packages/nose/case.py",> line 151, in runTest
    test(result)
  File "/usr/lib/python2.7/unittest/case.py", line 393, in __call__
    return self.run(*args, **kwds)
  File "/usr/lib/python2.7/unittest/case.py", line 329, in run
    testMethod()
  File "<https://builds.apache.org/job/beam_PostCommit_Py_ValCont/ws/src/sdks/python/apache_beam/examples/wordcount_it_test.py",> line 51, in test_wordcount_fnapi_it
    self._run_wordcount_it(experiment='beam_fn_api')
  File "<https://builds.apache.org/job/beam_PostCommit_Py_ValCont/ws/src/sdks/python/apache_beam/examples/wordcount_it_test.py",> line 75, in _run_wordcount_it
    wordcount.run(test_pipeline.get_full_options_as_args(**extra_opts))
  File "<https://builds.apache.org/job/beam_PostCommit_Py_ValCont/ws/src/sdks/python/apache_beam/examples/wordcount.py",> line 115, in run
    result = p.run()
  File "<https://builds.apache.org/job/beam_PostCommit_Py_ValCont/ws/src/sdks/python/apache_beam/pipeline.py",> line 405, in run
    self._options).run(False)
  File "<https://builds.apache.org/job/beam_PostCommit_Py_ValCont/ws/src/sdks/python/apache_beam/pipeline.py",> line 418, in run
    return self.runner.run_pipeline(self)
  File "<https://builds.apache.org/job/beam_PostCommit_Py_ValCont/ws/src/sdks/python/apache_beam/runners/dataflow/test_dataflow_runner.py",> line 70, in run_pipeline
    self.result.cancel()
  File "<https://builds.apache.org/job/beam_PostCommit_Py_ValCont/ws/src/sdks/python/apache_beam/runners/dataflow/dataflow_runner.py",> line 1208, in cancel
    return self.state
  File "<https://builds.apache.org/job/beam_PostCommit_Py_ValCont/ws/src/sdks/python/apache_beam/runners/dataflow/dataflow_runner.py",> line 1148, in state
    self._update_job()
  File "<https://builds.apache.org/job/beam_PostCommit_Py_ValCont/ws/src/sdks/python/apache_beam/runners/dataflow/dataflow_runner.py",> line 1104, in _update_job
    self._job = self._runner.dataflow_client.get_job(self.job_id())
  File "<https://builds.apache.org/job/beam_PostCommit_Py_ValCont/ws/src/sdks/python/apache_beam/utils/retry.py",> line 184, in wrapper
    return fun(*args, **kwargs)
  File "<https://builds.apache.org/job/beam_PostCommit_Py_ValCont/ws/src/sdks/python/apache_beam/runners/dataflow/internal/apiclient.py",> line 639, in get_job
    response = self._client.projects_locations_jobs.Get(request)
  File "<https://builds.apache.org/job/beam_PostCommit_Py_ValCont/ws/src/sdks/python/apache_beam/runners/dataflow/internal/clients/dataflow/dataflow_v1b3_client.py",> line 605, in Get
    config, request, global_params=global_params)
  File "<https://builds.apache.org/job/beam_PostCommit_Py_ValCont/ws/src/sdks/python/container/local/lib/python2.7/site-packages/apitools/base/py/base_api.py",> line 729, in _RunMethod
    http, http_request, **opts)
  File "<https://builds.apache.org/job/beam_PostCommit_Py_ValCont/ws/src/sdks/python/container/local/lib/python2.7/site-packages/apitools/base/py/http_wrapper.py",> line 346, in MakeRequest
    check_response_func=check_response_func)
  File "<https://builds.apache.org/job/beam_PostCommit_Py_ValCont/ws/src/sdks/python/container/local/lib/python2.7/site-packages/apitools/base/py/http_wrapper.py",> line 396, in _MakeRequestNoRetry
    redirections=redirections, connection_type=connection_type)
  File "<https://builds.apache.org/job/beam_PostCommit_Py_ValCont/ws/src/sdks/python/container/local/lib/python2.7/site-packages/oauth2client/transport.py",> line 175, in new_request
    redirections, connection_type)
  File "<https://builds.apache.org/job/beam_PostCommit_Py_ValCont/ws/src/sdks/python/container/local/lib/python2.7/site-packages/oauth2client/transport.py",> line 282, in request
    connection_type=connection_type)
  File "<https://builds.apache.org/job/beam_PostCommit_Py_ValCont/ws/src/sdks/python/container/local/lib/python2.7/site-packages/oauth2client/transport.py",> line 175, in new_request
    redirections, connection_type)
  File "<https://builds.apache.org/job/beam_PostCommit_Py_ValCont/ws/src/sdks/python/container/local/lib/python2.7/site-packages/oauth2client/transport.py",> line 282, in request
    connection_type=connection_type)
  File "<https://builds.apache.org/job/beam_PostCommit_Py_ValCont/ws/src/sdks/python/container/local/lib/python2.7/site-packages/httplib2/__init__.py",> line 1694, in request
    (response, content) = self._request(conn, authority, uri, request_uri, method, body, headers, redirections, cachekey)
  File "<https://builds.apache.org/job/beam_PostCommit_Py_ValCont/ws/src/sdks/python/container/local/lib/python2.7/site-packages/httplib2/__init__.py",> line 1434, in _request
    (response, content) = self._conn_request(conn, request_uri, method, body, headers)
  File "<https://builds.apache.org/job/beam_PostCommit_Py_ValCont/ws/src/sdks/python/container/local/lib/python2.7/site-packages/httplib2/__init__.py",> line 1390, in _conn_request
    response = conn.getresponse()
  File "/usr/lib/python2.7/httplib.py", line 1136, in getresponse
    response.begin()
  File "/usr/lib/python2.7/httplib.py", line 453, in begin
    version, status, reason = self._read_status()
  File "/usr/lib/python2.7/httplib.py", line 409, in _read_status
    line = self.fp.readline(_MAXLINE + 1)
  File "/usr/lib/python2.7/socket.py", line 480, in readline
    data = self._sock.recv(self._rbufsize)
  File "/usr/lib/python2.7/ssl.py", line 756, in recv
    return self.read(buflen)
  File "/usr/lib/python2.7/ssl.py", line 643, in read
    v = self._sslobj.read(len)
  File "<https://builds.apache.org/job/beam_PostCommit_Py_ValCont/ws/src/sdks/python/container/local/lib/python2.7/site-packages/nose/plugins/multiprocess.py",> line 276, in signalhandler
    raise TimedOutException()
TimedOutException: 'test_wordcount_fnapi_it (apache_beam.examples.wordcount_it_test.WordCountIT)'

----------------------------------------------------------------------
XML: <https://builds.apache.org/job/beam_PostCommit_Py_ValCont/ws/src/sdks/python/nosetests.xml>
----------------------------------------------------------------------
Ran 1 test in 902.150s

FAILED (errors=1)
cleanup_container
Untagged: us.gcr.io/apache-beam-testing/jenkins/python:20181116-161408
Untagged: us.gcr.io/apache-beam-testing/jenkins/python@sha256:fb07561e48dee3dbfbac9b85b0a91660ec59916f5b6371724b751516ac9cd8a6
Deleted: sha256:8653093ff38ad3446cb27179fdab90f10b07946231e25ed550437e6b81002d18
Deleted: sha256:b670ac38bfd09d20fb1add69722e6879b37d37375680b640314993e6c3aec18f
Deleted: sha256:8d27e4578191e6c61bcb10348e321bad58eb6efbff518ca46610d3959f5f7374
Deleted: sha256:aa5905dcf33c657350f0b329c57fb21fac57069918152fb21d69e010183b2761
Deleted: sha256:39fb40b789a74827a19015581f56283947125ca7c6653987c2c31bd29e752b9f
Deleted: sha256:ddce2658c6270a220b207218a196c0f85637add1b66efb56d70ba0e14dc4ce6b
Deleted: sha256:2ff9e669fe457e7517e4369ea24dbba0184d0c2884c9d2efef6bacf1b7e33347
Deleted: sha256:b18248ec2359c42c38b9bd989967debebd3534be8d669f4f30de46f386124737
Deleted: sha256:20dd70c142a29dd95001fa3a195bce4d0e86a4cfcec117686ec1244acad8ef3d
Deleted: sha256:311855c1443c7f47101041f260f08ca93ccf46ce301168dd292930128c2a16d2
Deleted: sha256:1a1a19f97bb0349b93d276c8a61ee9d229bd98d191af1c13a342efd52c324d7c
Deleted: sha256:e31217e306cc304eef6ce71f05415e212a9cdecda428cc0fab0ae0548cc5c631
Deleted: sha256:4b0a63bfa29dc82480023d0e8167a91575a1b3f9cbcdf162deb3e1edef7958fe
Deleted: sha256:9b135d047fb930a86f71af66f76cc1a5743043e108f2076e4148898842e195ab
Digests:
- us.gcr.io/apache-beam-testing/jenkins/python@sha256:fb07561e48dee3dbfbac9b85b0a91660ec59916f5b6371724b751516ac9cd8a6
  Associated tags:
 - 20181116-161408
Tags:
- us.gcr.io/apache-beam-testing/jenkins/python:20181116-161408
Deleted [us.gcr.io/apache-beam-testing/jenkins/python:20181116-161408].
Deleted [us.gcr.io/apache-beam-testing/jenkins/python@sha256:fb07561e48dee3dbfbac9b85b0a91660ec59916f5b6371724b751516ac9cd8a6].
Removed the container
Build step 'Execute shell' marked build as failure

---------------------------------------------------------------------
To unsubscribe, e-mail: builds-unsubscribe@beam.apache.org
For additional commands, e-mail: builds-help@beam.apache.org


Build failed in Jenkins: beam_PostCommit_Py_ValCont #1440

Posted by Apache Jenkins Server <je...@builds.apache.org>.
See <https://builds.apache.org/job/beam_PostCommit_Py_ValCont/1440/display/redirect?page=changes>

Changes:

[fabien.rousseau] [BEAM-6078] Use builder's keyspace by default when using

------------------------------------------
[...truncated 172.96 KB...]
copying apache_beam/testing/synthetic_pipeline.py -> apache-beam-2.9.0.dev0/apache_beam/testing
copying apache_beam/testing/synthetic_pipeline_test.py -> apache-beam-2.9.0.dev0/apache_beam/testing
copying apache_beam/testing/test_pipeline.py -> apache-beam-2.9.0.dev0/apache_beam/testing
copying apache_beam/testing/test_pipeline_test.py -> apache-beam-2.9.0.dev0/apache_beam/testing
copying apache_beam/testing/test_stream.py -> apache-beam-2.9.0.dev0/apache_beam/testing
copying apache_beam/testing/test_stream_test.py -> apache-beam-2.9.0.dev0/apache_beam/testing
copying apache_beam/testing/test_utils.py -> apache-beam-2.9.0.dev0/apache_beam/testing
copying apache_beam/testing/test_utils_test.py -> apache-beam-2.9.0.dev0/apache_beam/testing
copying apache_beam/testing/util.py -> apache-beam-2.9.0.dev0/apache_beam/testing
copying apache_beam/testing/util_test.py -> apache-beam-2.9.0.dev0/apache_beam/testing
copying apache_beam/testing/benchmarks/__init__.py -> apache-beam-2.9.0.dev0/apache_beam/testing/benchmarks
copying apache_beam/testing/benchmarks/nexmark/__init__.py -> apache-beam-2.9.0.dev0/apache_beam/testing/benchmarks/nexmark
copying apache_beam/testing/benchmarks/nexmark/nexmark_launcher.py -> apache-beam-2.9.0.dev0/apache_beam/testing/benchmarks/nexmark
copying apache_beam/testing/benchmarks/nexmark/nexmark_util.py -> apache-beam-2.9.0.dev0/apache_beam/testing/benchmarks/nexmark
copying apache_beam/testing/benchmarks/nexmark/models/__init__.py -> apache-beam-2.9.0.dev0/apache_beam/testing/benchmarks/nexmark/models
copying apache_beam/testing/benchmarks/nexmark/models/nexmark_model.py -> apache-beam-2.9.0.dev0/apache_beam/testing/benchmarks/nexmark/models
copying apache_beam/testing/benchmarks/nexmark/queries/__init__.py -> apache-beam-2.9.0.dev0/apache_beam/testing/benchmarks/nexmark/queries
copying apache_beam/testing/benchmarks/nexmark/queries/query0.py -> apache-beam-2.9.0.dev0/apache_beam/testing/benchmarks/nexmark/queries
copying apache_beam/testing/benchmarks/nexmark/queries/query1.py -> apache-beam-2.9.0.dev0/apache_beam/testing/benchmarks/nexmark/queries
copying apache_beam/testing/benchmarks/nexmark/queries/query2.py -> apache-beam-2.9.0.dev0/apache_beam/testing/benchmarks/nexmark/queries
copying apache_beam/testing/data/standard_coders.yaml -> apache-beam-2.9.0.dev0/apache_beam/testing/data
copying apache_beam/testing/data/trigger_transcripts.yaml -> apache-beam-2.9.0.dev0/apache_beam/testing/data
copying apache_beam/testing/load_tests/__init__.py -> apache-beam-2.9.0.dev0/apache_beam/testing/load_tests
copying apache_beam/testing/load_tests/co_group_by_key_test.py -> apache-beam-2.9.0.dev0/apache_beam/testing/load_tests
copying apache_beam/testing/load_tests/combine_test.py -> apache-beam-2.9.0.dev0/apache_beam/testing/load_tests
copying apache_beam/testing/load_tests/group_by_key_test.py -> apache-beam-2.9.0.dev0/apache_beam/testing/load_tests
copying apache_beam/testing/load_tests/load_test_metrics_utils.py -> apache-beam-2.9.0.dev0/apache_beam/testing/load_tests
copying apache_beam/testing/load_tests/pardo_test.py -> apache-beam-2.9.0.dev0/apache_beam/testing/load_tests
copying apache_beam/tools/__init__.py -> apache-beam-2.9.0.dev0/apache_beam/tools
copying apache_beam/tools/coders_microbenchmark.py -> apache-beam-2.9.0.dev0/apache_beam/tools
copying apache_beam/tools/distribution_counter_microbenchmark.py -> apache-beam-2.9.0.dev0/apache_beam/tools
copying apache_beam/tools/map_fn_microbenchmark.py -> apache-beam-2.9.0.dev0/apache_beam/tools
copying apache_beam/tools/microbenchmarks_test.py -> apache-beam-2.9.0.dev0/apache_beam/tools
copying apache_beam/tools/sideinput_microbenchmark.py -> apache-beam-2.9.0.dev0/apache_beam/tools
copying apache_beam/tools/utils.py -> apache-beam-2.9.0.dev0/apache_beam/tools
copying apache_beam/transforms/__init__.py -> apache-beam-2.9.0.dev0/apache_beam/transforms
copying apache_beam/transforms/combiners.py -> apache-beam-2.9.0.dev0/apache_beam/transforms
copying apache_beam/transforms/combiners_test.py -> apache-beam-2.9.0.dev0/apache_beam/transforms
copying apache_beam/transforms/core.py -> apache-beam-2.9.0.dev0/apache_beam/transforms
copying apache_beam/transforms/create_source.py -> apache-beam-2.9.0.dev0/apache_beam/transforms
copying apache_beam/transforms/create_test.py -> apache-beam-2.9.0.dev0/apache_beam/transforms
copying apache_beam/transforms/cy_combiners.pxd -> apache-beam-2.9.0.dev0/apache_beam/transforms
copying apache_beam/transforms/cy_combiners.py -> apache-beam-2.9.0.dev0/apache_beam/transforms
copying apache_beam/transforms/cy_dataflow_distribution_counter.pxd -> apache-beam-2.9.0.dev0/apache_beam/transforms
copying apache_beam/transforms/cy_dataflow_distribution_counter.pyx -> apache-beam-2.9.0.dev0/apache_beam/transforms
copying apache_beam/transforms/dataflow_distribution_counter_test.py -> apache-beam-2.9.0.dev0/apache_beam/transforms
copying apache_beam/transforms/display.py -> apache-beam-2.9.0.dev0/apache_beam/transforms
copying apache_beam/transforms/display_test.py -> apache-beam-2.9.0.dev0/apache_beam/transforms
copying apache_beam/transforms/ptransform.py -> apache-beam-2.9.0.dev0/apache_beam/transforms
copying apache_beam/transforms/ptransform_test.py -> apache-beam-2.9.0.dev0/apache_beam/transforms
copying apache_beam/transforms/py_dataflow_distribution_counter.py -> apache-beam-2.9.0.dev0/apache_beam/transforms
copying apache_beam/transforms/sideinputs.py -> apache-beam-2.9.0.dev0/apache_beam/transforms
copying apache_beam/transforms/sideinputs_test.py -> apache-beam-2.9.0.dev0/apache_beam/transforms
copying apache_beam/transforms/timeutil.py -> apache-beam-2.9.0.dev0/apache_beam/transforms
copying apache_beam/transforms/trigger.py -> apache-beam-2.9.0.dev0/apache_beam/transforms
copying apache_beam/transforms/trigger_test.py -> apache-beam-2.9.0.dev0/apache_beam/transforms
copying apache_beam/transforms/userstate.py -> apache-beam-2.9.0.dev0/apache_beam/transforms
copying apache_beam/transforms/userstate_test.py -> apache-beam-2.9.0.dev0/apache_beam/transforms
copying apache_beam/transforms/util.py -> apache-beam-2.9.0.dev0/apache_beam/transforms
copying apache_beam/transforms/util_test.py -> apache-beam-2.9.0.dev0/apache_beam/transforms
copying apache_beam/transforms/window.py -> apache-beam-2.9.0.dev0/apache_beam/transforms
copying apache_beam/transforms/window_test.py -> apache-beam-2.9.0.dev0/apache_beam/transforms
copying apache_beam/transforms/write_ptransform_test.py -> apache-beam-2.9.0.dev0/apache_beam/transforms
copying apache_beam/typehints/__init__.py -> apache-beam-2.9.0.dev0/apache_beam/typehints
copying apache_beam/typehints/decorators.py -> apache-beam-2.9.0.dev0/apache_beam/typehints
copying apache_beam/typehints/native_type_compatibility.py -> apache-beam-2.9.0.dev0/apache_beam/typehints
copying apache_beam/typehints/native_type_compatibility_test.py -> apache-beam-2.9.0.dev0/apache_beam/typehints
copying apache_beam/typehints/opcodes.py -> apache-beam-2.9.0.dev0/apache_beam/typehints
copying apache_beam/typehints/trivial_inference.py -> apache-beam-2.9.0.dev0/apache_beam/typehints
copying apache_beam/typehints/trivial_inference_test.py -> apache-beam-2.9.0.dev0/apache_beam/typehints
copying apache_beam/typehints/typecheck.py -> apache-beam-2.9.0.dev0/apache_beam/typehints
copying apache_beam/typehints/typed_pipeline_test.py -> apache-beam-2.9.0.dev0/apache_beam/typehints
copying apache_beam/typehints/typehints.py -> apache-beam-2.9.0.dev0/apache_beam/typehints
copying apache_beam/typehints/typehints_test.py -> apache-beam-2.9.0.dev0/apache_beam/typehints
copying apache_beam/utils/__init__.py -> apache-beam-2.9.0.dev0/apache_beam/utils
copying apache_beam/utils/annotations.py -> apache-beam-2.9.0.dev0/apache_beam/utils
copying apache_beam/utils/annotations_test.py -> apache-beam-2.9.0.dev0/apache_beam/utils
copying apache_beam/utils/counters.pxd -> apache-beam-2.9.0.dev0/apache_beam/utils
copying apache_beam/utils/counters.py -> apache-beam-2.9.0.dev0/apache_beam/utils
copying apache_beam/utils/counters_test.py -> apache-beam-2.9.0.dev0/apache_beam/utils
copying apache_beam/utils/plugin.py -> apache-beam-2.9.0.dev0/apache_beam/utils
copying apache_beam/utils/processes.py -> apache-beam-2.9.0.dev0/apache_beam/utils
copying apache_beam/utils/processes_test.py -> apache-beam-2.9.0.dev0/apache_beam/utils
copying apache_beam/utils/profiler.py -> apache-beam-2.9.0.dev0/apache_beam/utils
copying apache_beam/utils/proto_utils.py -> apache-beam-2.9.0.dev0/apache_beam/utils
copying apache_beam/utils/retry.py -> apache-beam-2.9.0.dev0/apache_beam/utils
copying apache_beam/utils/retry_test.py -> apache-beam-2.9.0.dev0/apache_beam/utils
copying apache_beam/utils/timestamp.py -> apache-beam-2.9.0.dev0/apache_beam/utils
copying apache_beam/utils/timestamp_test.py -> apache-beam-2.9.0.dev0/apache_beam/utils
copying apache_beam/utils/urns.py -> apache-beam-2.9.0.dev0/apache_beam/utils
copying apache_beam/utils/windowed_value.pxd -> apache-beam-2.9.0.dev0/apache_beam/utils
copying apache_beam/utils/windowed_value.py -> apache-beam-2.9.0.dev0/apache_beam/utils
copying apache_beam/utils/windowed_value_test.py -> apache-beam-2.9.0.dev0/apache_beam/utils
Writing apache-beam-2.9.0.dev0/setup.cfg
creating dist
Creating tar archive
removing 'apache-beam-2.9.0.dev0' (and everything under it)
SDK_LOCATION=$(find dist/apache-beam-*.tar.gz)
find dist/apache-beam-*.tar.gz

# Run ValidatesRunner tests on Google Cloud Dataflow service
echo ">>> RUNNING DATAFLOW RUNNER VALIDATESCONTAINER TEST"
>>> RUNNING DATAFLOW RUNNER VALIDATESCONTAINER TEST
python setup.py nosetests \
  --attr ValidatesContainer \
  --nologcapture \
  --processes=1 \
  --process-timeout=900 \
  --test-pipeline-options=" \
    --runner=TestDataflowRunner \
    --project=$PROJECT \
    --worker_harness_container_image=$CONTAINER:$TAG \
    --staging_location=$GCS_LOCATION/staging-validatesrunner-test \
    --temp_location=$GCS_LOCATION/temp-validatesrunner-test \
    --output=$GCS_LOCATION/output \
    --sdk_location=$SDK_LOCATION \
    --num_workers=1"
<https://builds.apache.org/job/beam_PostCommit_Py_ValCont/ws/src/sdks/python/container/local/lib/python2.7/site-packages/setuptools/dist.py>:470: UserWarning: Normalizing '2.9.0.dev' to '2.9.0.dev0'
  normalized_version,
running nosetests
running egg_info
<https://builds.apache.org/job/beam_PostCommit_Py_ValCont/ws/src/sdks/python/gen_protos.py>:52: UserWarning: Installing grpcio-tools is recommended for development.
  warnings.warn('Installing grpcio-tools is recommended for development.')
writing requirements to apache_beam.egg-info/requires.txt
writing apache_beam.egg-info/PKG-INFO
writing top-level names to apache_beam.egg-info/top_level.txt
writing dependency_links to apache_beam.egg-info/dependency_links.txt
writing entry points to apache_beam.egg-info/entry_points.txt
reading manifest file 'apache_beam.egg-info/SOURCES.txt'
reading manifest template 'MANIFEST.in'
warning: no files found matching 'README.md'
warning: no files found matching 'NOTICE'
warning: no files found matching 'LICENSE'
writing manifest file 'apache_beam.egg-info/SOURCES.txt'
WARNING:root:python-snappy is not installed; some tests will be skipped.
WARNING:root:Tensorflow is not installed, so skipping some tests.
<https://builds.apache.org/job/beam_PostCommit_Py_ValCont/ws/src/sdks/python/apache_beam/runners/dataflow/dataflow_runner.py>:800: BeamDeprecationWarning: options is deprecated since First stable release. References to <pipeline>.options will not be supported
  options = pbegin.pipeline.options.view_as(DebugOptions)
test_wordcount_fnapi_it (apache_beam.examples.wordcount_it_test.WordCountIT) ... ERROR

======================================================================
ERROR: test_wordcount_fnapi_it (apache_beam.examples.wordcount_it_test.WordCountIT)
----------------------------------------------------------------------
Traceback (most recent call last):
  File "<https://builds.apache.org/job/beam_PostCommit_Py_ValCont/ws/src/sdks/python/container/local/lib/python2.7/site-packages/nose/plugins/multiprocess.py",> line 812, in run
    test(orig)
  File "<https://builds.apache.org/job/beam_PostCommit_Py_ValCont/ws/src/sdks/python/container/local/lib/python2.7/site-packages/nose/case.py",> line 45, in __call__
    return self.run(*arg, **kwarg)
  File "<https://builds.apache.org/job/beam_PostCommit_Py_ValCont/ws/src/sdks/python/container/local/lib/python2.7/site-packages/nose/case.py",> line 133, in run
    self.runTest(result)
  File "<https://builds.apache.org/job/beam_PostCommit_Py_ValCont/ws/src/sdks/python/container/local/lib/python2.7/site-packages/nose/case.py",> line 151, in runTest
    test(result)
  File "/usr/lib/python2.7/unittest/case.py", line 393, in __call__
    return self.run(*args, **kwds)
  File "/usr/lib/python2.7/unittest/case.py", line 329, in run
    testMethod()
  File "<https://builds.apache.org/job/beam_PostCommit_Py_ValCont/ws/src/sdks/python/apache_beam/examples/wordcount_it_test.py",> line 51, in test_wordcount_fnapi_it
    self._run_wordcount_it(experiment='beam_fn_api')
  File "<https://builds.apache.org/job/beam_PostCommit_Py_ValCont/ws/src/sdks/python/apache_beam/examples/wordcount_it_test.py",> line 75, in _run_wordcount_it
    wordcount.run(test_pipeline.get_full_options_as_args(**extra_opts))
  File "<https://builds.apache.org/job/beam_PostCommit_Py_ValCont/ws/src/sdks/python/apache_beam/examples/wordcount.py",> line 115, in run
    result = p.run()
  File "<https://builds.apache.org/job/beam_PostCommit_Py_ValCont/ws/src/sdks/python/apache_beam/pipeline.py",> line 405, in run
    self._options).run(False)
  File "<https://builds.apache.org/job/beam_PostCommit_Py_ValCont/ws/src/sdks/python/apache_beam/pipeline.py",> line 418, in run
    return self.runner.run_pipeline(self)
  File "<https://builds.apache.org/job/beam_PostCommit_Py_ValCont/ws/src/sdks/python/apache_beam/runners/dataflow/test_dataflow_runner.py",> line 70, in run_pipeline
    self.result.cancel()
  File "<https://builds.apache.org/job/beam_PostCommit_Py_ValCont/ws/src/sdks/python/apache_beam/runners/dataflow/dataflow_runner.py",> line 1208, in cancel
    return self.state
  File "<https://builds.apache.org/job/beam_PostCommit_Py_ValCont/ws/src/sdks/python/apache_beam/runners/dataflow/dataflow_runner.py",> line 1148, in state
    self._update_job()
  File "<https://builds.apache.org/job/beam_PostCommit_Py_ValCont/ws/src/sdks/python/apache_beam/runners/dataflow/dataflow_runner.py",> line 1104, in _update_job
    self._job = self._runner.dataflow_client.get_job(self.job_id())
  File "<https://builds.apache.org/job/beam_PostCommit_Py_ValCont/ws/src/sdks/python/apache_beam/utils/retry.py",> line 184, in wrapper
    return fun(*args, **kwargs)
  File "<https://builds.apache.org/job/beam_PostCommit_Py_ValCont/ws/src/sdks/python/apache_beam/runners/dataflow/internal/apiclient.py",> line 639, in get_job
    response = self._client.projects_locations_jobs.Get(request)
  File "<https://builds.apache.org/job/beam_PostCommit_Py_ValCont/ws/src/sdks/python/apache_beam/runners/dataflow/internal/clients/dataflow/dataflow_v1b3_client.py",> line 605, in Get
    config, request, global_params=global_params)
  File "<https://builds.apache.org/job/beam_PostCommit_Py_ValCont/ws/src/sdks/python/container/local/lib/python2.7/site-packages/apitools/base/py/base_api.py",> line 729, in _RunMethod
    http, http_request, **opts)
  File "<https://builds.apache.org/job/beam_PostCommit_Py_ValCont/ws/src/sdks/python/container/local/lib/python2.7/site-packages/apitools/base/py/http_wrapper.py",> line 346, in MakeRequest
    check_response_func=check_response_func)
  File "<https://builds.apache.org/job/beam_PostCommit_Py_ValCont/ws/src/sdks/python/container/local/lib/python2.7/site-packages/apitools/base/py/http_wrapper.py",> line 396, in _MakeRequestNoRetry
    redirections=redirections, connection_type=connection_type)
  File "<https://builds.apache.org/job/beam_PostCommit_Py_ValCont/ws/src/sdks/python/container/local/lib/python2.7/site-packages/oauth2client/transport.py",> line 175, in new_request
    redirections, connection_type)
  File "<https://builds.apache.org/job/beam_PostCommit_Py_ValCont/ws/src/sdks/python/container/local/lib/python2.7/site-packages/oauth2client/transport.py",> line 282, in request
    connection_type=connection_type)
  File "<https://builds.apache.org/job/beam_PostCommit_Py_ValCont/ws/src/sdks/python/container/local/lib/python2.7/site-packages/oauth2client/transport.py",> line 175, in new_request
    redirections, connection_type)
  File "<https://builds.apache.org/job/beam_PostCommit_Py_ValCont/ws/src/sdks/python/container/local/lib/python2.7/site-packages/oauth2client/transport.py",> line 282, in request
    connection_type=connection_type)
  File "<https://builds.apache.org/job/beam_PostCommit_Py_ValCont/ws/src/sdks/python/container/local/lib/python2.7/site-packages/httplib2/__init__.py",> line 1694, in request
    (response, content) = self._request(conn, authority, uri, request_uri, method, body, headers, redirections, cachekey)
  File "<https://builds.apache.org/job/beam_PostCommit_Py_ValCont/ws/src/sdks/python/container/local/lib/python2.7/site-packages/httplib2/__init__.py",> line 1434, in _request
    (response, content) = self._conn_request(conn, request_uri, method, body, headers)
  File "<https://builds.apache.org/job/beam_PostCommit_Py_ValCont/ws/src/sdks/python/container/local/lib/python2.7/site-packages/httplib2/__init__.py",> line 1390, in _conn_request
    response = conn.getresponse()
  File "/usr/lib/python2.7/httplib.py", line 1136, in getresponse
    response.begin()
  File "/usr/lib/python2.7/httplib.py", line 453, in begin
    version, status, reason = self._read_status()
  File "/usr/lib/python2.7/httplib.py", line 409, in _read_status
    line = self.fp.readline(_MAXLINE + 1)
  File "/usr/lib/python2.7/socket.py", line 480, in readline
    data = self._sock.recv(self._rbufsize)
  File "/usr/lib/python2.7/ssl.py", line 756, in recv
    return self.read(buflen)
  File "/usr/lib/python2.7/ssl.py", line 643, in read
    v = self._sslobj.read(len)
  File "<https://builds.apache.org/job/beam_PostCommit_Py_ValCont/ws/src/sdks/python/container/local/lib/python2.7/site-packages/nose/plugins/multiprocess.py",> line 276, in signalhandler
    raise TimedOutException()
TimedOutException: 'test_wordcount_fnapi_it (apache_beam.examples.wordcount_it_test.WordCountIT)'

----------------------------------------------------------------------
XML: <https://builds.apache.org/job/beam_PostCommit_Py_ValCont/ws/src/sdks/python/nosetests.xml>
----------------------------------------------------------------------
Ran 1 test in 902.395s

FAILED (errors=1)
cleanup_container
Untagged: us.gcr.io/apache-beam-testing/jenkins/python:20181116-145130
Untagged: us.gcr.io/apache-beam-testing/jenkins/python@sha256:df244263b1ae417423d0560f0b2e3fc547f42c2b0c4a78ddc18de697b39843a6
Deleted: sha256:4039d82e4d6919b2b200003bb43db6eb1f3475d0d67f67b5f6d7fdbc7b887d78
Deleted: sha256:6d3779bf4c4521cfefff4d074af7031177438f096ad8c6cac702e57fa6460f7f
Deleted: sha256:09e2694e97c0dde5a020dd7a36d5398bdb7312281cac8c1f869b2872c58aed34
Deleted: sha256:5ed794bb520f8e82d38dcd5562869d540a3835e41c9fe6ab607952eaa046f20d
Deleted: sha256:2eea59a24e5c254eaef3b407bb2c3d853725e2dd9605c68f0ba7dbc00c86d7c0
Deleted: sha256:bb938dbe624768b61d7d2dd47d141eebda520eb303073966410a01beced604e4
Deleted: sha256:1a2d534ce646c3575ffaa7682cf9d00f8c687680de7fcd56cc09ad2b4358bb65
Deleted: sha256:279f71dea84e06875e8aa87b4911a748ee338695ee4cb2f29c012e9c700de3bd
Deleted: sha256:56a698ace24c7a7ea99ba1e41d56a4719e75a726091c91d66d8e8b96f5d8501c
Deleted: sha256:3b6108b400326d7b50b5f68fe62250ba657382e742a0cdb43a097fb6cad28e44
Deleted: sha256:8cbdb189ec3dd597d168066611e6e7ddbf294d3bf8d69fae3a0ba09d40d1c1c4
Deleted: sha256:870374223cae1ae530db22674a2aaab8ed31fd9101272f7d90a218791f3aa493
Deleted: sha256:f4b1af9a443f118cc0fb09b66809773ca9453d03ea75295f0fd0871dac577fff
Deleted: sha256:eec66f0de68ae87966d94c55662482983e822baba9adc190df83adb39a5e727c
Digests:
- us.gcr.io/apache-beam-testing/jenkins/python@sha256:df244263b1ae417423d0560f0b2e3fc547f42c2b0c4a78ddc18de697b39843a6
  Associated tags:
 - 20181116-145130
Tags:
- us.gcr.io/apache-beam-testing/jenkins/python:20181116-145130
Deleted [us.gcr.io/apache-beam-testing/jenkins/python:20181116-145130].
Deleted [us.gcr.io/apache-beam-testing/jenkins/python@sha256:df244263b1ae417423d0560f0b2e3fc547f42c2b0c4a78ddc18de697b39843a6].
Removed the container
Build step 'Execute shell' marked build as failure

---------------------------------------------------------------------
To unsubscribe, e-mail: builds-unsubscribe@beam.apache.org
For additional commands, e-mail: builds-help@beam.apache.org


Build failed in Jenkins: beam_PostCommit_Py_ValCont #1439

Posted by Apache Jenkins Server <je...@builds.apache.org>.
See <https://builds.apache.org/job/beam_PostCommit_Py_ValCont/1439/display/redirect>

------------------------------------------
[...truncated 172.91 KB...]
copying apache_beam/testing/synthetic_pipeline.py -> apache-beam-2.9.0.dev0/apache_beam/testing
copying apache_beam/testing/synthetic_pipeline_test.py -> apache-beam-2.9.0.dev0/apache_beam/testing
copying apache_beam/testing/test_pipeline.py -> apache-beam-2.9.0.dev0/apache_beam/testing
copying apache_beam/testing/test_pipeline_test.py -> apache-beam-2.9.0.dev0/apache_beam/testing
copying apache_beam/testing/test_stream.py -> apache-beam-2.9.0.dev0/apache_beam/testing
copying apache_beam/testing/test_stream_test.py -> apache-beam-2.9.0.dev0/apache_beam/testing
copying apache_beam/testing/test_utils.py -> apache-beam-2.9.0.dev0/apache_beam/testing
copying apache_beam/testing/test_utils_test.py -> apache-beam-2.9.0.dev0/apache_beam/testing
copying apache_beam/testing/util.py -> apache-beam-2.9.0.dev0/apache_beam/testing
copying apache_beam/testing/util_test.py -> apache-beam-2.9.0.dev0/apache_beam/testing
copying apache_beam/testing/benchmarks/__init__.py -> apache-beam-2.9.0.dev0/apache_beam/testing/benchmarks
copying apache_beam/testing/benchmarks/nexmark/__init__.py -> apache-beam-2.9.0.dev0/apache_beam/testing/benchmarks/nexmark
copying apache_beam/testing/benchmarks/nexmark/nexmark_launcher.py -> apache-beam-2.9.0.dev0/apache_beam/testing/benchmarks/nexmark
copying apache_beam/testing/benchmarks/nexmark/nexmark_util.py -> apache-beam-2.9.0.dev0/apache_beam/testing/benchmarks/nexmark
copying apache_beam/testing/benchmarks/nexmark/models/__init__.py -> apache-beam-2.9.0.dev0/apache_beam/testing/benchmarks/nexmark/models
copying apache_beam/testing/benchmarks/nexmark/models/nexmark_model.py -> apache-beam-2.9.0.dev0/apache_beam/testing/benchmarks/nexmark/models
copying apache_beam/testing/benchmarks/nexmark/queries/__init__.py -> apache-beam-2.9.0.dev0/apache_beam/testing/benchmarks/nexmark/queries
copying apache_beam/testing/benchmarks/nexmark/queries/query0.py -> apache-beam-2.9.0.dev0/apache_beam/testing/benchmarks/nexmark/queries
copying apache_beam/testing/benchmarks/nexmark/queries/query1.py -> apache-beam-2.9.0.dev0/apache_beam/testing/benchmarks/nexmark/queries
copying apache_beam/testing/benchmarks/nexmark/queries/query2.py -> apache-beam-2.9.0.dev0/apache_beam/testing/benchmarks/nexmark/queries
copying apache_beam/testing/data/standard_coders.yaml -> apache-beam-2.9.0.dev0/apache_beam/testing/data
copying apache_beam/testing/data/trigger_transcripts.yaml -> apache-beam-2.9.0.dev0/apache_beam/testing/data
copying apache_beam/testing/load_tests/__init__.py -> apache-beam-2.9.0.dev0/apache_beam/testing/load_tests
copying apache_beam/testing/load_tests/co_group_by_key_test.py -> apache-beam-2.9.0.dev0/apache_beam/testing/load_tests
copying apache_beam/testing/load_tests/combine_test.py -> apache-beam-2.9.0.dev0/apache_beam/testing/load_tests
copying apache_beam/testing/load_tests/group_by_key_test.py -> apache-beam-2.9.0.dev0/apache_beam/testing/load_tests
copying apache_beam/testing/load_tests/load_test_metrics_utils.py -> apache-beam-2.9.0.dev0/apache_beam/testing/load_tests
copying apache_beam/testing/load_tests/pardo_test.py -> apache-beam-2.9.0.dev0/apache_beam/testing/load_tests
copying apache_beam/tools/__init__.py -> apache-beam-2.9.0.dev0/apache_beam/tools
copying apache_beam/tools/coders_microbenchmark.py -> apache-beam-2.9.0.dev0/apache_beam/tools
copying apache_beam/tools/distribution_counter_microbenchmark.py -> apache-beam-2.9.0.dev0/apache_beam/tools
copying apache_beam/tools/map_fn_microbenchmark.py -> apache-beam-2.9.0.dev0/apache_beam/tools
copying apache_beam/tools/microbenchmarks_test.py -> apache-beam-2.9.0.dev0/apache_beam/tools
copying apache_beam/tools/sideinput_microbenchmark.py -> apache-beam-2.9.0.dev0/apache_beam/tools
copying apache_beam/tools/utils.py -> apache-beam-2.9.0.dev0/apache_beam/tools
copying apache_beam/transforms/__init__.py -> apache-beam-2.9.0.dev0/apache_beam/transforms
copying apache_beam/transforms/combiners.py -> apache-beam-2.9.0.dev0/apache_beam/transforms
copying apache_beam/transforms/combiners_test.py -> apache-beam-2.9.0.dev0/apache_beam/transforms
copying apache_beam/transforms/core.py -> apache-beam-2.9.0.dev0/apache_beam/transforms
copying apache_beam/transforms/create_source.py -> apache-beam-2.9.0.dev0/apache_beam/transforms
copying apache_beam/transforms/create_test.py -> apache-beam-2.9.0.dev0/apache_beam/transforms
copying apache_beam/transforms/cy_combiners.pxd -> apache-beam-2.9.0.dev0/apache_beam/transforms
copying apache_beam/transforms/cy_combiners.py -> apache-beam-2.9.0.dev0/apache_beam/transforms
copying apache_beam/transforms/cy_dataflow_distribution_counter.pxd -> apache-beam-2.9.0.dev0/apache_beam/transforms
copying apache_beam/transforms/cy_dataflow_distribution_counter.pyx -> apache-beam-2.9.0.dev0/apache_beam/transforms
copying apache_beam/transforms/dataflow_distribution_counter_test.py -> apache-beam-2.9.0.dev0/apache_beam/transforms
copying apache_beam/transforms/display.py -> apache-beam-2.9.0.dev0/apache_beam/transforms
copying apache_beam/transforms/display_test.py -> apache-beam-2.9.0.dev0/apache_beam/transforms
copying apache_beam/transforms/ptransform.py -> apache-beam-2.9.0.dev0/apache_beam/transforms
copying apache_beam/transforms/ptransform_test.py -> apache-beam-2.9.0.dev0/apache_beam/transforms
copying apache_beam/transforms/py_dataflow_distribution_counter.py -> apache-beam-2.9.0.dev0/apache_beam/transforms
copying apache_beam/transforms/sideinputs.py -> apache-beam-2.9.0.dev0/apache_beam/transforms
copying apache_beam/transforms/sideinputs_test.py -> apache-beam-2.9.0.dev0/apache_beam/transforms
copying apache_beam/transforms/timeutil.py -> apache-beam-2.9.0.dev0/apache_beam/transforms
copying apache_beam/transforms/trigger.py -> apache-beam-2.9.0.dev0/apache_beam/transforms
copying apache_beam/transforms/trigger_test.py -> apache-beam-2.9.0.dev0/apache_beam/transforms
copying apache_beam/transforms/userstate.py -> apache-beam-2.9.0.dev0/apache_beam/transforms
copying apache_beam/transforms/userstate_test.py -> apache-beam-2.9.0.dev0/apache_beam/transforms
copying apache_beam/transforms/util.py -> apache-beam-2.9.0.dev0/apache_beam/transforms
copying apache_beam/transforms/util_test.py -> apache-beam-2.9.0.dev0/apache_beam/transforms
copying apache_beam/transforms/window.py -> apache-beam-2.9.0.dev0/apache_beam/transforms
copying apache_beam/transforms/window_test.py -> apache-beam-2.9.0.dev0/apache_beam/transforms
copying apache_beam/transforms/write_ptransform_test.py -> apache-beam-2.9.0.dev0/apache_beam/transforms
copying apache_beam/typehints/__init__.py -> apache-beam-2.9.0.dev0/apache_beam/typehints
copying apache_beam/typehints/decorators.py -> apache-beam-2.9.0.dev0/apache_beam/typehints
copying apache_beam/typehints/native_type_compatibility.py -> apache-beam-2.9.0.dev0/apache_beam/typehints
copying apache_beam/typehints/native_type_compatibility_test.py -> apache-beam-2.9.0.dev0/apache_beam/typehints
copying apache_beam/typehints/opcodes.py -> apache-beam-2.9.0.dev0/apache_beam/typehints
copying apache_beam/typehints/trivial_inference.py -> apache-beam-2.9.0.dev0/apache_beam/typehints
copying apache_beam/typehints/trivial_inference_test.py -> apache-beam-2.9.0.dev0/apache_beam/typehints
copying apache_beam/typehints/typecheck.py -> apache-beam-2.9.0.dev0/apache_beam/typehints
copying apache_beam/typehints/typed_pipeline_test.py -> apache-beam-2.9.0.dev0/apache_beam/typehints
copying apache_beam/typehints/typehints.py -> apache-beam-2.9.0.dev0/apache_beam/typehints
copying apache_beam/typehints/typehints_test.py -> apache-beam-2.9.0.dev0/apache_beam/typehints
copying apache_beam/utils/__init__.py -> apache-beam-2.9.0.dev0/apache_beam/utils
copying apache_beam/utils/annotations.py -> apache-beam-2.9.0.dev0/apache_beam/utils
copying apache_beam/utils/annotations_test.py -> apache-beam-2.9.0.dev0/apache_beam/utils
copying apache_beam/utils/counters.pxd -> apache-beam-2.9.0.dev0/apache_beam/utils
copying apache_beam/utils/counters.py -> apache-beam-2.9.0.dev0/apache_beam/utils
copying apache_beam/utils/counters_test.py -> apache-beam-2.9.0.dev0/apache_beam/utils
copying apache_beam/utils/plugin.py -> apache-beam-2.9.0.dev0/apache_beam/utils
copying apache_beam/utils/processes.py -> apache-beam-2.9.0.dev0/apache_beam/utils
copying apache_beam/utils/processes_test.py -> apache-beam-2.9.0.dev0/apache_beam/utils
copying apache_beam/utils/profiler.py -> apache-beam-2.9.0.dev0/apache_beam/utils
copying apache_beam/utils/proto_utils.py -> apache-beam-2.9.0.dev0/apache_beam/utils
copying apache_beam/utils/retry.py -> apache-beam-2.9.0.dev0/apache_beam/utils
copying apache_beam/utils/retry_test.py -> apache-beam-2.9.0.dev0/apache_beam/utils
copying apache_beam/utils/timestamp.py -> apache-beam-2.9.0.dev0/apache_beam/utils
copying apache_beam/utils/timestamp_test.py -> apache-beam-2.9.0.dev0/apache_beam/utils
copying apache_beam/utils/urns.py -> apache-beam-2.9.0.dev0/apache_beam/utils
copying apache_beam/utils/windowed_value.pxd -> apache-beam-2.9.0.dev0/apache_beam/utils
copying apache_beam/utils/windowed_value.py -> apache-beam-2.9.0.dev0/apache_beam/utils
copying apache_beam/utils/windowed_value_test.py -> apache-beam-2.9.0.dev0/apache_beam/utils
Writing apache-beam-2.9.0.dev0/setup.cfg
creating dist
Creating tar archive
removing 'apache-beam-2.9.0.dev0' (and everything under it)
SDK_LOCATION=$(find dist/apache-beam-*.tar.gz)
find dist/apache-beam-*.tar.gz

# Run ValidatesRunner tests on Google Cloud Dataflow service
echo ">>> RUNNING DATAFLOW RUNNER VALIDATESCONTAINER TEST"
>>> RUNNING DATAFLOW RUNNER VALIDATESCONTAINER TEST
python setup.py nosetests \
  --attr ValidatesContainer \
  --nologcapture \
  --processes=1 \
  --process-timeout=900 \
  --test-pipeline-options=" \
    --runner=TestDataflowRunner \
    --project=$PROJECT \
    --worker_harness_container_image=$CONTAINER:$TAG \
    --staging_location=$GCS_LOCATION/staging-validatesrunner-test \
    --temp_location=$GCS_LOCATION/temp-validatesrunner-test \
    --output=$GCS_LOCATION/output \
    --sdk_location=$SDK_LOCATION \
    --num_workers=1"
<https://builds.apache.org/job/beam_PostCommit_Py_ValCont/ws/src/sdks/python/container/local/lib/python2.7/site-packages/setuptools/dist.py>:470: UserWarning: Normalizing '2.9.0.dev' to '2.9.0.dev0'
  normalized_version,
running nosetests
running egg_info
<https://builds.apache.org/job/beam_PostCommit_Py_ValCont/ws/src/sdks/python/gen_protos.py>:52: UserWarning: Installing grpcio-tools is recommended for development.
  warnings.warn('Installing grpcio-tools is recommended for development.')
writing requirements to apache_beam.egg-info/requires.txt
writing apache_beam.egg-info/PKG-INFO
writing top-level names to apache_beam.egg-info/top_level.txt
writing dependency_links to apache_beam.egg-info/dependency_links.txt
writing entry points to apache_beam.egg-info/entry_points.txt
reading manifest file 'apache_beam.egg-info/SOURCES.txt'
reading manifest template 'MANIFEST.in'
warning: no files found matching 'README.md'
warning: no files found matching 'NOTICE'
warning: no files found matching 'LICENSE'
writing manifest file 'apache_beam.egg-info/SOURCES.txt'
WARNING:root:python-snappy is not installed; some tests will be skipped.
WARNING:root:Tensorflow is not installed, so skipping some tests.
<https://builds.apache.org/job/beam_PostCommit_Py_ValCont/ws/src/sdks/python/apache_beam/runners/dataflow/dataflow_runner.py>:800: BeamDeprecationWarning: options is deprecated since First stable release. References to <pipeline>.options will not be supported
  options = pbegin.pipeline.options.view_as(DebugOptions)
test_wordcount_fnapi_it (apache_beam.examples.wordcount_it_test.WordCountIT) ... ERROR

======================================================================
ERROR: test_wordcount_fnapi_it (apache_beam.examples.wordcount_it_test.WordCountIT)
----------------------------------------------------------------------
Traceback (most recent call last):
  File "<https://builds.apache.org/job/beam_PostCommit_Py_ValCont/ws/src/sdks/python/container/local/lib/python2.7/site-packages/nose/plugins/multiprocess.py",> line 812, in run
    test(orig)
  File "<https://builds.apache.org/job/beam_PostCommit_Py_ValCont/ws/src/sdks/python/container/local/lib/python2.7/site-packages/nose/case.py",> line 45, in __call__
    return self.run(*arg, **kwarg)
  File "<https://builds.apache.org/job/beam_PostCommit_Py_ValCont/ws/src/sdks/python/container/local/lib/python2.7/site-packages/nose/case.py",> line 133, in run
    self.runTest(result)
  File "<https://builds.apache.org/job/beam_PostCommit_Py_ValCont/ws/src/sdks/python/container/local/lib/python2.7/site-packages/nose/case.py",> line 151, in runTest
    test(result)
  File "/usr/lib/python2.7/unittest/case.py", line 393, in __call__
    return self.run(*args, **kwds)
  File "/usr/lib/python2.7/unittest/case.py", line 329, in run
    testMethod()
  File "<https://builds.apache.org/job/beam_PostCommit_Py_ValCont/ws/src/sdks/python/apache_beam/examples/wordcount_it_test.py",> line 51, in test_wordcount_fnapi_it
    self._run_wordcount_it(experiment='beam_fn_api')
  File "<https://builds.apache.org/job/beam_PostCommit_Py_ValCont/ws/src/sdks/python/apache_beam/examples/wordcount_it_test.py",> line 75, in _run_wordcount_it
    wordcount.run(test_pipeline.get_full_options_as_args(**extra_opts))
  File "<https://builds.apache.org/job/beam_PostCommit_Py_ValCont/ws/src/sdks/python/apache_beam/examples/wordcount.py",> line 115, in run
    result = p.run()
  File "<https://builds.apache.org/job/beam_PostCommit_Py_ValCont/ws/src/sdks/python/apache_beam/pipeline.py",> line 405, in run
    self._options).run(False)
  File "<https://builds.apache.org/job/beam_PostCommit_Py_ValCont/ws/src/sdks/python/apache_beam/pipeline.py",> line 418, in run
    return self.runner.run_pipeline(self)
  File "<https://builds.apache.org/job/beam_PostCommit_Py_ValCont/ws/src/sdks/python/apache_beam/runners/dataflow/test_dataflow_runner.py",> line 70, in run_pipeline
    self.result.cancel()
  File "<https://builds.apache.org/job/beam_PostCommit_Py_ValCont/ws/src/sdks/python/apache_beam/runners/dataflow/dataflow_runner.py",> line 1208, in cancel
    return self.state
  File "<https://builds.apache.org/job/beam_PostCommit_Py_ValCont/ws/src/sdks/python/apache_beam/runners/dataflow/dataflow_runner.py",> line 1148, in state
    self._update_job()
  File "<https://builds.apache.org/job/beam_PostCommit_Py_ValCont/ws/src/sdks/python/apache_beam/runners/dataflow/dataflow_runner.py",> line 1104, in _update_job
    self._job = self._runner.dataflow_client.get_job(self.job_id())
  File "<https://builds.apache.org/job/beam_PostCommit_Py_ValCont/ws/src/sdks/python/apache_beam/utils/retry.py",> line 184, in wrapper
    return fun(*args, **kwargs)
  File "<https://builds.apache.org/job/beam_PostCommit_Py_ValCont/ws/src/sdks/python/apache_beam/runners/dataflow/internal/apiclient.py",> line 639, in get_job
    response = self._client.projects_locations_jobs.Get(request)
  File "<https://builds.apache.org/job/beam_PostCommit_Py_ValCont/ws/src/sdks/python/apache_beam/runners/dataflow/internal/clients/dataflow/dataflow_v1b3_client.py",> line 605, in Get
    config, request, global_params=global_params)
  File "<https://builds.apache.org/job/beam_PostCommit_Py_ValCont/ws/src/sdks/python/container/local/lib/python2.7/site-packages/apitools/base/py/base_api.py",> line 729, in _RunMethod
    http, http_request, **opts)
  File "<https://builds.apache.org/job/beam_PostCommit_Py_ValCont/ws/src/sdks/python/container/local/lib/python2.7/site-packages/apitools/base/py/http_wrapper.py",> line 346, in MakeRequest
    check_response_func=check_response_func)
  File "<https://builds.apache.org/job/beam_PostCommit_Py_ValCont/ws/src/sdks/python/container/local/lib/python2.7/site-packages/apitools/base/py/http_wrapper.py",> line 396, in _MakeRequestNoRetry
    redirections=redirections, connection_type=connection_type)
  File "<https://builds.apache.org/job/beam_PostCommit_Py_ValCont/ws/src/sdks/python/container/local/lib/python2.7/site-packages/oauth2client/transport.py",> line 175, in new_request
    redirections, connection_type)
  File "<https://builds.apache.org/job/beam_PostCommit_Py_ValCont/ws/src/sdks/python/container/local/lib/python2.7/site-packages/oauth2client/transport.py",> line 282, in request
    connection_type=connection_type)
  File "<https://builds.apache.org/job/beam_PostCommit_Py_ValCont/ws/src/sdks/python/container/local/lib/python2.7/site-packages/oauth2client/transport.py",> line 175, in new_request
    redirections, connection_type)
  File "<https://builds.apache.org/job/beam_PostCommit_Py_ValCont/ws/src/sdks/python/container/local/lib/python2.7/site-packages/oauth2client/transport.py",> line 282, in request
    connection_type=connection_type)
  File "<https://builds.apache.org/job/beam_PostCommit_Py_ValCont/ws/src/sdks/python/container/local/lib/python2.7/site-packages/httplib2/__init__.py",> line 1694, in request
    (response, content) = self._request(conn, authority, uri, request_uri, method, body, headers, redirections, cachekey)
  File "<https://builds.apache.org/job/beam_PostCommit_Py_ValCont/ws/src/sdks/python/container/local/lib/python2.7/site-packages/httplib2/__init__.py",> line 1434, in _request
    (response, content) = self._conn_request(conn, request_uri, method, body, headers)
  File "<https://builds.apache.org/job/beam_PostCommit_Py_ValCont/ws/src/sdks/python/container/local/lib/python2.7/site-packages/httplib2/__init__.py",> line 1390, in _conn_request
    response = conn.getresponse()
  File "/usr/lib/python2.7/httplib.py", line 1136, in getresponse
    response.begin()
  File "/usr/lib/python2.7/httplib.py", line 453, in begin
    version, status, reason = self._read_status()
  File "/usr/lib/python2.7/httplib.py", line 409, in _read_status
    line = self.fp.readline(_MAXLINE + 1)
  File "/usr/lib/python2.7/socket.py", line 480, in readline
    data = self._sock.recv(self._rbufsize)
  File "/usr/lib/python2.7/ssl.py", line 756, in recv
    return self.read(buflen)
  File "/usr/lib/python2.7/ssl.py", line 643, in read
    v = self._sslobj.read(len)
  File "<https://builds.apache.org/job/beam_PostCommit_Py_ValCont/ws/src/sdks/python/container/local/lib/python2.7/site-packages/nose/plugins/multiprocess.py",> line 276, in signalhandler
    raise TimedOutException()
TimedOutException: 'test_wordcount_fnapi_it (apache_beam.examples.wordcount_it_test.WordCountIT)'

----------------------------------------------------------------------
XML: <https://builds.apache.org/job/beam_PostCommit_Py_ValCont/ws/src/sdks/python/nosetests.xml>
----------------------------------------------------------------------
Ran 1 test in 902.362s

FAILED (errors=1)
cleanup_container
Untagged: us.gcr.io/apache-beam-testing/jenkins/python:20181116-120007
Untagged: us.gcr.io/apache-beam-testing/jenkins/python@sha256:ecdf4a31cde17f45407cf51157f82d497679d85f329c5efd56567d909914892e
Deleted: sha256:9f489d6c9740319029210b71a5e00385835d9fe46152e93df861d739dd657302
Deleted: sha256:c6842cacbb8f3a5439fb67a09c8f1b26df459632e1914a929812023690c8e762
Deleted: sha256:60cf08ed02d63abf39df5f2a3868e232e5d778078e1087a5352a109bfcbb24f5
Deleted: sha256:fd62786b274dffd26c8e1781dff6247f0c53ba8109122f810c2c4dfc83d053f3
Deleted: sha256:0283da78e6343fc3f3aad97c2508ce121cf55f852b6cb6ccc48d92c17cab749e
Deleted: sha256:9375ef38edce3235371d656d83ac393b653f9bc767e0d11b232889712349f5ce
Deleted: sha256:3dbec27cef45e2d322d989d7cb6f1a4d5eb068c2267d9981035e3590ecceadd6
Deleted: sha256:0d047f95e6bf19b2356ca3816bca45c5df4536d5851cb75fd3c7502138cdfef5
Deleted: sha256:02167bcccc72e652d5c68712d8a89dab382e0456557d7b7e02c28f1408f0566e
Deleted: sha256:625172c6798eece978268b35dea9ddddd9b60cf24a259dc3b7536a5f4518dc12
Deleted: sha256:d6a9e4fa385eea97f302967b78f07c370243990c7e4210058a3fb34bb7289e71
Deleted: sha256:8375623b88e8ea625c589f92a946e426c9b6925ddddd12ab061f67474ca99f92
Deleted: sha256:fcf0245a9114311a2d1ad90234eac78384f14c9d1897892d88cdd4fd67e4e0bf
Deleted: sha256:54e37537b1490be510ac2f02468fcd0b5f103dd0ba180e80e06280591d03180b
Digests:
- us.gcr.io/apache-beam-testing/jenkins/python@sha256:ecdf4a31cde17f45407cf51157f82d497679d85f329c5efd56567d909914892e
  Associated tags:
 - 20181116-120007
Tags:
- us.gcr.io/apache-beam-testing/jenkins/python:20181116-120007
Deleted [us.gcr.io/apache-beam-testing/jenkins/python:20181116-120007].
Deleted [us.gcr.io/apache-beam-testing/jenkins/python@sha256:ecdf4a31cde17f45407cf51157f82d497679d85f329c5efd56567d909914892e].
Removed the container
Build step 'Execute shell' marked build as failure

---------------------------------------------------------------------
To unsubscribe, e-mail: builds-unsubscribe@beam.apache.org
For additional commands, e-mail: builds-help@beam.apache.org


Build failed in Jenkins: beam_PostCommit_Py_ValCont #1438

Posted by Apache Jenkins Server <je...@builds.apache.org>.
See <https://builds.apache.org/job/beam_PostCommit_Py_ValCont/1438/display/redirect?page=changes>

Changes:

[github] Merge pull request #6985: [BEAM-5983] Create Combine load test

------------------------------------------
[...truncated 172.95 KB...]
copying apache_beam/testing/synthetic_pipeline.py -> apache-beam-2.9.0.dev0/apache_beam/testing
copying apache_beam/testing/synthetic_pipeline_test.py -> apache-beam-2.9.0.dev0/apache_beam/testing
copying apache_beam/testing/test_pipeline.py -> apache-beam-2.9.0.dev0/apache_beam/testing
copying apache_beam/testing/test_pipeline_test.py -> apache-beam-2.9.0.dev0/apache_beam/testing
copying apache_beam/testing/test_stream.py -> apache-beam-2.9.0.dev0/apache_beam/testing
copying apache_beam/testing/test_stream_test.py -> apache-beam-2.9.0.dev0/apache_beam/testing
copying apache_beam/testing/test_utils.py -> apache-beam-2.9.0.dev0/apache_beam/testing
copying apache_beam/testing/test_utils_test.py -> apache-beam-2.9.0.dev0/apache_beam/testing
copying apache_beam/testing/util.py -> apache-beam-2.9.0.dev0/apache_beam/testing
copying apache_beam/testing/util_test.py -> apache-beam-2.9.0.dev0/apache_beam/testing
copying apache_beam/testing/benchmarks/__init__.py -> apache-beam-2.9.0.dev0/apache_beam/testing/benchmarks
copying apache_beam/testing/benchmarks/nexmark/__init__.py -> apache-beam-2.9.0.dev0/apache_beam/testing/benchmarks/nexmark
copying apache_beam/testing/benchmarks/nexmark/nexmark_launcher.py -> apache-beam-2.9.0.dev0/apache_beam/testing/benchmarks/nexmark
copying apache_beam/testing/benchmarks/nexmark/nexmark_util.py -> apache-beam-2.9.0.dev0/apache_beam/testing/benchmarks/nexmark
copying apache_beam/testing/benchmarks/nexmark/models/__init__.py -> apache-beam-2.9.0.dev0/apache_beam/testing/benchmarks/nexmark/models
copying apache_beam/testing/benchmarks/nexmark/models/nexmark_model.py -> apache-beam-2.9.0.dev0/apache_beam/testing/benchmarks/nexmark/models
copying apache_beam/testing/benchmarks/nexmark/queries/__init__.py -> apache-beam-2.9.0.dev0/apache_beam/testing/benchmarks/nexmark/queries
copying apache_beam/testing/benchmarks/nexmark/queries/query0.py -> apache-beam-2.9.0.dev0/apache_beam/testing/benchmarks/nexmark/queries
copying apache_beam/testing/benchmarks/nexmark/queries/query1.py -> apache-beam-2.9.0.dev0/apache_beam/testing/benchmarks/nexmark/queries
copying apache_beam/testing/benchmarks/nexmark/queries/query2.py -> apache-beam-2.9.0.dev0/apache_beam/testing/benchmarks/nexmark/queries
copying apache_beam/testing/data/standard_coders.yaml -> apache-beam-2.9.0.dev0/apache_beam/testing/data
copying apache_beam/testing/data/trigger_transcripts.yaml -> apache-beam-2.9.0.dev0/apache_beam/testing/data
copying apache_beam/testing/load_tests/__init__.py -> apache-beam-2.9.0.dev0/apache_beam/testing/load_tests
copying apache_beam/testing/load_tests/co_group_by_key_test.py -> apache-beam-2.9.0.dev0/apache_beam/testing/load_tests
copying apache_beam/testing/load_tests/combine_test.py -> apache-beam-2.9.0.dev0/apache_beam/testing/load_tests
copying apache_beam/testing/load_tests/group_by_key_test.py -> apache-beam-2.9.0.dev0/apache_beam/testing/load_tests
copying apache_beam/testing/load_tests/load_test_metrics_utils.py -> apache-beam-2.9.0.dev0/apache_beam/testing/load_tests
copying apache_beam/testing/load_tests/pardo_test.py -> apache-beam-2.9.0.dev0/apache_beam/testing/load_tests
copying apache_beam/tools/__init__.py -> apache-beam-2.9.0.dev0/apache_beam/tools
copying apache_beam/tools/coders_microbenchmark.py -> apache-beam-2.9.0.dev0/apache_beam/tools
copying apache_beam/tools/distribution_counter_microbenchmark.py -> apache-beam-2.9.0.dev0/apache_beam/tools
copying apache_beam/tools/map_fn_microbenchmark.py -> apache-beam-2.9.0.dev0/apache_beam/tools
copying apache_beam/tools/microbenchmarks_test.py -> apache-beam-2.9.0.dev0/apache_beam/tools
copying apache_beam/tools/sideinput_microbenchmark.py -> apache-beam-2.9.0.dev0/apache_beam/tools
copying apache_beam/tools/utils.py -> apache-beam-2.9.0.dev0/apache_beam/tools
copying apache_beam/transforms/__init__.py -> apache-beam-2.9.0.dev0/apache_beam/transforms
copying apache_beam/transforms/combiners.py -> apache-beam-2.9.0.dev0/apache_beam/transforms
copying apache_beam/transforms/combiners_test.py -> apache-beam-2.9.0.dev0/apache_beam/transforms
copying apache_beam/transforms/core.py -> apache-beam-2.9.0.dev0/apache_beam/transforms
copying apache_beam/transforms/create_source.py -> apache-beam-2.9.0.dev0/apache_beam/transforms
copying apache_beam/transforms/create_test.py -> apache-beam-2.9.0.dev0/apache_beam/transforms
copying apache_beam/transforms/cy_combiners.pxd -> apache-beam-2.9.0.dev0/apache_beam/transforms
copying apache_beam/transforms/cy_combiners.py -> apache-beam-2.9.0.dev0/apache_beam/transforms
copying apache_beam/transforms/cy_dataflow_distribution_counter.pxd -> apache-beam-2.9.0.dev0/apache_beam/transforms
copying apache_beam/transforms/cy_dataflow_distribution_counter.pyx -> apache-beam-2.9.0.dev0/apache_beam/transforms
copying apache_beam/transforms/dataflow_distribution_counter_test.py -> apache-beam-2.9.0.dev0/apache_beam/transforms
copying apache_beam/transforms/display.py -> apache-beam-2.9.0.dev0/apache_beam/transforms
copying apache_beam/transforms/display_test.py -> apache-beam-2.9.0.dev0/apache_beam/transforms
copying apache_beam/transforms/ptransform.py -> apache-beam-2.9.0.dev0/apache_beam/transforms
copying apache_beam/transforms/ptransform_test.py -> apache-beam-2.9.0.dev0/apache_beam/transforms
copying apache_beam/transforms/py_dataflow_distribution_counter.py -> apache-beam-2.9.0.dev0/apache_beam/transforms
copying apache_beam/transforms/sideinputs.py -> apache-beam-2.9.0.dev0/apache_beam/transforms
copying apache_beam/transforms/sideinputs_test.py -> apache-beam-2.9.0.dev0/apache_beam/transforms
copying apache_beam/transforms/timeutil.py -> apache-beam-2.9.0.dev0/apache_beam/transforms
copying apache_beam/transforms/trigger.py -> apache-beam-2.9.0.dev0/apache_beam/transforms
copying apache_beam/transforms/trigger_test.py -> apache-beam-2.9.0.dev0/apache_beam/transforms
copying apache_beam/transforms/userstate.py -> apache-beam-2.9.0.dev0/apache_beam/transforms
copying apache_beam/transforms/userstate_test.py -> apache-beam-2.9.0.dev0/apache_beam/transforms
copying apache_beam/transforms/util.py -> apache-beam-2.9.0.dev0/apache_beam/transforms
copying apache_beam/transforms/util_test.py -> apache-beam-2.9.0.dev0/apache_beam/transforms
copying apache_beam/transforms/window.py -> apache-beam-2.9.0.dev0/apache_beam/transforms
copying apache_beam/transforms/window_test.py -> apache-beam-2.9.0.dev0/apache_beam/transforms
copying apache_beam/transforms/write_ptransform_test.py -> apache-beam-2.9.0.dev0/apache_beam/transforms
copying apache_beam/typehints/__init__.py -> apache-beam-2.9.0.dev0/apache_beam/typehints
copying apache_beam/typehints/decorators.py -> apache-beam-2.9.0.dev0/apache_beam/typehints
copying apache_beam/typehints/native_type_compatibility.py -> apache-beam-2.9.0.dev0/apache_beam/typehints
copying apache_beam/typehints/native_type_compatibility_test.py -> apache-beam-2.9.0.dev0/apache_beam/typehints
copying apache_beam/typehints/opcodes.py -> apache-beam-2.9.0.dev0/apache_beam/typehints
copying apache_beam/typehints/trivial_inference.py -> apache-beam-2.9.0.dev0/apache_beam/typehints
copying apache_beam/typehints/trivial_inference_test.py -> apache-beam-2.9.0.dev0/apache_beam/typehints
copying apache_beam/typehints/typecheck.py -> apache-beam-2.9.0.dev0/apache_beam/typehints
copying apache_beam/typehints/typed_pipeline_test.py -> apache-beam-2.9.0.dev0/apache_beam/typehints
copying apache_beam/typehints/typehints.py -> apache-beam-2.9.0.dev0/apache_beam/typehints
copying apache_beam/typehints/typehints_test.py -> apache-beam-2.9.0.dev0/apache_beam/typehints
copying apache_beam/utils/__init__.py -> apache-beam-2.9.0.dev0/apache_beam/utils
copying apache_beam/utils/annotations.py -> apache-beam-2.9.0.dev0/apache_beam/utils
copying apache_beam/utils/annotations_test.py -> apache-beam-2.9.0.dev0/apache_beam/utils
copying apache_beam/utils/counters.pxd -> apache-beam-2.9.0.dev0/apache_beam/utils
copying apache_beam/utils/counters.py -> apache-beam-2.9.0.dev0/apache_beam/utils
copying apache_beam/utils/counters_test.py -> apache-beam-2.9.0.dev0/apache_beam/utils
copying apache_beam/utils/plugin.py -> apache-beam-2.9.0.dev0/apache_beam/utils
copying apache_beam/utils/processes.py -> apache-beam-2.9.0.dev0/apache_beam/utils
copying apache_beam/utils/processes_test.py -> apache-beam-2.9.0.dev0/apache_beam/utils
copying apache_beam/utils/profiler.py -> apache-beam-2.9.0.dev0/apache_beam/utils
copying apache_beam/utils/proto_utils.py -> apache-beam-2.9.0.dev0/apache_beam/utils
copying apache_beam/utils/retry.py -> apache-beam-2.9.0.dev0/apache_beam/utils
copying apache_beam/utils/retry_test.py -> apache-beam-2.9.0.dev0/apache_beam/utils
copying apache_beam/utils/timestamp.py -> apache-beam-2.9.0.dev0/apache_beam/utils
copying apache_beam/utils/timestamp_test.py -> apache-beam-2.9.0.dev0/apache_beam/utils
copying apache_beam/utils/urns.py -> apache-beam-2.9.0.dev0/apache_beam/utils
copying apache_beam/utils/windowed_value.pxd -> apache-beam-2.9.0.dev0/apache_beam/utils
copying apache_beam/utils/windowed_value.py -> apache-beam-2.9.0.dev0/apache_beam/utils
copying apache_beam/utils/windowed_value_test.py -> apache-beam-2.9.0.dev0/apache_beam/utils
Writing apache-beam-2.9.0.dev0/setup.cfg
creating dist
Creating tar archive
removing 'apache-beam-2.9.0.dev0' (and everything under it)
SDK_LOCATION=$(find dist/apache-beam-*.tar.gz)
find dist/apache-beam-*.tar.gz

# Run ValidatesRunner tests on Google Cloud Dataflow service
echo ">>> RUNNING DATAFLOW RUNNER VALIDATESCONTAINER TEST"
>>> RUNNING DATAFLOW RUNNER VALIDATESCONTAINER TEST
python setup.py nosetests \
  --attr ValidatesContainer \
  --nologcapture \
  --processes=1 \
  --process-timeout=900 \
  --test-pipeline-options=" \
    --runner=TestDataflowRunner \
    --project=$PROJECT \
    --worker_harness_container_image=$CONTAINER:$TAG \
    --staging_location=$GCS_LOCATION/staging-validatesrunner-test \
    --temp_location=$GCS_LOCATION/temp-validatesrunner-test \
    --output=$GCS_LOCATION/output \
    --sdk_location=$SDK_LOCATION \
    --num_workers=1"
<https://builds.apache.org/job/beam_PostCommit_Py_ValCont/ws/src/sdks/python/container/local/lib/python2.7/site-packages/setuptools/dist.py>:470: UserWarning: Normalizing '2.9.0.dev' to '2.9.0.dev0'
  normalized_version,
running nosetests
running egg_info
<https://builds.apache.org/job/beam_PostCommit_Py_ValCont/ws/src/sdks/python/gen_protos.py>:52: UserWarning: Installing grpcio-tools is recommended for development.
  warnings.warn('Installing grpcio-tools is recommended for development.')
writing requirements to apache_beam.egg-info/requires.txt
writing apache_beam.egg-info/PKG-INFO
writing top-level names to apache_beam.egg-info/top_level.txt
writing dependency_links to apache_beam.egg-info/dependency_links.txt
writing entry points to apache_beam.egg-info/entry_points.txt
reading manifest file 'apache_beam.egg-info/SOURCES.txt'
reading manifest template 'MANIFEST.in'
warning: no files found matching 'README.md'
warning: no files found matching 'NOTICE'
warning: no files found matching 'LICENSE'
writing manifest file 'apache_beam.egg-info/SOURCES.txt'
WARNING:root:python-snappy is not installed; some tests will be skipped.
WARNING:root:Tensorflow is not installed, so skipping some tests.
<https://builds.apache.org/job/beam_PostCommit_Py_ValCont/ws/src/sdks/python/apache_beam/runners/dataflow/dataflow_runner.py>:800: BeamDeprecationWarning: options is deprecated since First stable release. References to <pipeline>.options will not be supported
  options = pbegin.pipeline.options.view_as(DebugOptions)
test_wordcount_fnapi_it (apache_beam.examples.wordcount_it_test.WordCountIT) ... ERROR

======================================================================
ERROR: test_wordcount_fnapi_it (apache_beam.examples.wordcount_it_test.WordCountIT)
----------------------------------------------------------------------
Traceback (most recent call last):
  File "<https://builds.apache.org/job/beam_PostCommit_Py_ValCont/ws/src/sdks/python/container/local/lib/python2.7/site-packages/nose/plugins/multiprocess.py",> line 812, in run
    test(orig)
  File "<https://builds.apache.org/job/beam_PostCommit_Py_ValCont/ws/src/sdks/python/container/local/lib/python2.7/site-packages/nose/case.py",> line 45, in __call__
    return self.run(*arg, **kwarg)
  File "<https://builds.apache.org/job/beam_PostCommit_Py_ValCont/ws/src/sdks/python/container/local/lib/python2.7/site-packages/nose/case.py",> line 133, in run
    self.runTest(result)
  File "<https://builds.apache.org/job/beam_PostCommit_Py_ValCont/ws/src/sdks/python/container/local/lib/python2.7/site-packages/nose/case.py",> line 151, in runTest
    test(result)
  File "/usr/lib/python2.7/unittest/case.py", line 393, in __call__
    return self.run(*args, **kwds)
  File "/usr/lib/python2.7/unittest/case.py", line 329, in run
    testMethod()
  File "<https://builds.apache.org/job/beam_PostCommit_Py_ValCont/ws/src/sdks/python/apache_beam/examples/wordcount_it_test.py",> line 51, in test_wordcount_fnapi_it
    self._run_wordcount_it(experiment='beam_fn_api')
  File "<https://builds.apache.org/job/beam_PostCommit_Py_ValCont/ws/src/sdks/python/apache_beam/examples/wordcount_it_test.py",> line 75, in _run_wordcount_it
    wordcount.run(test_pipeline.get_full_options_as_args(**extra_opts))
  File "<https://builds.apache.org/job/beam_PostCommit_Py_ValCont/ws/src/sdks/python/apache_beam/examples/wordcount.py",> line 115, in run
    result = p.run()
  File "<https://builds.apache.org/job/beam_PostCommit_Py_ValCont/ws/src/sdks/python/apache_beam/pipeline.py",> line 405, in run
    self._options).run(False)
  File "<https://builds.apache.org/job/beam_PostCommit_Py_ValCont/ws/src/sdks/python/apache_beam/pipeline.py",> line 418, in run
    return self.runner.run_pipeline(self)
  File "<https://builds.apache.org/job/beam_PostCommit_Py_ValCont/ws/src/sdks/python/apache_beam/runners/dataflow/test_dataflow_runner.py",> line 70, in run_pipeline
    self.result.cancel()
  File "<https://builds.apache.org/job/beam_PostCommit_Py_ValCont/ws/src/sdks/python/apache_beam/runners/dataflow/dataflow_runner.py",> line 1208, in cancel
    return self.state
  File "<https://builds.apache.org/job/beam_PostCommit_Py_ValCont/ws/src/sdks/python/apache_beam/runners/dataflow/dataflow_runner.py",> line 1148, in state
    self._update_job()
  File "<https://builds.apache.org/job/beam_PostCommit_Py_ValCont/ws/src/sdks/python/apache_beam/runners/dataflow/dataflow_runner.py",> line 1104, in _update_job
    self._job = self._runner.dataflow_client.get_job(self.job_id())
  File "<https://builds.apache.org/job/beam_PostCommit_Py_ValCont/ws/src/sdks/python/apache_beam/utils/retry.py",> line 184, in wrapper
    return fun(*args, **kwargs)
  File "<https://builds.apache.org/job/beam_PostCommit_Py_ValCont/ws/src/sdks/python/apache_beam/runners/dataflow/internal/apiclient.py",> line 639, in get_job
    response = self._client.projects_locations_jobs.Get(request)
  File "<https://builds.apache.org/job/beam_PostCommit_Py_ValCont/ws/src/sdks/python/apache_beam/runners/dataflow/internal/clients/dataflow/dataflow_v1b3_client.py",> line 605, in Get
    config, request, global_params=global_params)
  File "<https://builds.apache.org/job/beam_PostCommit_Py_ValCont/ws/src/sdks/python/container/local/lib/python2.7/site-packages/apitools/base/py/base_api.py",> line 729, in _RunMethod
    http, http_request, **opts)
  File "<https://builds.apache.org/job/beam_PostCommit_Py_ValCont/ws/src/sdks/python/container/local/lib/python2.7/site-packages/apitools/base/py/http_wrapper.py",> line 346, in MakeRequest
    check_response_func=check_response_func)
  File "<https://builds.apache.org/job/beam_PostCommit_Py_ValCont/ws/src/sdks/python/container/local/lib/python2.7/site-packages/apitools/base/py/http_wrapper.py",> line 396, in _MakeRequestNoRetry
    redirections=redirections, connection_type=connection_type)
  File "<https://builds.apache.org/job/beam_PostCommit_Py_ValCont/ws/src/sdks/python/container/local/lib/python2.7/site-packages/oauth2client/transport.py",> line 175, in new_request
    redirections, connection_type)
  File "<https://builds.apache.org/job/beam_PostCommit_Py_ValCont/ws/src/sdks/python/container/local/lib/python2.7/site-packages/oauth2client/transport.py",> line 282, in request
    connection_type=connection_type)
  File "<https://builds.apache.org/job/beam_PostCommit_Py_ValCont/ws/src/sdks/python/container/local/lib/python2.7/site-packages/oauth2client/transport.py",> line 175, in new_request
    redirections, connection_type)
  File "<https://builds.apache.org/job/beam_PostCommit_Py_ValCont/ws/src/sdks/python/container/local/lib/python2.7/site-packages/oauth2client/transport.py",> line 282, in request
    connection_type=connection_type)
  File "<https://builds.apache.org/job/beam_PostCommit_Py_ValCont/ws/src/sdks/python/container/local/lib/python2.7/site-packages/httplib2/__init__.py",> line 1694, in request
    (response, content) = self._request(conn, authority, uri, request_uri, method, body, headers, redirections, cachekey)
  File "<https://builds.apache.org/job/beam_PostCommit_Py_ValCont/ws/src/sdks/python/container/local/lib/python2.7/site-packages/httplib2/__init__.py",> line 1434, in _request
    (response, content) = self._conn_request(conn, request_uri, method, body, headers)
  File "<https://builds.apache.org/job/beam_PostCommit_Py_ValCont/ws/src/sdks/python/container/local/lib/python2.7/site-packages/httplib2/__init__.py",> line 1390, in _conn_request
    response = conn.getresponse()
  File "/usr/lib/python2.7/httplib.py", line 1136, in getresponse
    response.begin()
  File "/usr/lib/python2.7/httplib.py", line 453, in begin
    version, status, reason = self._read_status()
  File "/usr/lib/python2.7/httplib.py", line 409, in _read_status
    line = self.fp.readline(_MAXLINE + 1)
  File "/usr/lib/python2.7/socket.py", line 480, in readline
    data = self._sock.recv(self._rbufsize)
  File "/usr/lib/python2.7/ssl.py", line 756, in recv
    return self.read(buflen)
  File "/usr/lib/python2.7/ssl.py", line 643, in read
    v = self._sslobj.read(len)
  File "<https://builds.apache.org/job/beam_PostCommit_Py_ValCont/ws/src/sdks/python/container/local/lib/python2.7/site-packages/nose/plugins/multiprocess.py",> line 276, in signalhandler
    raise TimedOutException()
TimedOutException: 'test_wordcount_fnapi_it (apache_beam.examples.wordcount_it_test.WordCountIT)'

----------------------------------------------------------------------
XML: <https://builds.apache.org/job/beam_PostCommit_Py_ValCont/ws/src/sdks/python/nosetests.xml>
----------------------------------------------------------------------
Ran 1 test in 902.286s

FAILED (errors=1)
cleanup_container
Untagged: us.gcr.io/apache-beam-testing/jenkins/python:20181116-094124
Untagged: us.gcr.io/apache-beam-testing/jenkins/python@sha256:4f343fce7e359db98b497ba352a7008b2fec3dfbc95ffb0f610d14813f3c3f56
Deleted: sha256:d6d4ee5e371787665cbf1801eb43d13b6bdceba98e7012ed936393645e801978
Deleted: sha256:c2ba5b111744bda845405265407166362d4c2c2cd70d58929fbc31d785764a6d
Deleted: sha256:07355f35a92a4e81596a8a6735f78777daf1c11d05bb63907c01097e48021f89
Deleted: sha256:4817b0ff3cd62e21a5c0a72ecdd92a76e41e0d4cb1a1a764cc320c329644b88b
Deleted: sha256:629948e939a20f52a687b3a56cd57f939742db6a81cf07c45c6cb5af972ca77d
Deleted: sha256:901db6529b2efde24db07d62624ef3d9bd137bbaf8a2cf8c69e51f4adca5158e
Deleted: sha256:ae02ee2d25cac5b22f7ee278c49dbc02adc6c07a4598276d879ab2ead7ef14b0
Deleted: sha256:83c24ec8ac8b901c35938e8681fcf375649ef7015de5c0f235a7640af0ed9785
Deleted: sha256:3ab69dc98a92931fb0daee35e51a80d8de5ac7034a98541b69aaef758aaea2f7
Deleted: sha256:40f5035ddafdf7398b03ffcb5ae0f8ff4b4c6052775af7e8039357312373e4df
Deleted: sha256:356b158c2b5825294ad7343bb2e729bb8587835af4abcb31bcde62e83bb2912d
Deleted: sha256:607e88605f90768fc1ea5b3628c9476347bc51c75863eb25ad6a6a019f1cdd51
Deleted: sha256:15a95f3f2dc6cd94dc7fbf1a50efea6773438a4214478000283839dc73c8cd58
Deleted: sha256:d03199bd5133d7684d5bb06a3c26418cd7caba6b7251d2a76da1cb59a36fa506
Digests:
- us.gcr.io/apache-beam-testing/jenkins/python@sha256:4f343fce7e359db98b497ba352a7008b2fec3dfbc95ffb0f610d14813f3c3f56
  Associated tags:
 - 20181116-094124
Tags:
- us.gcr.io/apache-beam-testing/jenkins/python:20181116-094124
Deleted [us.gcr.io/apache-beam-testing/jenkins/python:20181116-094124].
Deleted [us.gcr.io/apache-beam-testing/jenkins/python@sha256:4f343fce7e359db98b497ba352a7008b2fec3dfbc95ffb0f610d14813f3c3f56].
Removed the container
Build step 'Execute shell' marked build as failure

---------------------------------------------------------------------
To unsubscribe, e-mail: builds-unsubscribe@beam.apache.org
For additional commands, e-mail: builds-help@beam.apache.org


Build failed in Jenkins: beam_PostCommit_Py_ValCont #1437

Posted by Apache Jenkins Server <je...@builds.apache.org>.
See <https://builds.apache.org/job/beam_PostCommit_Py_ValCont/1437/display/redirect>

------------------------------------------
[...truncated 172.91 KB...]
copying apache_beam/testing/synthetic_pipeline.py -> apache-beam-2.9.0.dev0/apache_beam/testing
copying apache_beam/testing/synthetic_pipeline_test.py -> apache-beam-2.9.0.dev0/apache_beam/testing
copying apache_beam/testing/test_pipeline.py -> apache-beam-2.9.0.dev0/apache_beam/testing
copying apache_beam/testing/test_pipeline_test.py -> apache-beam-2.9.0.dev0/apache_beam/testing
copying apache_beam/testing/test_stream.py -> apache-beam-2.9.0.dev0/apache_beam/testing
copying apache_beam/testing/test_stream_test.py -> apache-beam-2.9.0.dev0/apache_beam/testing
copying apache_beam/testing/test_utils.py -> apache-beam-2.9.0.dev0/apache_beam/testing
copying apache_beam/testing/test_utils_test.py -> apache-beam-2.9.0.dev0/apache_beam/testing
copying apache_beam/testing/util.py -> apache-beam-2.9.0.dev0/apache_beam/testing
copying apache_beam/testing/util_test.py -> apache-beam-2.9.0.dev0/apache_beam/testing
copying apache_beam/testing/benchmarks/__init__.py -> apache-beam-2.9.0.dev0/apache_beam/testing/benchmarks
copying apache_beam/testing/benchmarks/nexmark/__init__.py -> apache-beam-2.9.0.dev0/apache_beam/testing/benchmarks/nexmark
copying apache_beam/testing/benchmarks/nexmark/nexmark_launcher.py -> apache-beam-2.9.0.dev0/apache_beam/testing/benchmarks/nexmark
copying apache_beam/testing/benchmarks/nexmark/nexmark_util.py -> apache-beam-2.9.0.dev0/apache_beam/testing/benchmarks/nexmark
copying apache_beam/testing/benchmarks/nexmark/models/__init__.py -> apache-beam-2.9.0.dev0/apache_beam/testing/benchmarks/nexmark/models
copying apache_beam/testing/benchmarks/nexmark/models/nexmark_model.py -> apache-beam-2.9.0.dev0/apache_beam/testing/benchmarks/nexmark/models
copying apache_beam/testing/benchmarks/nexmark/queries/__init__.py -> apache-beam-2.9.0.dev0/apache_beam/testing/benchmarks/nexmark/queries
copying apache_beam/testing/benchmarks/nexmark/queries/query0.py -> apache-beam-2.9.0.dev0/apache_beam/testing/benchmarks/nexmark/queries
copying apache_beam/testing/benchmarks/nexmark/queries/query1.py -> apache-beam-2.9.0.dev0/apache_beam/testing/benchmarks/nexmark/queries
copying apache_beam/testing/benchmarks/nexmark/queries/query2.py -> apache-beam-2.9.0.dev0/apache_beam/testing/benchmarks/nexmark/queries
copying apache_beam/testing/data/standard_coders.yaml -> apache-beam-2.9.0.dev0/apache_beam/testing/data
copying apache_beam/testing/data/trigger_transcripts.yaml -> apache-beam-2.9.0.dev0/apache_beam/testing/data
copying apache_beam/testing/load_tests/__init__.py -> apache-beam-2.9.0.dev0/apache_beam/testing/load_tests
copying apache_beam/testing/load_tests/co_group_by_key_test.py -> apache-beam-2.9.0.dev0/apache_beam/testing/load_tests
copying apache_beam/testing/load_tests/combine_test.py -> apache-beam-2.9.0.dev0/apache_beam/testing/load_tests
copying apache_beam/testing/load_tests/group_by_key_test.py -> apache-beam-2.9.0.dev0/apache_beam/testing/load_tests
copying apache_beam/testing/load_tests/load_test_metrics_utils.py -> apache-beam-2.9.0.dev0/apache_beam/testing/load_tests
copying apache_beam/testing/load_tests/pardo_test.py -> apache-beam-2.9.0.dev0/apache_beam/testing/load_tests
copying apache_beam/tools/__init__.py -> apache-beam-2.9.0.dev0/apache_beam/tools
copying apache_beam/tools/coders_microbenchmark.py -> apache-beam-2.9.0.dev0/apache_beam/tools
copying apache_beam/tools/distribution_counter_microbenchmark.py -> apache-beam-2.9.0.dev0/apache_beam/tools
copying apache_beam/tools/map_fn_microbenchmark.py -> apache-beam-2.9.0.dev0/apache_beam/tools
copying apache_beam/tools/microbenchmarks_test.py -> apache-beam-2.9.0.dev0/apache_beam/tools
copying apache_beam/tools/sideinput_microbenchmark.py -> apache-beam-2.9.0.dev0/apache_beam/tools
copying apache_beam/tools/utils.py -> apache-beam-2.9.0.dev0/apache_beam/tools
copying apache_beam/transforms/__init__.py -> apache-beam-2.9.0.dev0/apache_beam/transforms
copying apache_beam/transforms/combiners.py -> apache-beam-2.9.0.dev0/apache_beam/transforms
copying apache_beam/transforms/combiners_test.py -> apache-beam-2.9.0.dev0/apache_beam/transforms
copying apache_beam/transforms/core.py -> apache-beam-2.9.0.dev0/apache_beam/transforms
copying apache_beam/transforms/create_source.py -> apache-beam-2.9.0.dev0/apache_beam/transforms
copying apache_beam/transforms/create_test.py -> apache-beam-2.9.0.dev0/apache_beam/transforms
copying apache_beam/transforms/cy_combiners.pxd -> apache-beam-2.9.0.dev0/apache_beam/transforms
copying apache_beam/transforms/cy_combiners.py -> apache-beam-2.9.0.dev0/apache_beam/transforms
copying apache_beam/transforms/cy_dataflow_distribution_counter.pxd -> apache-beam-2.9.0.dev0/apache_beam/transforms
copying apache_beam/transforms/cy_dataflow_distribution_counter.pyx -> apache-beam-2.9.0.dev0/apache_beam/transforms
copying apache_beam/transforms/dataflow_distribution_counter_test.py -> apache-beam-2.9.0.dev0/apache_beam/transforms
copying apache_beam/transforms/display.py -> apache-beam-2.9.0.dev0/apache_beam/transforms
copying apache_beam/transforms/display_test.py -> apache-beam-2.9.0.dev0/apache_beam/transforms
copying apache_beam/transforms/ptransform.py -> apache-beam-2.9.0.dev0/apache_beam/transforms
copying apache_beam/transforms/ptransform_test.py -> apache-beam-2.9.0.dev0/apache_beam/transforms
copying apache_beam/transforms/py_dataflow_distribution_counter.py -> apache-beam-2.9.0.dev0/apache_beam/transforms
copying apache_beam/transforms/sideinputs.py -> apache-beam-2.9.0.dev0/apache_beam/transforms
copying apache_beam/transforms/sideinputs_test.py -> apache-beam-2.9.0.dev0/apache_beam/transforms
copying apache_beam/transforms/timeutil.py -> apache-beam-2.9.0.dev0/apache_beam/transforms
copying apache_beam/transforms/trigger.py -> apache-beam-2.9.0.dev0/apache_beam/transforms
copying apache_beam/transforms/trigger_test.py -> apache-beam-2.9.0.dev0/apache_beam/transforms
copying apache_beam/transforms/userstate.py -> apache-beam-2.9.0.dev0/apache_beam/transforms
copying apache_beam/transforms/userstate_test.py -> apache-beam-2.9.0.dev0/apache_beam/transforms
copying apache_beam/transforms/util.py -> apache-beam-2.9.0.dev0/apache_beam/transforms
copying apache_beam/transforms/util_test.py -> apache-beam-2.9.0.dev0/apache_beam/transforms
copying apache_beam/transforms/window.py -> apache-beam-2.9.0.dev0/apache_beam/transforms
copying apache_beam/transforms/window_test.py -> apache-beam-2.9.0.dev0/apache_beam/transforms
copying apache_beam/transforms/write_ptransform_test.py -> apache-beam-2.9.0.dev0/apache_beam/transforms
copying apache_beam/typehints/__init__.py -> apache-beam-2.9.0.dev0/apache_beam/typehints
copying apache_beam/typehints/decorators.py -> apache-beam-2.9.0.dev0/apache_beam/typehints
copying apache_beam/typehints/native_type_compatibility.py -> apache-beam-2.9.0.dev0/apache_beam/typehints
copying apache_beam/typehints/native_type_compatibility_test.py -> apache-beam-2.9.0.dev0/apache_beam/typehints
copying apache_beam/typehints/opcodes.py -> apache-beam-2.9.0.dev0/apache_beam/typehints
copying apache_beam/typehints/trivial_inference.py -> apache-beam-2.9.0.dev0/apache_beam/typehints
copying apache_beam/typehints/trivial_inference_test.py -> apache-beam-2.9.0.dev0/apache_beam/typehints
copying apache_beam/typehints/typecheck.py -> apache-beam-2.9.0.dev0/apache_beam/typehints
copying apache_beam/typehints/typed_pipeline_test.py -> apache-beam-2.9.0.dev0/apache_beam/typehints
copying apache_beam/typehints/typehints.py -> apache-beam-2.9.0.dev0/apache_beam/typehints
copying apache_beam/typehints/typehints_test.py -> apache-beam-2.9.0.dev0/apache_beam/typehints
copying apache_beam/utils/__init__.py -> apache-beam-2.9.0.dev0/apache_beam/utils
copying apache_beam/utils/annotations.py -> apache-beam-2.9.0.dev0/apache_beam/utils
copying apache_beam/utils/annotations_test.py -> apache-beam-2.9.0.dev0/apache_beam/utils
copying apache_beam/utils/counters.pxd -> apache-beam-2.9.0.dev0/apache_beam/utils
copying apache_beam/utils/counters.py -> apache-beam-2.9.0.dev0/apache_beam/utils
copying apache_beam/utils/counters_test.py -> apache-beam-2.9.0.dev0/apache_beam/utils
copying apache_beam/utils/plugin.py -> apache-beam-2.9.0.dev0/apache_beam/utils
copying apache_beam/utils/processes.py -> apache-beam-2.9.0.dev0/apache_beam/utils
copying apache_beam/utils/processes_test.py -> apache-beam-2.9.0.dev0/apache_beam/utils
copying apache_beam/utils/profiler.py -> apache-beam-2.9.0.dev0/apache_beam/utils
copying apache_beam/utils/proto_utils.py -> apache-beam-2.9.0.dev0/apache_beam/utils
copying apache_beam/utils/retry.py -> apache-beam-2.9.0.dev0/apache_beam/utils
copying apache_beam/utils/retry_test.py -> apache-beam-2.9.0.dev0/apache_beam/utils
copying apache_beam/utils/timestamp.py -> apache-beam-2.9.0.dev0/apache_beam/utils
copying apache_beam/utils/timestamp_test.py -> apache-beam-2.9.0.dev0/apache_beam/utils
copying apache_beam/utils/urns.py -> apache-beam-2.9.0.dev0/apache_beam/utils
copying apache_beam/utils/windowed_value.pxd -> apache-beam-2.9.0.dev0/apache_beam/utils
copying apache_beam/utils/windowed_value.py -> apache-beam-2.9.0.dev0/apache_beam/utils
copying apache_beam/utils/windowed_value_test.py -> apache-beam-2.9.0.dev0/apache_beam/utils
Writing apache-beam-2.9.0.dev0/setup.cfg
creating dist
Creating tar archive
removing 'apache-beam-2.9.0.dev0' (and everything under it)
SDK_LOCATION=$(find dist/apache-beam-*.tar.gz)
find dist/apache-beam-*.tar.gz

# Run ValidatesRunner tests on Google Cloud Dataflow service
echo ">>> RUNNING DATAFLOW RUNNER VALIDATESCONTAINER TEST"
>>> RUNNING DATAFLOW RUNNER VALIDATESCONTAINER TEST
python setup.py nosetests \
  --attr ValidatesContainer \
  --nologcapture \
  --processes=1 \
  --process-timeout=900 \
  --test-pipeline-options=" \
    --runner=TestDataflowRunner \
    --project=$PROJECT \
    --worker_harness_container_image=$CONTAINER:$TAG \
    --staging_location=$GCS_LOCATION/staging-validatesrunner-test \
    --temp_location=$GCS_LOCATION/temp-validatesrunner-test \
    --output=$GCS_LOCATION/output \
    --sdk_location=$SDK_LOCATION \
    --num_workers=1"
<https://builds.apache.org/job/beam_PostCommit_Py_ValCont/ws/src/sdks/python/container/local/lib/python2.7/site-packages/setuptools/dist.py>:470: UserWarning: Normalizing '2.9.0.dev' to '2.9.0.dev0'
  normalized_version,
running nosetests
running egg_info
<https://builds.apache.org/job/beam_PostCommit_Py_ValCont/ws/src/sdks/python/gen_protos.py>:52: UserWarning: Installing grpcio-tools is recommended for development.
  warnings.warn('Installing grpcio-tools is recommended for development.')
writing requirements to apache_beam.egg-info/requires.txt
writing apache_beam.egg-info/PKG-INFO
writing top-level names to apache_beam.egg-info/top_level.txt
writing dependency_links to apache_beam.egg-info/dependency_links.txt
writing entry points to apache_beam.egg-info/entry_points.txt
reading manifest file 'apache_beam.egg-info/SOURCES.txt'
reading manifest template 'MANIFEST.in'
warning: no files found matching 'README.md'
warning: no files found matching 'NOTICE'
warning: no files found matching 'LICENSE'
writing manifest file 'apache_beam.egg-info/SOURCES.txt'
WARNING:root:python-snappy is not installed; some tests will be skipped.
WARNING:root:Tensorflow is not installed, so skipping some tests.
<https://builds.apache.org/job/beam_PostCommit_Py_ValCont/ws/src/sdks/python/apache_beam/runners/dataflow/dataflow_runner.py>:800: BeamDeprecationWarning: options is deprecated since First stable release. References to <pipeline>.options will not be supported
  options = pbegin.pipeline.options.view_as(DebugOptions)
test_wordcount_fnapi_it (apache_beam.examples.wordcount_it_test.WordCountIT) ... ERROR

======================================================================
ERROR: test_wordcount_fnapi_it (apache_beam.examples.wordcount_it_test.WordCountIT)
----------------------------------------------------------------------
Traceback (most recent call last):
  File "<https://builds.apache.org/job/beam_PostCommit_Py_ValCont/ws/src/sdks/python/container/local/lib/python2.7/site-packages/nose/plugins/multiprocess.py",> line 812, in run
    test(orig)
  File "<https://builds.apache.org/job/beam_PostCommit_Py_ValCont/ws/src/sdks/python/container/local/lib/python2.7/site-packages/nose/case.py",> line 45, in __call__
    return self.run(*arg, **kwarg)
  File "<https://builds.apache.org/job/beam_PostCommit_Py_ValCont/ws/src/sdks/python/container/local/lib/python2.7/site-packages/nose/case.py",> line 133, in run
    self.runTest(result)
  File "<https://builds.apache.org/job/beam_PostCommit_Py_ValCont/ws/src/sdks/python/container/local/lib/python2.7/site-packages/nose/case.py",> line 151, in runTest
    test(result)
  File "/usr/lib/python2.7/unittest/case.py", line 393, in __call__
    return self.run(*args, **kwds)
  File "/usr/lib/python2.7/unittest/case.py", line 329, in run
    testMethod()
  File "<https://builds.apache.org/job/beam_PostCommit_Py_ValCont/ws/src/sdks/python/apache_beam/examples/wordcount_it_test.py",> line 51, in test_wordcount_fnapi_it
    self._run_wordcount_it(experiment='beam_fn_api')
  File "<https://builds.apache.org/job/beam_PostCommit_Py_ValCont/ws/src/sdks/python/apache_beam/examples/wordcount_it_test.py",> line 75, in _run_wordcount_it
    wordcount.run(test_pipeline.get_full_options_as_args(**extra_opts))
  File "<https://builds.apache.org/job/beam_PostCommit_Py_ValCont/ws/src/sdks/python/apache_beam/examples/wordcount.py",> line 115, in run
    result = p.run()
  File "<https://builds.apache.org/job/beam_PostCommit_Py_ValCont/ws/src/sdks/python/apache_beam/pipeline.py",> line 405, in run
    self._options).run(False)
  File "<https://builds.apache.org/job/beam_PostCommit_Py_ValCont/ws/src/sdks/python/apache_beam/pipeline.py",> line 418, in run
    return self.runner.run_pipeline(self)
  File "<https://builds.apache.org/job/beam_PostCommit_Py_ValCont/ws/src/sdks/python/apache_beam/runners/dataflow/test_dataflow_runner.py",> line 70, in run_pipeline
    self.result.cancel()
  File "<https://builds.apache.org/job/beam_PostCommit_Py_ValCont/ws/src/sdks/python/apache_beam/runners/dataflow/dataflow_runner.py",> line 1208, in cancel
    return self.state
  File "<https://builds.apache.org/job/beam_PostCommit_Py_ValCont/ws/src/sdks/python/apache_beam/runners/dataflow/dataflow_runner.py",> line 1148, in state
    self._update_job()
  File "<https://builds.apache.org/job/beam_PostCommit_Py_ValCont/ws/src/sdks/python/apache_beam/runners/dataflow/dataflow_runner.py",> line 1104, in _update_job
    self._job = self._runner.dataflow_client.get_job(self.job_id())
  File "<https://builds.apache.org/job/beam_PostCommit_Py_ValCont/ws/src/sdks/python/apache_beam/utils/retry.py",> line 184, in wrapper
    return fun(*args, **kwargs)
  File "<https://builds.apache.org/job/beam_PostCommit_Py_ValCont/ws/src/sdks/python/apache_beam/runners/dataflow/internal/apiclient.py",> line 639, in get_job
    response = self._client.projects_locations_jobs.Get(request)
  File "<https://builds.apache.org/job/beam_PostCommit_Py_ValCont/ws/src/sdks/python/apache_beam/runners/dataflow/internal/clients/dataflow/dataflow_v1b3_client.py",> line 605, in Get
    config, request, global_params=global_params)
  File "<https://builds.apache.org/job/beam_PostCommit_Py_ValCont/ws/src/sdks/python/container/local/lib/python2.7/site-packages/apitools/base/py/base_api.py",> line 729, in _RunMethod
    http, http_request, **opts)
  File "<https://builds.apache.org/job/beam_PostCommit_Py_ValCont/ws/src/sdks/python/container/local/lib/python2.7/site-packages/apitools/base/py/http_wrapper.py",> line 346, in MakeRequest
    check_response_func=check_response_func)
  File "<https://builds.apache.org/job/beam_PostCommit_Py_ValCont/ws/src/sdks/python/container/local/lib/python2.7/site-packages/apitools/base/py/http_wrapper.py",> line 396, in _MakeRequestNoRetry
    redirections=redirections, connection_type=connection_type)
  File "<https://builds.apache.org/job/beam_PostCommit_Py_ValCont/ws/src/sdks/python/container/local/lib/python2.7/site-packages/oauth2client/transport.py",> line 175, in new_request
    redirections, connection_type)
  File "<https://builds.apache.org/job/beam_PostCommit_Py_ValCont/ws/src/sdks/python/container/local/lib/python2.7/site-packages/oauth2client/transport.py",> line 282, in request
    connection_type=connection_type)
  File "<https://builds.apache.org/job/beam_PostCommit_Py_ValCont/ws/src/sdks/python/container/local/lib/python2.7/site-packages/oauth2client/transport.py",> line 175, in new_request
    redirections, connection_type)
  File "<https://builds.apache.org/job/beam_PostCommit_Py_ValCont/ws/src/sdks/python/container/local/lib/python2.7/site-packages/oauth2client/transport.py",> line 282, in request
    connection_type=connection_type)
  File "<https://builds.apache.org/job/beam_PostCommit_Py_ValCont/ws/src/sdks/python/container/local/lib/python2.7/site-packages/httplib2/__init__.py",> line 1694, in request
    (response, content) = self._request(conn, authority, uri, request_uri, method, body, headers, redirections, cachekey)
  File "<https://builds.apache.org/job/beam_PostCommit_Py_ValCont/ws/src/sdks/python/container/local/lib/python2.7/site-packages/httplib2/__init__.py",> line 1434, in _request
    (response, content) = self._conn_request(conn, request_uri, method, body, headers)
  File "<https://builds.apache.org/job/beam_PostCommit_Py_ValCont/ws/src/sdks/python/container/local/lib/python2.7/site-packages/httplib2/__init__.py",> line 1390, in _conn_request
    response = conn.getresponse()
  File "/usr/lib/python2.7/httplib.py", line 1136, in getresponse
    response.begin()
  File "/usr/lib/python2.7/httplib.py", line 453, in begin
    version, status, reason = self._read_status()
  File "/usr/lib/python2.7/httplib.py", line 409, in _read_status
    line = self.fp.readline(_MAXLINE + 1)
  File "/usr/lib/python2.7/socket.py", line 480, in readline
    data = self._sock.recv(self._rbufsize)
  File "/usr/lib/python2.7/ssl.py", line 756, in recv
    return self.read(buflen)
  File "/usr/lib/python2.7/ssl.py", line 643, in read
    v = self._sslobj.read(len)
  File "<https://builds.apache.org/job/beam_PostCommit_Py_ValCont/ws/src/sdks/python/container/local/lib/python2.7/site-packages/nose/plugins/multiprocess.py",> line 276, in signalhandler
    raise TimedOutException()
TimedOutException: 'test_wordcount_fnapi_it (apache_beam.examples.wordcount_it_test.WordCountIT)'

----------------------------------------------------------------------
XML: <https://builds.apache.org/job/beam_PostCommit_Py_ValCont/ws/src/sdks/python/nosetests.xml>
----------------------------------------------------------------------
Ran 1 test in 902.298s

FAILED (errors=1)
cleanup_container
Untagged: us.gcr.io/apache-beam-testing/jenkins/python:20181116-060008
Untagged: us.gcr.io/apache-beam-testing/jenkins/python@sha256:c0309d8753911707c8c6d582ea55ac2f4c68d13a64ed656347d7647baf008b0e
Deleted: sha256:740bf3caf725488bbb77f576b4cf19ec0b06dec4d6b8c97d857bd7870aaeda3b
Deleted: sha256:17d6bc440469ed8ab1194078cb5fdb19538d839f4e56a9fcf7aee06808794ec0
Deleted: sha256:d24b57650d130c3aad15bd291c020dbd5bb950031e0cc73f82ccdbae3e5e6088
Deleted: sha256:37ed0bb168599fe410a0d5d8c1507192ef1b23cec229f8eb32abd53f68242321
Deleted: sha256:60c2d942a860f8c5a16ceb8ff6ca5d92bfc49b72f121df5780c844ca82108af8
Deleted: sha256:0312b6f0d4c8e9c80838872ff3a88dd6f8ddf1bedca44f66533a0bb17e94229f
Deleted: sha256:0d68e7b45cb4007a7b0425d5d14b447a344ae4bc3c22d2739a9f5f03adc6abda
Deleted: sha256:34976c56e1c8d248c649224818d9e6edb5e3da01def9f5c6f316d8f43733ba59
Deleted: sha256:9164a35425444c0b90ad8a41fa4c4cd5bcf9985a8e641073d87a58a753ba08d2
Deleted: sha256:748ecd426a5df4be2c1b3f19084f86100c990f02e48b4cf9b8465733d9fae6d1
Deleted: sha256:dff641ff62c982ca850ec5c3e86b27725db35bcfeec34159b84064bdb36f9bd8
Deleted: sha256:b0b1bb28b771fd07c9f606f240610377cd855b50be91d116ab300eb2688e7014
Deleted: sha256:0815d22f06a52a36174ad6382ef250919b250482a5f5a6106a1a0f37f41e23b2
Deleted: sha256:c811b3b456af4ba7c7ef7a16c4090d3e4c17dcfbe931532aad311284d1a6441d
Digests:
- us.gcr.io/apache-beam-testing/jenkins/python@sha256:c0309d8753911707c8c6d582ea55ac2f4c68d13a64ed656347d7647baf008b0e
  Associated tags:
 - 20181116-060008
Tags:
- us.gcr.io/apache-beam-testing/jenkins/python:20181116-060008
Deleted [us.gcr.io/apache-beam-testing/jenkins/python:20181116-060008].
Deleted [us.gcr.io/apache-beam-testing/jenkins/python@sha256:c0309d8753911707c8c6d582ea55ac2f4c68d13a64ed656347d7647baf008b0e].
Removed the container
Build step 'Execute shell' marked build as failure

---------------------------------------------------------------------
To unsubscribe, e-mail: builds-unsubscribe@beam.apache.org
For additional commands, e-mail: builds-help@beam.apache.org


Build failed in Jenkins: beam_PostCommit_Py_ValCont #1436

Posted by Apache Jenkins Server <je...@builds.apache.org>.
See <https://builds.apache.org/job/beam_PostCommit_Py_ValCont/1436/display/redirect?page=changes>

Changes:

[markliu] [BEAM-5788] Update Dataflow API protocol buffers

------------------------------------------
[...truncated 172.96 KB...]
copying apache_beam/testing/synthetic_pipeline.py -> apache-beam-2.9.0.dev0/apache_beam/testing
copying apache_beam/testing/synthetic_pipeline_test.py -> apache-beam-2.9.0.dev0/apache_beam/testing
copying apache_beam/testing/test_pipeline.py -> apache-beam-2.9.0.dev0/apache_beam/testing
copying apache_beam/testing/test_pipeline_test.py -> apache-beam-2.9.0.dev0/apache_beam/testing
copying apache_beam/testing/test_stream.py -> apache-beam-2.9.0.dev0/apache_beam/testing
copying apache_beam/testing/test_stream_test.py -> apache-beam-2.9.0.dev0/apache_beam/testing
copying apache_beam/testing/test_utils.py -> apache-beam-2.9.0.dev0/apache_beam/testing
copying apache_beam/testing/test_utils_test.py -> apache-beam-2.9.0.dev0/apache_beam/testing
copying apache_beam/testing/util.py -> apache-beam-2.9.0.dev0/apache_beam/testing
copying apache_beam/testing/util_test.py -> apache-beam-2.9.0.dev0/apache_beam/testing
copying apache_beam/testing/benchmarks/__init__.py -> apache-beam-2.9.0.dev0/apache_beam/testing/benchmarks
copying apache_beam/testing/benchmarks/nexmark/__init__.py -> apache-beam-2.9.0.dev0/apache_beam/testing/benchmarks/nexmark
copying apache_beam/testing/benchmarks/nexmark/nexmark_launcher.py -> apache-beam-2.9.0.dev0/apache_beam/testing/benchmarks/nexmark
copying apache_beam/testing/benchmarks/nexmark/nexmark_util.py -> apache-beam-2.9.0.dev0/apache_beam/testing/benchmarks/nexmark
copying apache_beam/testing/benchmarks/nexmark/models/__init__.py -> apache-beam-2.9.0.dev0/apache_beam/testing/benchmarks/nexmark/models
copying apache_beam/testing/benchmarks/nexmark/models/nexmark_model.py -> apache-beam-2.9.0.dev0/apache_beam/testing/benchmarks/nexmark/models
copying apache_beam/testing/benchmarks/nexmark/queries/__init__.py -> apache-beam-2.9.0.dev0/apache_beam/testing/benchmarks/nexmark/queries
copying apache_beam/testing/benchmarks/nexmark/queries/query0.py -> apache-beam-2.9.0.dev0/apache_beam/testing/benchmarks/nexmark/queries
copying apache_beam/testing/benchmarks/nexmark/queries/query1.py -> apache-beam-2.9.0.dev0/apache_beam/testing/benchmarks/nexmark/queries
copying apache_beam/testing/benchmarks/nexmark/queries/query2.py -> apache-beam-2.9.0.dev0/apache_beam/testing/benchmarks/nexmark/queries
copying apache_beam/testing/data/standard_coders.yaml -> apache-beam-2.9.0.dev0/apache_beam/testing/data
copying apache_beam/testing/data/trigger_transcripts.yaml -> apache-beam-2.9.0.dev0/apache_beam/testing/data
copying apache_beam/testing/load_tests/__init__.py -> apache-beam-2.9.0.dev0/apache_beam/testing/load_tests
copying apache_beam/testing/load_tests/co_group_by_key_test.py -> apache-beam-2.9.0.dev0/apache_beam/testing/load_tests
copying apache_beam/testing/load_tests/combine_test.py -> apache-beam-2.9.0.dev0/apache_beam/testing/load_tests
copying apache_beam/testing/load_tests/group_by_key_test.py -> apache-beam-2.9.0.dev0/apache_beam/testing/load_tests
copying apache_beam/testing/load_tests/load_test_metrics_utils.py -> apache-beam-2.9.0.dev0/apache_beam/testing/load_tests
copying apache_beam/testing/load_tests/pardo_test.py -> apache-beam-2.9.0.dev0/apache_beam/testing/load_tests
copying apache_beam/tools/__init__.py -> apache-beam-2.9.0.dev0/apache_beam/tools
copying apache_beam/tools/coders_microbenchmark.py -> apache-beam-2.9.0.dev0/apache_beam/tools
copying apache_beam/tools/distribution_counter_microbenchmark.py -> apache-beam-2.9.0.dev0/apache_beam/tools
copying apache_beam/tools/map_fn_microbenchmark.py -> apache-beam-2.9.0.dev0/apache_beam/tools
copying apache_beam/tools/microbenchmarks_test.py -> apache-beam-2.9.0.dev0/apache_beam/tools
copying apache_beam/tools/sideinput_microbenchmark.py -> apache-beam-2.9.0.dev0/apache_beam/tools
copying apache_beam/tools/utils.py -> apache-beam-2.9.0.dev0/apache_beam/tools
copying apache_beam/transforms/__init__.py -> apache-beam-2.9.0.dev0/apache_beam/transforms
copying apache_beam/transforms/combiners.py -> apache-beam-2.9.0.dev0/apache_beam/transforms
copying apache_beam/transforms/combiners_test.py -> apache-beam-2.9.0.dev0/apache_beam/transforms
copying apache_beam/transforms/core.py -> apache-beam-2.9.0.dev0/apache_beam/transforms
copying apache_beam/transforms/create_source.py -> apache-beam-2.9.0.dev0/apache_beam/transforms
copying apache_beam/transforms/create_test.py -> apache-beam-2.9.0.dev0/apache_beam/transforms
copying apache_beam/transforms/cy_combiners.pxd -> apache-beam-2.9.0.dev0/apache_beam/transforms
copying apache_beam/transforms/cy_combiners.py -> apache-beam-2.9.0.dev0/apache_beam/transforms
copying apache_beam/transforms/cy_dataflow_distribution_counter.pxd -> apache-beam-2.9.0.dev0/apache_beam/transforms
copying apache_beam/transforms/cy_dataflow_distribution_counter.pyx -> apache-beam-2.9.0.dev0/apache_beam/transforms
copying apache_beam/transforms/dataflow_distribution_counter_test.py -> apache-beam-2.9.0.dev0/apache_beam/transforms
copying apache_beam/transforms/display.py -> apache-beam-2.9.0.dev0/apache_beam/transforms
copying apache_beam/transforms/display_test.py -> apache-beam-2.9.0.dev0/apache_beam/transforms
copying apache_beam/transforms/ptransform.py -> apache-beam-2.9.0.dev0/apache_beam/transforms
copying apache_beam/transforms/ptransform_test.py -> apache-beam-2.9.0.dev0/apache_beam/transforms
copying apache_beam/transforms/py_dataflow_distribution_counter.py -> apache-beam-2.9.0.dev0/apache_beam/transforms
copying apache_beam/transforms/sideinputs.py -> apache-beam-2.9.0.dev0/apache_beam/transforms
copying apache_beam/transforms/sideinputs_test.py -> apache-beam-2.9.0.dev0/apache_beam/transforms
copying apache_beam/transforms/timeutil.py -> apache-beam-2.9.0.dev0/apache_beam/transforms
copying apache_beam/transforms/trigger.py -> apache-beam-2.9.0.dev0/apache_beam/transforms
copying apache_beam/transforms/trigger_test.py -> apache-beam-2.9.0.dev0/apache_beam/transforms
copying apache_beam/transforms/userstate.py -> apache-beam-2.9.0.dev0/apache_beam/transforms
copying apache_beam/transforms/userstate_test.py -> apache-beam-2.9.0.dev0/apache_beam/transforms
copying apache_beam/transforms/util.py -> apache-beam-2.9.0.dev0/apache_beam/transforms
copying apache_beam/transforms/util_test.py -> apache-beam-2.9.0.dev0/apache_beam/transforms
copying apache_beam/transforms/window.py -> apache-beam-2.9.0.dev0/apache_beam/transforms
copying apache_beam/transforms/window_test.py -> apache-beam-2.9.0.dev0/apache_beam/transforms
copying apache_beam/transforms/write_ptransform_test.py -> apache-beam-2.9.0.dev0/apache_beam/transforms
copying apache_beam/typehints/__init__.py -> apache-beam-2.9.0.dev0/apache_beam/typehints
copying apache_beam/typehints/decorators.py -> apache-beam-2.9.0.dev0/apache_beam/typehints
copying apache_beam/typehints/native_type_compatibility.py -> apache-beam-2.9.0.dev0/apache_beam/typehints
copying apache_beam/typehints/native_type_compatibility_test.py -> apache-beam-2.9.0.dev0/apache_beam/typehints
copying apache_beam/typehints/opcodes.py -> apache-beam-2.9.0.dev0/apache_beam/typehints
copying apache_beam/typehints/trivial_inference.py -> apache-beam-2.9.0.dev0/apache_beam/typehints
copying apache_beam/typehints/trivial_inference_test.py -> apache-beam-2.9.0.dev0/apache_beam/typehints
copying apache_beam/typehints/typecheck.py -> apache-beam-2.9.0.dev0/apache_beam/typehints
copying apache_beam/typehints/typed_pipeline_test.py -> apache-beam-2.9.0.dev0/apache_beam/typehints
copying apache_beam/typehints/typehints.py -> apache-beam-2.9.0.dev0/apache_beam/typehints
copying apache_beam/typehints/typehints_test.py -> apache-beam-2.9.0.dev0/apache_beam/typehints
copying apache_beam/utils/__init__.py -> apache-beam-2.9.0.dev0/apache_beam/utils
copying apache_beam/utils/annotations.py -> apache-beam-2.9.0.dev0/apache_beam/utils
copying apache_beam/utils/annotations_test.py -> apache-beam-2.9.0.dev0/apache_beam/utils
copying apache_beam/utils/counters.pxd -> apache-beam-2.9.0.dev0/apache_beam/utils
copying apache_beam/utils/counters.py -> apache-beam-2.9.0.dev0/apache_beam/utils
copying apache_beam/utils/counters_test.py -> apache-beam-2.9.0.dev0/apache_beam/utils
copying apache_beam/utils/plugin.py -> apache-beam-2.9.0.dev0/apache_beam/utils
copying apache_beam/utils/processes.py -> apache-beam-2.9.0.dev0/apache_beam/utils
copying apache_beam/utils/processes_test.py -> apache-beam-2.9.0.dev0/apache_beam/utils
copying apache_beam/utils/profiler.py -> apache-beam-2.9.0.dev0/apache_beam/utils
copying apache_beam/utils/proto_utils.py -> apache-beam-2.9.0.dev0/apache_beam/utils
copying apache_beam/utils/retry.py -> apache-beam-2.9.0.dev0/apache_beam/utils
copying apache_beam/utils/retry_test.py -> apache-beam-2.9.0.dev0/apache_beam/utils
copying apache_beam/utils/timestamp.py -> apache-beam-2.9.0.dev0/apache_beam/utils
copying apache_beam/utils/timestamp_test.py -> apache-beam-2.9.0.dev0/apache_beam/utils
copying apache_beam/utils/urns.py -> apache-beam-2.9.0.dev0/apache_beam/utils
copying apache_beam/utils/windowed_value.pxd -> apache-beam-2.9.0.dev0/apache_beam/utils
copying apache_beam/utils/windowed_value.py -> apache-beam-2.9.0.dev0/apache_beam/utils
copying apache_beam/utils/windowed_value_test.py -> apache-beam-2.9.0.dev0/apache_beam/utils
Writing apache-beam-2.9.0.dev0/setup.cfg
creating dist
Creating tar archive
removing 'apache-beam-2.9.0.dev0' (and everything under it)
SDK_LOCATION=$(find dist/apache-beam-*.tar.gz)
find dist/apache-beam-*.tar.gz

# Run ValidatesRunner tests on Google Cloud Dataflow service
echo ">>> RUNNING DATAFLOW RUNNER VALIDATESCONTAINER TEST"
>>> RUNNING DATAFLOW RUNNER VALIDATESCONTAINER TEST
python setup.py nosetests \
  --attr ValidatesContainer \
  --nologcapture \
  --processes=1 \
  --process-timeout=900 \
  --test-pipeline-options=" \
    --runner=TestDataflowRunner \
    --project=$PROJECT \
    --worker_harness_container_image=$CONTAINER:$TAG \
    --staging_location=$GCS_LOCATION/staging-validatesrunner-test \
    --temp_location=$GCS_LOCATION/temp-validatesrunner-test \
    --output=$GCS_LOCATION/output \
    --sdk_location=$SDK_LOCATION \
    --num_workers=1"
<https://builds.apache.org/job/beam_PostCommit_Py_ValCont/ws/src/sdks/python/container/local/lib/python2.7/site-packages/setuptools/dist.py>:470: UserWarning: Normalizing '2.9.0.dev' to '2.9.0.dev0'
  normalized_version,
running nosetests
running egg_info
<https://builds.apache.org/job/beam_PostCommit_Py_ValCont/ws/src/sdks/python/gen_protos.py>:52: UserWarning: Installing grpcio-tools is recommended for development.
  warnings.warn('Installing grpcio-tools is recommended for development.')
writing requirements to apache_beam.egg-info/requires.txt
writing apache_beam.egg-info/PKG-INFO
writing top-level names to apache_beam.egg-info/top_level.txt
writing dependency_links to apache_beam.egg-info/dependency_links.txt
writing entry points to apache_beam.egg-info/entry_points.txt
reading manifest file 'apache_beam.egg-info/SOURCES.txt'
reading manifest template 'MANIFEST.in'
warning: no files found matching 'README.md'
warning: no files found matching 'NOTICE'
warning: no files found matching 'LICENSE'
writing manifest file 'apache_beam.egg-info/SOURCES.txt'
WARNING:root:python-snappy is not installed; some tests will be skipped.
WARNING:root:Tensorflow is not installed, so skipping some tests.
<https://builds.apache.org/job/beam_PostCommit_Py_ValCont/ws/src/sdks/python/apache_beam/runners/dataflow/dataflow_runner.py>:800: BeamDeprecationWarning: options is deprecated since First stable release. References to <pipeline>.options will not be supported
  options = pbegin.pipeline.options.view_as(DebugOptions)
test_wordcount_fnapi_it (apache_beam.examples.wordcount_it_test.WordCountIT) ... ERROR

======================================================================
ERROR: test_wordcount_fnapi_it (apache_beam.examples.wordcount_it_test.WordCountIT)
----------------------------------------------------------------------
Traceback (most recent call last):
  File "<https://builds.apache.org/job/beam_PostCommit_Py_ValCont/ws/src/sdks/python/container/local/lib/python2.7/site-packages/nose/plugins/multiprocess.py",> line 812, in run
    test(orig)
  File "<https://builds.apache.org/job/beam_PostCommit_Py_ValCont/ws/src/sdks/python/container/local/lib/python2.7/site-packages/nose/case.py",> line 45, in __call__
    return self.run(*arg, **kwarg)
  File "<https://builds.apache.org/job/beam_PostCommit_Py_ValCont/ws/src/sdks/python/container/local/lib/python2.7/site-packages/nose/case.py",> line 133, in run
    self.runTest(result)
  File "<https://builds.apache.org/job/beam_PostCommit_Py_ValCont/ws/src/sdks/python/container/local/lib/python2.7/site-packages/nose/case.py",> line 151, in runTest
    test(result)
  File "/usr/lib/python2.7/unittest/case.py", line 393, in __call__
    return self.run(*args, **kwds)
  File "/usr/lib/python2.7/unittest/case.py", line 329, in run
    testMethod()
  File "<https://builds.apache.org/job/beam_PostCommit_Py_ValCont/ws/src/sdks/python/apache_beam/examples/wordcount_it_test.py",> line 51, in test_wordcount_fnapi_it
    self._run_wordcount_it(experiment='beam_fn_api')
  File "<https://builds.apache.org/job/beam_PostCommit_Py_ValCont/ws/src/sdks/python/apache_beam/examples/wordcount_it_test.py",> line 75, in _run_wordcount_it
    wordcount.run(test_pipeline.get_full_options_as_args(**extra_opts))
  File "<https://builds.apache.org/job/beam_PostCommit_Py_ValCont/ws/src/sdks/python/apache_beam/examples/wordcount.py",> line 115, in run
    result = p.run()
  File "<https://builds.apache.org/job/beam_PostCommit_Py_ValCont/ws/src/sdks/python/apache_beam/pipeline.py",> line 405, in run
    self._options).run(False)
  File "<https://builds.apache.org/job/beam_PostCommit_Py_ValCont/ws/src/sdks/python/apache_beam/pipeline.py",> line 418, in run
    return self.runner.run_pipeline(self)
  File "<https://builds.apache.org/job/beam_PostCommit_Py_ValCont/ws/src/sdks/python/apache_beam/runners/dataflow/test_dataflow_runner.py",> line 70, in run_pipeline
    self.result.cancel()
  File "<https://builds.apache.org/job/beam_PostCommit_Py_ValCont/ws/src/sdks/python/apache_beam/runners/dataflow/dataflow_runner.py",> line 1208, in cancel
    return self.state
  File "<https://builds.apache.org/job/beam_PostCommit_Py_ValCont/ws/src/sdks/python/apache_beam/runners/dataflow/dataflow_runner.py",> line 1148, in state
    self._update_job()
  File "<https://builds.apache.org/job/beam_PostCommit_Py_ValCont/ws/src/sdks/python/apache_beam/runners/dataflow/dataflow_runner.py",> line 1104, in _update_job
    self._job = self._runner.dataflow_client.get_job(self.job_id())
  File "<https://builds.apache.org/job/beam_PostCommit_Py_ValCont/ws/src/sdks/python/apache_beam/utils/retry.py",> line 184, in wrapper
    return fun(*args, **kwargs)
  File "<https://builds.apache.org/job/beam_PostCommit_Py_ValCont/ws/src/sdks/python/apache_beam/runners/dataflow/internal/apiclient.py",> line 639, in get_job
    response = self._client.projects_locations_jobs.Get(request)
  File "<https://builds.apache.org/job/beam_PostCommit_Py_ValCont/ws/src/sdks/python/apache_beam/runners/dataflow/internal/clients/dataflow/dataflow_v1b3_client.py",> line 605, in Get
    config, request, global_params=global_params)
  File "<https://builds.apache.org/job/beam_PostCommit_Py_ValCont/ws/src/sdks/python/container/local/lib/python2.7/site-packages/apitools/base/py/base_api.py",> line 729, in _RunMethod
    http, http_request, **opts)
  File "<https://builds.apache.org/job/beam_PostCommit_Py_ValCont/ws/src/sdks/python/container/local/lib/python2.7/site-packages/apitools/base/py/http_wrapper.py",> line 346, in MakeRequest
    check_response_func=check_response_func)
  File "<https://builds.apache.org/job/beam_PostCommit_Py_ValCont/ws/src/sdks/python/container/local/lib/python2.7/site-packages/apitools/base/py/http_wrapper.py",> line 396, in _MakeRequestNoRetry
    redirections=redirections, connection_type=connection_type)
  File "<https://builds.apache.org/job/beam_PostCommit_Py_ValCont/ws/src/sdks/python/container/local/lib/python2.7/site-packages/oauth2client/transport.py",> line 175, in new_request
    redirections, connection_type)
  File "<https://builds.apache.org/job/beam_PostCommit_Py_ValCont/ws/src/sdks/python/container/local/lib/python2.7/site-packages/oauth2client/transport.py",> line 282, in request
    connection_type=connection_type)
  File "<https://builds.apache.org/job/beam_PostCommit_Py_ValCont/ws/src/sdks/python/container/local/lib/python2.7/site-packages/oauth2client/transport.py",> line 175, in new_request
    redirections, connection_type)
  File "<https://builds.apache.org/job/beam_PostCommit_Py_ValCont/ws/src/sdks/python/container/local/lib/python2.7/site-packages/oauth2client/transport.py",> line 282, in request
    connection_type=connection_type)
  File "<https://builds.apache.org/job/beam_PostCommit_Py_ValCont/ws/src/sdks/python/container/local/lib/python2.7/site-packages/httplib2/__init__.py",> line 1694, in request
    (response, content) = self._request(conn, authority, uri, request_uri, method, body, headers, redirections, cachekey)
  File "<https://builds.apache.org/job/beam_PostCommit_Py_ValCont/ws/src/sdks/python/container/local/lib/python2.7/site-packages/httplib2/__init__.py",> line 1434, in _request
    (response, content) = self._conn_request(conn, request_uri, method, body, headers)
  File "<https://builds.apache.org/job/beam_PostCommit_Py_ValCont/ws/src/sdks/python/container/local/lib/python2.7/site-packages/httplib2/__init__.py",> line 1390, in _conn_request
    response = conn.getresponse()
  File "/usr/lib/python2.7/httplib.py", line 1136, in getresponse
    response.begin()
  File "/usr/lib/python2.7/httplib.py", line 453, in begin
    version, status, reason = self._read_status()
  File "/usr/lib/python2.7/httplib.py", line 409, in _read_status
    line = self.fp.readline(_MAXLINE + 1)
  File "/usr/lib/python2.7/socket.py", line 480, in readline
    data = self._sock.recv(self._rbufsize)
  File "/usr/lib/python2.7/ssl.py", line 756, in recv
    return self.read(buflen)
  File "/usr/lib/python2.7/ssl.py", line 643, in read
    v = self._sslobj.read(len)
  File "<https://builds.apache.org/job/beam_PostCommit_Py_ValCont/ws/src/sdks/python/container/local/lib/python2.7/site-packages/nose/plugins/multiprocess.py",> line 276, in signalhandler
    raise TimedOutException()
TimedOutException: 'test_wordcount_fnapi_it (apache_beam.examples.wordcount_it_test.WordCountIT)'

----------------------------------------------------------------------
XML: <https://builds.apache.org/job/beam_PostCommit_Py_ValCont/ws/src/sdks/python/nosetests.xml>
----------------------------------------------------------------------
Ran 1 test in 902.293s

FAILED (errors=1)
cleanup_container
Untagged: us.gcr.io/apache-beam-testing/jenkins/python:20181116-043457
Untagged: us.gcr.io/apache-beam-testing/jenkins/python@sha256:84e0783079ff9c6980a4cb5f642dbfe59bd12497bd18b1bf50da475099eb6d76
Deleted: sha256:5a962f7770bcde66c9479ab2e3ce001c8015e182d3934673bbdbcadb8616f05c
Deleted: sha256:b48d16e8cbc845e4ca50ff2303778c05f93580199d0c6323e021d37dd9e78ccb
Deleted: sha256:a073de882d5ab8d2c29c036b77df9bd1f657b96b0a3f6691e4e08c4d8edf8147
Deleted: sha256:3b91ea4a3f896d0634327ae4cf2acffba5d6a5af7c8bf76144647658dc6fb67c
Deleted: sha256:732c18373b36bb0de3a75e4ea8130c657b29a910415ffba50df7b3c956c09878
Deleted: sha256:0527ff3f051e5b260e3bb17a2edde9277a61a26784ad8ed455b80f9fddcaa5a8
Deleted: sha256:59754e59dac14908796fb8a450d8b96d16fd9eac98f4d18f43ec1d2ceb987365
Deleted: sha256:3ca0cd08aa857e2e06c4cb40b1214f11b8dc95ee95f71360878a1bbab8a508a5
Deleted: sha256:74bc6cc471d29bf3c4d0c72efc9ccf23735c8f8758b703d93175223e5018279a
Deleted: sha256:1fc7550350af8e6e697e89d134709572382a99804e52b1ddb8cf09034828b7d4
Deleted: sha256:20edec51d7360570a28e3028f19ac97c9c2c435a26531ef95d556a8ef0cf01f4
Deleted: sha256:a25612847429b8ebcf29dcf03d07a4ce75797ecf2231c5a006e5d7c433336dd0
Deleted: sha256:710ab5dfe97d26a2922a7489c75eec2e0b1043fc316f0bfdad3722e4a2d45586
Deleted: sha256:77237e02a85ba1c509cc6b672b5283e8c8507a246f714bb89162c1b55246f8d8
Digests:
- us.gcr.io/apache-beam-testing/jenkins/python@sha256:84e0783079ff9c6980a4cb5f642dbfe59bd12497bd18b1bf50da475099eb6d76
  Associated tags:
 - 20181116-043457
Tags:
- us.gcr.io/apache-beam-testing/jenkins/python:20181116-043457
Deleted [us.gcr.io/apache-beam-testing/jenkins/python:20181116-043457].
Deleted [us.gcr.io/apache-beam-testing/jenkins/python@sha256:84e0783079ff9c6980a4cb5f642dbfe59bd12497bd18b1bf50da475099eb6d76].
Removed the container
Build step 'Execute shell' marked build as failure

---------------------------------------------------------------------
To unsubscribe, e-mail: builds-unsubscribe@beam.apache.org
For additional commands, e-mail: builds-help@beam.apache.org


Build failed in Jenkins: beam_PostCommit_Py_ValCont #1435

Posted by Apache Jenkins Server <je...@builds.apache.org>.
See <https://builds.apache.org/job/beam_PostCommit_Py_ValCont/1435/display/redirect?page=changes>

Changes:

[github] [BEAM-6056] Publish gRPC 1.13.1 as a vendored dependency. (#7042)

------------------------------------------
[...truncated 173.46 KB...]
copying apache_beam/testing/synthetic_pipeline.py -> apache-beam-2.9.0.dev0/apache_beam/testing
copying apache_beam/testing/synthetic_pipeline_test.py -> apache-beam-2.9.0.dev0/apache_beam/testing
copying apache_beam/testing/test_pipeline.py -> apache-beam-2.9.0.dev0/apache_beam/testing
copying apache_beam/testing/test_pipeline_test.py -> apache-beam-2.9.0.dev0/apache_beam/testing
copying apache_beam/testing/test_stream.py -> apache-beam-2.9.0.dev0/apache_beam/testing
copying apache_beam/testing/test_stream_test.py -> apache-beam-2.9.0.dev0/apache_beam/testing
copying apache_beam/testing/test_utils.py -> apache-beam-2.9.0.dev0/apache_beam/testing
copying apache_beam/testing/test_utils_test.py -> apache-beam-2.9.0.dev0/apache_beam/testing
copying apache_beam/testing/util.py -> apache-beam-2.9.0.dev0/apache_beam/testing
copying apache_beam/testing/util_test.py -> apache-beam-2.9.0.dev0/apache_beam/testing
copying apache_beam/testing/benchmarks/__init__.py -> apache-beam-2.9.0.dev0/apache_beam/testing/benchmarks
copying apache_beam/testing/benchmarks/nexmark/__init__.py -> apache-beam-2.9.0.dev0/apache_beam/testing/benchmarks/nexmark
copying apache_beam/testing/benchmarks/nexmark/nexmark_launcher.py -> apache-beam-2.9.0.dev0/apache_beam/testing/benchmarks/nexmark
copying apache_beam/testing/benchmarks/nexmark/nexmark_util.py -> apache-beam-2.9.0.dev0/apache_beam/testing/benchmarks/nexmark
copying apache_beam/testing/benchmarks/nexmark/models/__init__.py -> apache-beam-2.9.0.dev0/apache_beam/testing/benchmarks/nexmark/models
copying apache_beam/testing/benchmarks/nexmark/models/nexmark_model.py -> apache-beam-2.9.0.dev0/apache_beam/testing/benchmarks/nexmark/models
copying apache_beam/testing/benchmarks/nexmark/queries/__init__.py -> apache-beam-2.9.0.dev0/apache_beam/testing/benchmarks/nexmark/queries
copying apache_beam/testing/benchmarks/nexmark/queries/query0.py -> apache-beam-2.9.0.dev0/apache_beam/testing/benchmarks/nexmark/queries
copying apache_beam/testing/benchmarks/nexmark/queries/query1.py -> apache-beam-2.9.0.dev0/apache_beam/testing/benchmarks/nexmark/queries
copying apache_beam/testing/benchmarks/nexmark/queries/query2.py -> apache-beam-2.9.0.dev0/apache_beam/testing/benchmarks/nexmark/queries
copying apache_beam/testing/data/standard_coders.yaml -> apache-beam-2.9.0.dev0/apache_beam/testing/data
copying apache_beam/testing/data/trigger_transcripts.yaml -> apache-beam-2.9.0.dev0/apache_beam/testing/data
copying apache_beam/testing/load_tests/__init__.py -> apache-beam-2.9.0.dev0/apache_beam/testing/load_tests
copying apache_beam/testing/load_tests/co_group_by_key_test.py -> apache-beam-2.9.0.dev0/apache_beam/testing/load_tests
copying apache_beam/testing/load_tests/combine_test.py -> apache-beam-2.9.0.dev0/apache_beam/testing/load_tests
copying apache_beam/testing/load_tests/group_by_key_test.py -> apache-beam-2.9.0.dev0/apache_beam/testing/load_tests
copying apache_beam/testing/load_tests/load_test_metrics_utils.py -> apache-beam-2.9.0.dev0/apache_beam/testing/load_tests
copying apache_beam/testing/load_tests/pardo_test.py -> apache-beam-2.9.0.dev0/apache_beam/testing/load_tests
copying apache_beam/tools/__init__.py -> apache-beam-2.9.0.dev0/apache_beam/tools
copying apache_beam/tools/coders_microbenchmark.py -> apache-beam-2.9.0.dev0/apache_beam/tools
copying apache_beam/tools/distribution_counter_microbenchmark.py -> apache-beam-2.9.0.dev0/apache_beam/tools
copying apache_beam/tools/map_fn_microbenchmark.py -> apache-beam-2.9.0.dev0/apache_beam/tools
copying apache_beam/tools/microbenchmarks_test.py -> apache-beam-2.9.0.dev0/apache_beam/tools
copying apache_beam/tools/sideinput_microbenchmark.py -> apache-beam-2.9.0.dev0/apache_beam/tools
copying apache_beam/tools/utils.py -> apache-beam-2.9.0.dev0/apache_beam/tools
copying apache_beam/transforms/__init__.py -> apache-beam-2.9.0.dev0/apache_beam/transforms
copying apache_beam/transforms/combiners.py -> apache-beam-2.9.0.dev0/apache_beam/transforms
copying apache_beam/transforms/combiners_test.py -> apache-beam-2.9.0.dev0/apache_beam/transforms
copying apache_beam/transforms/core.py -> apache-beam-2.9.0.dev0/apache_beam/transforms
copying apache_beam/transforms/create_source.py -> apache-beam-2.9.0.dev0/apache_beam/transforms
copying apache_beam/transforms/create_test.py -> apache-beam-2.9.0.dev0/apache_beam/transforms
copying apache_beam/transforms/cy_combiners.pxd -> apache-beam-2.9.0.dev0/apache_beam/transforms
copying apache_beam/transforms/cy_combiners.py -> apache-beam-2.9.0.dev0/apache_beam/transforms
copying apache_beam/transforms/cy_dataflow_distribution_counter.pxd -> apache-beam-2.9.0.dev0/apache_beam/transforms
copying apache_beam/transforms/cy_dataflow_distribution_counter.pyx -> apache-beam-2.9.0.dev0/apache_beam/transforms
copying apache_beam/transforms/dataflow_distribution_counter_test.py -> apache-beam-2.9.0.dev0/apache_beam/transforms
copying apache_beam/transforms/display.py -> apache-beam-2.9.0.dev0/apache_beam/transforms
copying apache_beam/transforms/display_test.py -> apache-beam-2.9.0.dev0/apache_beam/transforms
copying apache_beam/transforms/ptransform.py -> apache-beam-2.9.0.dev0/apache_beam/transforms
copying apache_beam/transforms/ptransform_test.py -> apache-beam-2.9.0.dev0/apache_beam/transforms
copying apache_beam/transforms/py_dataflow_distribution_counter.py -> apache-beam-2.9.0.dev0/apache_beam/transforms
copying apache_beam/transforms/sideinputs.py -> apache-beam-2.9.0.dev0/apache_beam/transforms
copying apache_beam/transforms/sideinputs_test.py -> apache-beam-2.9.0.dev0/apache_beam/transforms
copying apache_beam/transforms/timeutil.py -> apache-beam-2.9.0.dev0/apache_beam/transforms
copying apache_beam/transforms/trigger.py -> apache-beam-2.9.0.dev0/apache_beam/transforms
copying apache_beam/transforms/trigger_test.py -> apache-beam-2.9.0.dev0/apache_beam/transforms
copying apache_beam/transforms/userstate.py -> apache-beam-2.9.0.dev0/apache_beam/transforms
copying apache_beam/transforms/userstate_test.py -> apache-beam-2.9.0.dev0/apache_beam/transforms
copying apache_beam/transforms/util.py -> apache-beam-2.9.0.dev0/apache_beam/transforms
copying apache_beam/transforms/util_test.py -> apache-beam-2.9.0.dev0/apache_beam/transforms
copying apache_beam/transforms/window.py -> apache-beam-2.9.0.dev0/apache_beam/transforms
copying apache_beam/transforms/window_test.py -> apache-beam-2.9.0.dev0/apache_beam/transforms
copying apache_beam/transforms/write_ptransform_test.py -> apache-beam-2.9.0.dev0/apache_beam/transforms
copying apache_beam/typehints/__init__.py -> apache-beam-2.9.0.dev0/apache_beam/typehints
copying apache_beam/typehints/decorators.py -> apache-beam-2.9.0.dev0/apache_beam/typehints
copying apache_beam/typehints/native_type_compatibility.py -> apache-beam-2.9.0.dev0/apache_beam/typehints
copying apache_beam/typehints/native_type_compatibility_test.py -> apache-beam-2.9.0.dev0/apache_beam/typehints
copying apache_beam/typehints/opcodes.py -> apache-beam-2.9.0.dev0/apache_beam/typehints
copying apache_beam/typehints/trivial_inference.py -> apache-beam-2.9.0.dev0/apache_beam/typehints
copying apache_beam/typehints/trivial_inference_test.py -> apache-beam-2.9.0.dev0/apache_beam/typehints
copying apache_beam/typehints/typecheck.py -> apache-beam-2.9.0.dev0/apache_beam/typehints
copying apache_beam/typehints/typed_pipeline_test.py -> apache-beam-2.9.0.dev0/apache_beam/typehints
copying apache_beam/typehints/typehints.py -> apache-beam-2.9.0.dev0/apache_beam/typehints
copying apache_beam/typehints/typehints_test.py -> apache-beam-2.9.0.dev0/apache_beam/typehints
copying apache_beam/utils/__init__.py -> apache-beam-2.9.0.dev0/apache_beam/utils
copying apache_beam/utils/annotations.py -> apache-beam-2.9.0.dev0/apache_beam/utils
copying apache_beam/utils/annotations_test.py -> apache-beam-2.9.0.dev0/apache_beam/utils
copying apache_beam/utils/counters.pxd -> apache-beam-2.9.0.dev0/apache_beam/utils
copying apache_beam/utils/counters.py -> apache-beam-2.9.0.dev0/apache_beam/utils
copying apache_beam/utils/counters_test.py -> apache-beam-2.9.0.dev0/apache_beam/utils
copying apache_beam/utils/plugin.py -> apache-beam-2.9.0.dev0/apache_beam/utils
copying apache_beam/utils/processes.py -> apache-beam-2.9.0.dev0/apache_beam/utils
copying apache_beam/utils/processes_test.py -> apache-beam-2.9.0.dev0/apache_beam/utils
copying apache_beam/utils/profiler.py -> apache-beam-2.9.0.dev0/apache_beam/utils
copying apache_beam/utils/proto_utils.py -> apache-beam-2.9.0.dev0/apache_beam/utils
copying apache_beam/utils/retry.py -> apache-beam-2.9.0.dev0/apache_beam/utils
copying apache_beam/utils/retry_test.py -> apache-beam-2.9.0.dev0/apache_beam/utils
copying apache_beam/utils/timestamp.py -> apache-beam-2.9.0.dev0/apache_beam/utils
copying apache_beam/utils/timestamp_test.py -> apache-beam-2.9.0.dev0/apache_beam/utils
copying apache_beam/utils/urns.py -> apache-beam-2.9.0.dev0/apache_beam/utils
copying apache_beam/utils/windowed_value.pxd -> apache-beam-2.9.0.dev0/apache_beam/utils
copying apache_beam/utils/windowed_value.py -> apache-beam-2.9.0.dev0/apache_beam/utils
copying apache_beam/utils/windowed_value_test.py -> apache-beam-2.9.0.dev0/apache_beam/utils
Writing apache-beam-2.9.0.dev0/setup.cfg
creating dist
Creating tar archive
removing 'apache-beam-2.9.0.dev0' (and everything under it)
SDK_LOCATION=$(find dist/apache-beam-*.tar.gz)
find dist/apache-beam-*.tar.gz

# Run ValidatesRunner tests on Google Cloud Dataflow service
echo ">>> RUNNING DATAFLOW RUNNER VALIDATESCONTAINER TEST"
>>> RUNNING DATAFLOW RUNNER VALIDATESCONTAINER TEST
python setup.py nosetests \
  --attr ValidatesContainer \
  --nologcapture \
  --processes=1 \
  --process-timeout=900 \
  --test-pipeline-options=" \
    --runner=TestDataflowRunner \
    --project=$PROJECT \
    --worker_harness_container_image=$CONTAINER:$TAG \
    --staging_location=$GCS_LOCATION/staging-validatesrunner-test \
    --temp_location=$GCS_LOCATION/temp-validatesrunner-test \
    --output=$GCS_LOCATION/output \
    --sdk_location=$SDK_LOCATION \
    --num_workers=1"
<https://builds.apache.org/job/beam_PostCommit_Py_ValCont/ws/src/sdks/python/container/local/lib/python2.7/site-packages/setuptools/dist.py>:470: UserWarning: Normalizing '2.9.0.dev' to '2.9.0.dev0'
  normalized_version,
running nosetests
running egg_info
<https://builds.apache.org/job/beam_PostCommit_Py_ValCont/ws/src/sdks/python/gen_protos.py>:52: UserWarning: Installing grpcio-tools is recommended for development.
  warnings.warn('Installing grpcio-tools is recommended for development.')
writing requirements to apache_beam.egg-info/requires.txt
writing apache_beam.egg-info/PKG-INFO
writing top-level names to apache_beam.egg-info/top_level.txt
writing dependency_links to apache_beam.egg-info/dependency_links.txt
writing entry points to apache_beam.egg-info/entry_points.txt
reading manifest file 'apache_beam.egg-info/SOURCES.txt'
reading manifest template 'MANIFEST.in'
warning: no files found matching 'README.md'
warning: no files found matching 'NOTICE'
warning: no files found matching 'LICENSE'
writing manifest file 'apache_beam.egg-info/SOURCES.txt'
WARNING:root:python-snappy is not installed; some tests will be skipped.
WARNING:root:Tensorflow is not installed, so skipping some tests.
<https://builds.apache.org/job/beam_PostCommit_Py_ValCont/ws/src/sdks/python/apache_beam/runners/dataflow/dataflow_runner.py>:800: BeamDeprecationWarning: options is deprecated since First stable release. References to <pipeline>.options will not be supported
  options = pbegin.pipeline.options.view_as(DebugOptions)
test_wordcount_fnapi_it (apache_beam.examples.wordcount_it_test.WordCountIT) ... ERROR

======================================================================
ERROR: test_wordcount_fnapi_it (apache_beam.examples.wordcount_it_test.WordCountIT)
----------------------------------------------------------------------
Traceback (most recent call last):
  File "<https://builds.apache.org/job/beam_PostCommit_Py_ValCont/ws/src/sdks/python/container/local/lib/python2.7/site-packages/nose/plugins/multiprocess.py",> line 812, in run
    test(orig)
  File "<https://builds.apache.org/job/beam_PostCommit_Py_ValCont/ws/src/sdks/python/container/local/lib/python2.7/site-packages/nose/case.py",> line 45, in __call__
    return self.run(*arg, **kwarg)
  File "<https://builds.apache.org/job/beam_PostCommit_Py_ValCont/ws/src/sdks/python/container/local/lib/python2.7/site-packages/nose/case.py",> line 133, in run
    self.runTest(result)
  File "<https://builds.apache.org/job/beam_PostCommit_Py_ValCont/ws/src/sdks/python/container/local/lib/python2.7/site-packages/nose/case.py",> line 151, in runTest
    test(result)
  File "/usr/lib/python2.7/unittest/case.py", line 393, in __call__
    return self.run(*args, **kwds)
  File "/usr/lib/python2.7/unittest/case.py", line 329, in run
    testMethod()
  File "<https://builds.apache.org/job/beam_PostCommit_Py_ValCont/ws/src/sdks/python/apache_beam/examples/wordcount_it_test.py",> line 51, in test_wordcount_fnapi_it
    self._run_wordcount_it(experiment='beam_fn_api')
  File "<https://builds.apache.org/job/beam_PostCommit_Py_ValCont/ws/src/sdks/python/apache_beam/examples/wordcount_it_test.py",> line 75, in _run_wordcount_it
    wordcount.run(test_pipeline.get_full_options_as_args(**extra_opts))
  File "<https://builds.apache.org/job/beam_PostCommit_Py_ValCont/ws/src/sdks/python/apache_beam/examples/wordcount.py",> line 115, in run
    result = p.run()
  File "<https://builds.apache.org/job/beam_PostCommit_Py_ValCont/ws/src/sdks/python/apache_beam/pipeline.py",> line 405, in run
    self._options).run(False)
  File "<https://builds.apache.org/job/beam_PostCommit_Py_ValCont/ws/src/sdks/python/apache_beam/pipeline.py",> line 418, in run
    return self.runner.run_pipeline(self)
  File "<https://builds.apache.org/job/beam_PostCommit_Py_ValCont/ws/src/sdks/python/apache_beam/runners/dataflow/test_dataflow_runner.py",> line 70, in run_pipeline
    self.result.cancel()
  File "<https://builds.apache.org/job/beam_PostCommit_Py_ValCont/ws/src/sdks/python/apache_beam/runners/dataflow/dataflow_runner.py",> line 1208, in cancel
    return self.state
  File "<https://builds.apache.org/job/beam_PostCommit_Py_ValCont/ws/src/sdks/python/apache_beam/runners/dataflow/dataflow_runner.py",> line 1148, in state
    self._update_job()
  File "<https://builds.apache.org/job/beam_PostCommit_Py_ValCont/ws/src/sdks/python/apache_beam/runners/dataflow/dataflow_runner.py",> line 1104, in _update_job
    self._job = self._runner.dataflow_client.get_job(self.job_id())
  File "<https://builds.apache.org/job/beam_PostCommit_Py_ValCont/ws/src/sdks/python/apache_beam/utils/retry.py",> line 184, in wrapper
    return fun(*args, **kwargs)
  File "<https://builds.apache.org/job/beam_PostCommit_Py_ValCont/ws/src/sdks/python/apache_beam/runners/dataflow/internal/apiclient.py",> line 639, in get_job
    response = self._client.projects_locations_jobs.Get(request)
  File "<https://builds.apache.org/job/beam_PostCommit_Py_ValCont/ws/src/sdks/python/apache_beam/runners/dataflow/internal/clients/dataflow/dataflow_v1b3_client.py",> line 604, in Get
    config, request, global_params=global_params)
  File "<https://builds.apache.org/job/beam_PostCommit_Py_ValCont/ws/src/sdks/python/container/local/lib/python2.7/site-packages/apitools/base/py/base_api.py",> line 729, in _RunMethod
    http, http_request, **opts)
  File "<https://builds.apache.org/job/beam_PostCommit_Py_ValCont/ws/src/sdks/python/container/local/lib/python2.7/site-packages/apitools/base/py/http_wrapper.py",> line 346, in MakeRequest
    check_response_func=check_response_func)
  File "<https://builds.apache.org/job/beam_PostCommit_Py_ValCont/ws/src/sdks/python/container/local/lib/python2.7/site-packages/apitools/base/py/http_wrapper.py",> line 396, in _MakeRequestNoRetry
    redirections=redirections, connection_type=connection_type)
  File "<https://builds.apache.org/job/beam_PostCommit_Py_ValCont/ws/src/sdks/python/container/local/lib/python2.7/site-packages/oauth2client/transport.py",> line 175, in new_request
    redirections, connection_type)
  File "<https://builds.apache.org/job/beam_PostCommit_Py_ValCont/ws/src/sdks/python/container/local/lib/python2.7/site-packages/oauth2client/transport.py",> line 282, in request
    connection_type=connection_type)
  File "<https://builds.apache.org/job/beam_PostCommit_Py_ValCont/ws/src/sdks/python/container/local/lib/python2.7/site-packages/oauth2client/transport.py",> line 175, in new_request
    redirections, connection_type)
  File "<https://builds.apache.org/job/beam_PostCommit_Py_ValCont/ws/src/sdks/python/container/local/lib/python2.7/site-packages/oauth2client/transport.py",> line 282, in request
    connection_type=connection_type)
  File "<https://builds.apache.org/job/beam_PostCommit_Py_ValCont/ws/src/sdks/python/container/local/lib/python2.7/site-packages/httplib2/__init__.py",> line 1694, in request
    (response, content) = self._request(conn, authority, uri, request_uri, method, body, headers, redirections, cachekey)
  File "<https://builds.apache.org/job/beam_PostCommit_Py_ValCont/ws/src/sdks/python/container/local/lib/python2.7/site-packages/httplib2/__init__.py",> line 1434, in _request
    (response, content) = self._conn_request(conn, request_uri, method, body, headers)
  File "<https://builds.apache.org/job/beam_PostCommit_Py_ValCont/ws/src/sdks/python/container/local/lib/python2.7/site-packages/httplib2/__init__.py",> line 1390, in _conn_request
    response = conn.getresponse()
  File "/usr/lib/python2.7/httplib.py", line 1136, in getresponse
    response.begin()
  File "/usr/lib/python2.7/httplib.py", line 453, in begin
    version, status, reason = self._read_status()
  File "/usr/lib/python2.7/httplib.py", line 409, in _read_status
    line = self.fp.readline(_MAXLINE + 1)
  File "/usr/lib/python2.7/socket.py", line 480, in readline
    data = self._sock.recv(self._rbufsize)
  File "/usr/lib/python2.7/ssl.py", line 756, in recv
    return self.read(buflen)
  File "/usr/lib/python2.7/ssl.py", line 643, in read
    v = self._sslobj.read(len)
  File "<https://builds.apache.org/job/beam_PostCommit_Py_ValCont/ws/src/sdks/python/container/local/lib/python2.7/site-packages/nose/plugins/multiprocess.py",> line 276, in signalhandler
    raise TimedOutException()
TimedOutException: 'test_wordcount_fnapi_it (apache_beam.examples.wordcount_it_test.WordCountIT)'

----------------------------------------------------------------------
XML: <https://builds.apache.org/job/beam_PostCommit_Py_ValCont/ws/src/sdks/python/nosetests.xml>
----------------------------------------------------------------------
Ran 1 test in 901.976s

FAILED (errors=1)
cleanup_container
Untagged: us.gcr.io/apache-beam-testing/jenkins/python:20181116-013356
Untagged: us.gcr.io/apache-beam-testing/jenkins/python@sha256:6381e6c4a805da3e3a3455f45c18a6063aa0688341611acf02c1c51b5ccc3f12
Deleted: sha256:9a12d497a82ce4cb7c9050fbe511908ac9daf37aa506ddce4356f989dc1a99e2
Deleted: sha256:02b1ffb7a3ec695718b1cede247e1e3b22507ad1664d3a38b0b2cb796e304651
Deleted: sha256:211a0a8b0820e85a93a592b4e4a06c5d53e4c7609afd06bb471e74241ede52c5
Deleted: sha256:a7fb525e08b913a8387be9a0b43f96efd06bc8dd7002555a9b0943ecd9cfc0df
Deleted: sha256:497ae9b79b9566b1a41bf73a224735af69a2c6bfc660d5495eaa4ba31b7d1a19
Deleted: sha256:04bbd59a005a554aa0e547891b2331ab3b804942a09740b5b9cc598a271ee0eb
Deleted: sha256:2fc46d71986a4b272cc59732d1a9bad4e13a3bae675f9cacfbcae4f51765f3fd
Deleted: sha256:bdb76a6477bafa4d03c628fd09402219c91e6786630994b9ae5e81980e295956
Deleted: sha256:8934b668cd7e92166f1bd58e25cb2a155ce7b23417a0426d8438e58391480707
Deleted: sha256:0e9d3bbff7c352c9e7a0b7937aae38e528614076b0c08a539f3db793582b2747
Deleted: sha256:64fbf57245300b525b5eca2dd3cc7ad85e69d38d4d70a99e6c8abef04d61b646
Deleted: sha256:0b9cb801d8e57ca0f16ff049531e59cbf6da0980e6437ad56f309f2a1d2b9fee
Deleted: sha256:6506fb0308288e04d5f5f3c0a72cf78e24351c019531e5d6bd22e78c4a63a9b9
Deleted: sha256:3f82d6521a5eb570638ce64a126cba498a2e6e316e38a0a79dc6917f4fe3963d
Digests:
- us.gcr.io/apache-beam-testing/jenkins/python@sha256:6381e6c4a805da3e3a3455f45c18a6063aa0688341611acf02c1c51b5ccc3f12
  Associated tags:
 - 20181116-013356
Tags:
- us.gcr.io/apache-beam-testing/jenkins/python:20181116-013356
Deleted [us.gcr.io/apache-beam-testing/jenkins/python:20181116-013356].
Deleted [us.gcr.io/apache-beam-testing/jenkins/python@sha256:6381e6c4a805da3e3a3455f45c18a6063aa0688341611acf02c1c51b5ccc3f12].
Removed the container
Build step 'Execute shell' marked build as failure

---------------------------------------------------------------------
To unsubscribe, e-mail: builds-unsubscribe@beam.apache.org
For additional commands, e-mail: builds-help@beam.apache.org


Build failed in Jenkins: beam_PostCommit_Py_ValCont #1434

Posted by Apache Jenkins Server <je...@builds.apache.org>.
See <https://builds.apache.org/job/beam_PostCommit_Py_ValCont/1434/display/redirect?page=changes>

Changes:

[robinyqiu] Fix for failure in beam-sdks-python:docs: Sphinx cannot find

------------------------------------------
[...truncated 173.12 KB...]
copying apache_beam/testing/test_pipeline.py -> apache-beam-2.9.0.dev0/apache_beam/testing
copying apache_beam/testing/test_pipeline_test.py -> apache-beam-2.9.0.dev0/apache_beam/testing
copying apache_beam/testing/test_stream.py -> apache-beam-2.9.0.dev0/apache_beam/testing
copying apache_beam/testing/test_stream_test.py -> apache-beam-2.9.0.dev0/apache_beam/testing
copying apache_beam/testing/test_utils.py -> apache-beam-2.9.0.dev0/apache_beam/testing
copying apache_beam/testing/test_utils_test.py -> apache-beam-2.9.0.dev0/apache_beam/testing
copying apache_beam/testing/util.py -> apache-beam-2.9.0.dev0/apache_beam/testing
copying apache_beam/testing/util_test.py -> apache-beam-2.9.0.dev0/apache_beam/testing
copying apache_beam/testing/benchmarks/__init__.py -> apache-beam-2.9.0.dev0/apache_beam/testing/benchmarks
copying apache_beam/testing/benchmarks/nexmark/__init__.py -> apache-beam-2.9.0.dev0/apache_beam/testing/benchmarks/nexmark
copying apache_beam/testing/benchmarks/nexmark/nexmark_launcher.py -> apache-beam-2.9.0.dev0/apache_beam/testing/benchmarks/nexmark
copying apache_beam/testing/benchmarks/nexmark/nexmark_util.py -> apache-beam-2.9.0.dev0/apache_beam/testing/benchmarks/nexmark
copying apache_beam/testing/benchmarks/nexmark/models/__init__.py -> apache-beam-2.9.0.dev0/apache_beam/testing/benchmarks/nexmark/models
copying apache_beam/testing/benchmarks/nexmark/models/nexmark_model.py -> apache-beam-2.9.0.dev0/apache_beam/testing/benchmarks/nexmark/models
copying apache_beam/testing/benchmarks/nexmark/queries/__init__.py -> apache-beam-2.9.0.dev0/apache_beam/testing/benchmarks/nexmark/queries
copying apache_beam/testing/benchmarks/nexmark/queries/query0.py -> apache-beam-2.9.0.dev0/apache_beam/testing/benchmarks/nexmark/queries
copying apache_beam/testing/benchmarks/nexmark/queries/query1.py -> apache-beam-2.9.0.dev0/apache_beam/testing/benchmarks/nexmark/queries
copying apache_beam/testing/benchmarks/nexmark/queries/query2.py -> apache-beam-2.9.0.dev0/apache_beam/testing/benchmarks/nexmark/queries
copying apache_beam/testing/data/standard_coders.yaml -> apache-beam-2.9.0.dev0/apache_beam/testing/data
copying apache_beam/testing/data/trigger_transcripts.yaml -> apache-beam-2.9.0.dev0/apache_beam/testing/data
copying apache_beam/testing/load_tests/__init__.py -> apache-beam-2.9.0.dev0/apache_beam/testing/load_tests
copying apache_beam/testing/load_tests/co_group_by_key_test.py -> apache-beam-2.9.0.dev0/apache_beam/testing/load_tests
copying apache_beam/testing/load_tests/combine_test.py -> apache-beam-2.9.0.dev0/apache_beam/testing/load_tests
copying apache_beam/testing/load_tests/group_by_key_test.py -> apache-beam-2.9.0.dev0/apache_beam/testing/load_tests
copying apache_beam/testing/load_tests/load_test_metrics_utils.py -> apache-beam-2.9.0.dev0/apache_beam/testing/load_tests
copying apache_beam/testing/load_tests/pardo_test.py -> apache-beam-2.9.0.dev0/apache_beam/testing/load_tests
copying apache_beam/tools/__init__.py -> apache-beam-2.9.0.dev0/apache_beam/tools
copying apache_beam/tools/coders_microbenchmark.py -> apache-beam-2.9.0.dev0/apache_beam/tools
copying apache_beam/tools/distribution_counter_microbenchmark.py -> apache-beam-2.9.0.dev0/apache_beam/tools
copying apache_beam/tools/map_fn_microbenchmark.py -> apache-beam-2.9.0.dev0/apache_beam/tools
copying apache_beam/tools/microbenchmarks_test.py -> apache-beam-2.9.0.dev0/apache_beam/tools
copying apache_beam/tools/sideinput_microbenchmark.py -> apache-beam-2.9.0.dev0/apache_beam/tools
copying apache_beam/tools/utils.py -> apache-beam-2.9.0.dev0/apache_beam/tools
copying apache_beam/transforms/__init__.py -> apache-beam-2.9.0.dev0/apache_beam/transforms
copying apache_beam/transforms/combiners.py -> apache-beam-2.9.0.dev0/apache_beam/transforms
copying apache_beam/transforms/combiners_test.py -> apache-beam-2.9.0.dev0/apache_beam/transforms
copying apache_beam/transforms/core.py -> apache-beam-2.9.0.dev0/apache_beam/transforms
copying apache_beam/transforms/create_source.py -> apache-beam-2.9.0.dev0/apache_beam/transforms
copying apache_beam/transforms/create_test.py -> apache-beam-2.9.0.dev0/apache_beam/transforms
copying apache_beam/transforms/cy_combiners.pxd -> apache-beam-2.9.0.dev0/apache_beam/transforms
copying apache_beam/transforms/cy_combiners.py -> apache-beam-2.9.0.dev0/apache_beam/transforms
copying apache_beam/transforms/cy_dataflow_distribution_counter.pxd -> apache-beam-2.9.0.dev0/apache_beam/transforms
copying apache_beam/transforms/cy_dataflow_distribution_counter.pyx -> apache-beam-2.9.0.dev0/apache_beam/transforms
copying apache_beam/transforms/dataflow_distribution_counter_test.py -> apache-beam-2.9.0.dev0/apache_beam/transforms
copying apache_beam/transforms/display.py -> apache-beam-2.9.0.dev0/apache_beam/transforms
copying apache_beam/transforms/display_test.py -> apache-beam-2.9.0.dev0/apache_beam/transforms
copying apache_beam/transforms/ptransform.py -> apache-beam-2.9.0.dev0/apache_beam/transforms
copying apache_beam/transforms/ptransform_test.py -> apache-beam-2.9.0.dev0/apache_beam/transforms
copying apache_beam/transforms/py_dataflow_distribution_counter.py -> apache-beam-2.9.0.dev0/apache_beam/transforms
copying apache_beam/transforms/sideinputs.py -> apache-beam-2.9.0.dev0/apache_beam/transforms
copying apache_beam/transforms/sideinputs_test.py -> apache-beam-2.9.0.dev0/apache_beam/transforms
copying apache_beam/transforms/timeutil.py -> apache-beam-2.9.0.dev0/apache_beam/transforms
copying apache_beam/transforms/trigger.py -> apache-beam-2.9.0.dev0/apache_beam/transforms
copying apache_beam/transforms/trigger_test.py -> apache-beam-2.9.0.dev0/apache_beam/transforms
copying apache_beam/transforms/userstate.py -> apache-beam-2.9.0.dev0/apache_beam/transforms
copying apache_beam/transforms/userstate_test.py -> apache-beam-2.9.0.dev0/apache_beam/transforms
copying apache_beam/transforms/util.py -> apache-beam-2.9.0.dev0/apache_beam/transforms
copying apache_beam/transforms/util_test.py -> apache-beam-2.9.0.dev0/apache_beam/transforms
copying apache_beam/transforms/window.py -> apache-beam-2.9.0.dev0/apache_beam/transforms
copying apache_beam/transforms/window_test.py -> apache-beam-2.9.0.dev0/apache_beam/transforms
copying apache_beam/transforms/write_ptransform_test.py -> apache-beam-2.9.0.dev0/apache_beam/transforms
copying apache_beam/typehints/__init__.py -> apache-beam-2.9.0.dev0/apache_beam/typehints
copying apache_beam/typehints/decorators.py -> apache-beam-2.9.0.dev0/apache_beam/typehints
copying apache_beam/typehints/native_type_compatibility.py -> apache-beam-2.9.0.dev0/apache_beam/typehints
copying apache_beam/typehints/native_type_compatibility_test.py -> apache-beam-2.9.0.dev0/apache_beam/typehints
copying apache_beam/typehints/opcodes.py -> apache-beam-2.9.0.dev0/apache_beam/typehints
copying apache_beam/typehints/trivial_inference.py -> apache-beam-2.9.0.dev0/apache_beam/typehints
copying apache_beam/typehints/trivial_inference_test.py -> apache-beam-2.9.0.dev0/apache_beam/typehints
copying apache_beam/typehints/typecheck.py -> apache-beam-2.9.0.dev0/apache_beam/typehints
copying apache_beam/typehints/typed_pipeline_test.py -> apache-beam-2.9.0.dev0/apache_beam/typehints
copying apache_beam/typehints/typehints.py -> apache-beam-2.9.0.dev0/apache_beam/typehints
copying apache_beam/typehints/typehints_test.py -> apache-beam-2.9.0.dev0/apache_beam/typehints
copying apache_beam/utils/__init__.py -> apache-beam-2.9.0.dev0/apache_beam/utils
copying apache_beam/utils/annotations.py -> apache-beam-2.9.0.dev0/apache_beam/utils
copying apache_beam/utils/annotations_test.py -> apache-beam-2.9.0.dev0/apache_beam/utils
copying apache_beam/utils/counters.pxd -> apache-beam-2.9.0.dev0/apache_beam/utils
copying apache_beam/utils/counters.py -> apache-beam-2.9.0.dev0/apache_beam/utils
copying apache_beam/utils/counters_test.py -> apache-beam-2.9.0.dev0/apache_beam/utils
copying apache_beam/utils/plugin.py -> apache-beam-2.9.0.dev0/apache_beam/utils
copying apache_beam/utils/processes.py -> apache-beam-2.9.0.dev0/apache_beam/utils
copying apache_beam/utils/processes_test.py -> apache-beam-2.9.0.dev0/apache_beam/utils
copying apache_beam/utils/profiler.py -> apache-beam-2.9.0.dev0/apache_beam/utils
copying apache_beam/utils/proto_utils.py -> apache-beam-2.9.0.dev0/apache_beam/utils
copying apache_beam/utils/retry.py -> apache-beam-2.9.0.dev0/apache_beam/utils
copying apache_beam/utils/retry_test.py -> apache-beam-2.9.0.dev0/apache_beam/utils
copying apache_beam/utils/timestamp.py -> apache-beam-2.9.0.dev0/apache_beam/utils
copying apache_beam/utils/timestamp_test.py -> apache-beam-2.9.0.dev0/apache_beam/utils
copying apache_beam/utils/urns.py -> apache-beam-2.9.0.dev0/apache_beam/utils
copying apache_beam/utils/windowed_value.pxd -> apache-beam-2.9.0.dev0/apache_beam/utils
copying apache_beam/utils/windowed_value.py -> apache-beam-2.9.0.dev0/apache_beam/utils
copying apache_beam/utils/windowed_value_test.py -> apache-beam-2.9.0.dev0/apache_beam/utils
Writing apache-beam-2.9.0.dev0/setup.cfg
creating dist
Creating tar archive
removing 'apache-beam-2.9.0.dev0' (and everything under it)
SDK_LOCATION=$(find dist/apache-beam-*.tar.gz)
find dist/apache-beam-*.tar.gz

# Run ValidatesRunner tests on Google Cloud Dataflow service
echo ">>> RUNNING DATAFLOW RUNNER VALIDATESCONTAINER TEST"
>>> RUNNING DATAFLOW RUNNER VALIDATESCONTAINER TEST
python setup.py nosetests \
  --attr ValidatesContainer \
  --nologcapture \
  --processes=1 \
  --process-timeout=900 \
  --test-pipeline-options=" \
    --runner=TestDataflowRunner \
    --project=$PROJECT \
    --worker_harness_container_image=$CONTAINER:$TAG \
    --staging_location=$GCS_LOCATION/staging-validatesrunner-test \
    --temp_location=$GCS_LOCATION/temp-validatesrunner-test \
    --output=$GCS_LOCATION/output \
    --sdk_location=$SDK_LOCATION \
    --num_workers=1"
<https://builds.apache.org/job/beam_PostCommit_Py_ValCont/ws/src/sdks/python/container/local/lib/python2.7/site-packages/setuptools/dist.py>:470: UserWarning: Normalizing '2.9.0.dev' to '2.9.0.dev0'
  normalized_version,
running nosetests
running egg_info
<https://builds.apache.org/job/beam_PostCommit_Py_ValCont/ws/src/sdks/python/gen_protos.py>:52: UserWarning: Installing grpcio-tools is recommended for development.
  warnings.warn('Installing grpcio-tools is recommended for development.')
writing requirements to apache_beam.egg-info/requires.txt
writing apache_beam.egg-info/PKG-INFO
writing top-level names to apache_beam.egg-info/top_level.txt
writing dependency_links to apache_beam.egg-info/dependency_links.txt
writing entry points to apache_beam.egg-info/entry_points.txt
reading manifest file 'apache_beam.egg-info/SOURCES.txt'
reading manifest template 'MANIFEST.in'
warning: no files found matching 'README.md'
warning: no files found matching 'NOTICE'
warning: no files found matching 'LICENSE'
writing manifest file 'apache_beam.egg-info/SOURCES.txt'
WARNING:root:python-snappy is not installed; some tests will be skipped.
WARNING:root:Tensorflow is not installed, so skipping some tests.
<https://builds.apache.org/job/beam_PostCommit_Py_ValCont/ws/src/sdks/python/apache_beam/runners/dataflow/dataflow_runner.py>:800: BeamDeprecationWarning: options is deprecated since First stable release. References to <pipeline>.options will not be supported
  options = pbegin.pipeline.options.view_as(DebugOptions)
test_wordcount_fnapi_it (apache_beam.examples.wordcount_it_test.WordCountIT) ... ERROR

======================================================================
ERROR: test_wordcount_fnapi_it (apache_beam.examples.wordcount_it_test.WordCountIT)
----------------------------------------------------------------------
Traceback (most recent call last):
  File "<https://builds.apache.org/job/beam_PostCommit_Py_ValCont/ws/src/sdks/python/container/local/lib/python2.7/site-packages/nose/plugins/multiprocess.py",> line 812, in run
    test(orig)
  File "<https://builds.apache.org/job/beam_PostCommit_Py_ValCont/ws/src/sdks/python/container/local/lib/python2.7/site-packages/nose/case.py",> line 45, in __call__
    return self.run(*arg, **kwarg)
  File "<https://builds.apache.org/job/beam_PostCommit_Py_ValCont/ws/src/sdks/python/container/local/lib/python2.7/site-packages/nose/case.py",> line 133, in run
    self.runTest(result)
  File "<https://builds.apache.org/job/beam_PostCommit_Py_ValCont/ws/src/sdks/python/container/local/lib/python2.7/site-packages/nose/case.py",> line 151, in runTest
    test(result)
  File "/usr/lib/python2.7/unittest/case.py", line 393, in __call__
    return self.run(*args, **kwds)
  File "/usr/lib/python2.7/unittest/case.py", line 329, in run
    testMethod()
  File "<https://builds.apache.org/job/beam_PostCommit_Py_ValCont/ws/src/sdks/python/apache_beam/examples/wordcount_it_test.py",> line 51, in test_wordcount_fnapi_it
    self._run_wordcount_it(experiment='beam_fn_api')
  File "<https://builds.apache.org/job/beam_PostCommit_Py_ValCont/ws/src/sdks/python/apache_beam/examples/wordcount_it_test.py",> line 75, in _run_wordcount_it
    wordcount.run(test_pipeline.get_full_options_as_args(**extra_opts))
  File "<https://builds.apache.org/job/beam_PostCommit_Py_ValCont/ws/src/sdks/python/apache_beam/examples/wordcount.py",> line 115, in run
    result = p.run()
  File "<https://builds.apache.org/job/beam_PostCommit_Py_ValCont/ws/src/sdks/python/apache_beam/pipeline.py",> line 405, in run
    self._options).run(False)
  File "<https://builds.apache.org/job/beam_PostCommit_Py_ValCont/ws/src/sdks/python/apache_beam/pipeline.py",> line 418, in run
    return self.runner.run_pipeline(self)
  File "<https://builds.apache.org/job/beam_PostCommit_Py_ValCont/ws/src/sdks/python/apache_beam/runners/dataflow/test_dataflow_runner.py",> line 70, in run_pipeline
    self.result.cancel()
  File "<https://builds.apache.org/job/beam_PostCommit_Py_ValCont/ws/src/sdks/python/apache_beam/runners/dataflow/dataflow_runner.py",> line 1201, in cancel
    self.job_id(), 'JOB_STATE_CANCELLED'):
  File "<https://builds.apache.org/job/beam_PostCommit_Py_ValCont/ws/src/sdks/python/apache_beam/utils/retry.py",> line 184, in wrapper
    return fun(*args, **kwargs)
  File "<https://builds.apache.org/job/beam_PostCommit_Py_ValCont/ws/src/sdks/python/apache_beam/runners/dataflow/internal/apiclient.py",> line 610, in modify_job_state
    self._client.projects_locations_jobs.Update(request)
  File "<https://builds.apache.org/job/beam_PostCommit_Py_ValCont/ws/src/sdks/python/apache_beam/runners/dataflow/internal/clients/dataflow/dataflow_v1b3_client.py",> line 682, in Update
    config, request, global_params=global_params)
  File "<https://builds.apache.org/job/beam_PostCommit_Py_ValCont/ws/src/sdks/python/container/local/lib/python2.7/site-packages/apitools/base/py/base_api.py",> line 729, in _RunMethod
    http, http_request, **opts)
  File "<https://builds.apache.org/job/beam_PostCommit_Py_ValCont/ws/src/sdks/python/container/local/lib/python2.7/site-packages/apitools/base/py/http_wrapper.py",> line 346, in MakeRequest
    check_response_func=check_response_func)
  File "<https://builds.apache.org/job/beam_PostCommit_Py_ValCont/ws/src/sdks/python/container/local/lib/python2.7/site-packages/apitools/base/py/http_wrapper.py",> line 396, in _MakeRequestNoRetry
    redirections=redirections, connection_type=connection_type)
  File "<https://builds.apache.org/job/beam_PostCommit_Py_ValCont/ws/src/sdks/python/container/local/lib/python2.7/site-packages/oauth2client/transport.py",> line 175, in new_request
    redirections, connection_type)
  File "<https://builds.apache.org/job/beam_PostCommit_Py_ValCont/ws/src/sdks/python/container/local/lib/python2.7/site-packages/oauth2client/transport.py",> line 282, in request
    connection_type=connection_type)
  File "<https://builds.apache.org/job/beam_PostCommit_Py_ValCont/ws/src/sdks/python/container/local/lib/python2.7/site-packages/oauth2client/transport.py",> line 175, in new_request
    redirections, connection_type)
  File "<https://builds.apache.org/job/beam_PostCommit_Py_ValCont/ws/src/sdks/python/container/local/lib/python2.7/site-packages/oauth2client/transport.py",> line 282, in request
    connection_type=connection_type)
  File "<https://builds.apache.org/job/beam_PostCommit_Py_ValCont/ws/src/sdks/python/container/local/lib/python2.7/site-packages/httplib2/__init__.py",> line 1694, in request
    (response, content) = self._request(conn, authority, uri, request_uri, method, body, headers, redirections, cachekey)
  File "<https://builds.apache.org/job/beam_PostCommit_Py_ValCont/ws/src/sdks/python/container/local/lib/python2.7/site-packages/httplib2/__init__.py",> line 1434, in _request
    (response, content) = self._conn_request(conn, request_uri, method, body, headers)
  File "<https://builds.apache.org/job/beam_PostCommit_Py_ValCont/ws/src/sdks/python/container/local/lib/python2.7/site-packages/httplib2/__init__.py",> line 1390, in _conn_request
    response = conn.getresponse()
  File "/usr/lib/python2.7/httplib.py", line 1136, in getresponse
    response.begin()
  File "/usr/lib/python2.7/httplib.py", line 485, in begin
    self.msg = HTTPMessage(self.fp, 0)
  File "/usr/lib/python2.7/mimetools.py", line 25, in __init__
    rfc822.Message.__init__(self, fp, seekable)
  File "/usr/lib/python2.7/rfc822.py", line 108, in __init__
    self.readheaders()
  File "/usr/lib/python2.7/httplib.py", line 319, in readheaders
    line = self.fp.readline(_MAXLINE + 1)
  File "/usr/lib/python2.7/socket.py", line 480, in readline
    data = self._sock.recv(self._rbufsize)
  File "/usr/lib/python2.7/ssl.py", line 756, in recv
    return self.read(buflen)
  File "/usr/lib/python2.7/ssl.py", line 636, in read
    self._checkClosed()
  File "/usr/lib/python2.7/ssl.py", line 620, in _checkClosed
    def _checkClosed(self, msg=None):
  File "<https://builds.apache.org/job/beam_PostCommit_Py_ValCont/ws/src/sdks/python/container/local/lib/python2.7/site-packages/nose/plugins/multiprocess.py",> line 276, in signalhandler
    raise TimedOutException()
TimedOutException: 'test_wordcount_fnapi_it (apache_beam.examples.wordcount_it_test.WordCountIT)'

----------------------------------------------------------------------
XML: <https://builds.apache.org/job/beam_PostCommit_Py_ValCont/ws/src/sdks/python/nosetests.xml>
----------------------------------------------------------------------
Ran 1 test in 902.457s

FAILED (errors=1)
cleanup_container
Untagged: us.gcr.io/apache-beam-testing/jenkins/python:20181116-002951
Untagged: us.gcr.io/apache-beam-testing/jenkins/python@sha256:7de7136cabe8bde668b6027781ed1aa93c6250378f12ff2aa16c0bd4982d9abc
Deleted: sha256:ea225f7a0c8d2b10ddb3b84861bd70f51660ff6d3216d399e5d568093676bb08
Deleted: sha256:920b71ae61bf393c51bf4ae1f4072c819414967efaee64bddf0533c9a05df643
Deleted: sha256:ad0e0d03fd5039fc0c35ce247f4e0147ae17c34a0d82c2c95bc2f60fb6c12476
Deleted: sha256:e971fd37a6cb67de6dda7fa9817db89ae01f0d9f5aff483064ae145d3ffd4a1d
Deleted: sha256:908264d50dbedc1291e2d89bcda8a5e85b8e308d7f34b2f33787d7edbbbc7955
Deleted: sha256:914290f6123a16e9f4ed02a2358b4b5a420ea2056249cf0ba1b63fdfe62adaf9
Deleted: sha256:6c0b8a9f6a56aaf5dea88b8643ba95eb057977700ae92c07c79717f732b1ab73
Deleted: sha256:47596165209c49eaec65e110c3cf618f02e26ee579b5567c9964bd78a542907c
Deleted: sha256:d399513a9da2eb0b8f0ee21951874cfb1d7b7a543708378fa233bd6c9a33877d
Deleted: sha256:291b8434364f69e589fe24577851194527846fa60ec319315a2249a8e382588e
Deleted: sha256:114bc2eb7fb5fcaffcf4eae3b977eb22dd3a8744623714bd7ea6afc9a544e78a
Deleted: sha256:2ec063da2211de2785ccad9f385841f32471834b82cf55c8f0a3db01720f11be
Deleted: sha256:af5312b9a7377b18e1498bc30c3e84596436f14d02b2ccbb64cf7958f2ad49b1
Deleted: sha256:5a6e57f2184bfce1839ac99480765bdcc3f63d3d7cad89975286b156714d499d
Digests:
- us.gcr.io/apache-beam-testing/jenkins/python@sha256:7de7136cabe8bde668b6027781ed1aa93c6250378f12ff2aa16c0bd4982d9abc
  Associated tags:
 - 20181116-002951
Tags:
- us.gcr.io/apache-beam-testing/jenkins/python:20181116-002951
Deleted [us.gcr.io/apache-beam-testing/jenkins/python:20181116-002951].
Deleted [us.gcr.io/apache-beam-testing/jenkins/python@sha256:7de7136cabe8bde668b6027781ed1aa93c6250378f12ff2aa16c0bd4982d9abc].
Removed the container
Build step 'Execute shell' marked build as failure

---------------------------------------------------------------------
To unsubscribe, e-mail: builds-unsubscribe@beam.apache.org
For additional commands, e-mail: builds-help@beam.apache.org


Build failed in Jenkins: beam_PostCommit_Py_ValCont #1433

Posted by Apache Jenkins Server <je...@builds.apache.org>.
See <https://builds.apache.org/job/beam_PostCommit_Py_ValCont/1433/display/redirect>

------------------------------------------
[...truncated 172.53 KB...]
copying apache_beam/runners/worker/worker_id_interceptor_test.py -> apache-beam-2.9.0.dev0/apache_beam/runners/worker
copying apache_beam/testing/__init__.py -> apache-beam-2.9.0.dev0/apache_beam/testing
copying apache_beam/testing/pipeline_verifiers.py -> apache-beam-2.9.0.dev0/apache_beam/testing
copying apache_beam/testing/pipeline_verifiers_test.py -> apache-beam-2.9.0.dev0/apache_beam/testing
copying apache_beam/testing/synthetic_pipeline.py -> apache-beam-2.9.0.dev0/apache_beam/testing
copying apache_beam/testing/synthetic_pipeline_test.py -> apache-beam-2.9.0.dev0/apache_beam/testing
copying apache_beam/testing/test_pipeline.py -> apache-beam-2.9.0.dev0/apache_beam/testing
copying apache_beam/testing/test_pipeline_test.py -> apache-beam-2.9.0.dev0/apache_beam/testing
copying apache_beam/testing/test_stream.py -> apache-beam-2.9.0.dev0/apache_beam/testing
copying apache_beam/testing/test_stream_test.py -> apache-beam-2.9.0.dev0/apache_beam/testing
copying apache_beam/testing/test_utils.py -> apache-beam-2.9.0.dev0/apache_beam/testing
copying apache_beam/testing/test_utils_test.py -> apache-beam-2.9.0.dev0/apache_beam/testing
copying apache_beam/testing/util.py -> apache-beam-2.9.0.dev0/apache_beam/testing
copying apache_beam/testing/util_test.py -> apache-beam-2.9.0.dev0/apache_beam/testing
copying apache_beam/testing/benchmarks/__init__.py -> apache-beam-2.9.0.dev0/apache_beam/testing/benchmarks
copying apache_beam/testing/benchmarks/nexmark/__init__.py -> apache-beam-2.9.0.dev0/apache_beam/testing/benchmarks/nexmark
copying apache_beam/testing/benchmarks/nexmark/nexmark_launcher.py -> apache-beam-2.9.0.dev0/apache_beam/testing/benchmarks/nexmark
copying apache_beam/testing/benchmarks/nexmark/nexmark_util.py -> apache-beam-2.9.0.dev0/apache_beam/testing/benchmarks/nexmark
copying apache_beam/testing/benchmarks/nexmark/models/__init__.py -> apache-beam-2.9.0.dev0/apache_beam/testing/benchmarks/nexmark/models
copying apache_beam/testing/benchmarks/nexmark/models/nexmark_model.py -> apache-beam-2.9.0.dev0/apache_beam/testing/benchmarks/nexmark/models
copying apache_beam/testing/benchmarks/nexmark/queries/__init__.py -> apache-beam-2.9.0.dev0/apache_beam/testing/benchmarks/nexmark/queries
copying apache_beam/testing/benchmarks/nexmark/queries/query0.py -> apache-beam-2.9.0.dev0/apache_beam/testing/benchmarks/nexmark/queries
copying apache_beam/testing/benchmarks/nexmark/queries/query1.py -> apache-beam-2.9.0.dev0/apache_beam/testing/benchmarks/nexmark/queries
copying apache_beam/testing/benchmarks/nexmark/queries/query2.py -> apache-beam-2.9.0.dev0/apache_beam/testing/benchmarks/nexmark/queries
copying apache_beam/testing/data/standard_coders.yaml -> apache-beam-2.9.0.dev0/apache_beam/testing/data
copying apache_beam/testing/data/trigger_transcripts.yaml -> apache-beam-2.9.0.dev0/apache_beam/testing/data
copying apache_beam/testing/load_tests/__init__.py -> apache-beam-2.9.0.dev0/apache_beam/testing/load_tests
copying apache_beam/testing/load_tests/co_group_by_key_test.py -> apache-beam-2.9.0.dev0/apache_beam/testing/load_tests
copying apache_beam/testing/load_tests/combine_test.py -> apache-beam-2.9.0.dev0/apache_beam/testing/load_tests
copying apache_beam/testing/load_tests/group_by_key_test.py -> apache-beam-2.9.0.dev0/apache_beam/testing/load_tests
copying apache_beam/testing/load_tests/load_test_metrics_utils.py -> apache-beam-2.9.0.dev0/apache_beam/testing/load_tests
copying apache_beam/testing/load_tests/pardo_test.py -> apache-beam-2.9.0.dev0/apache_beam/testing/load_tests
copying apache_beam/tools/__init__.py -> apache-beam-2.9.0.dev0/apache_beam/tools
copying apache_beam/tools/coders_microbenchmark.py -> apache-beam-2.9.0.dev0/apache_beam/tools
copying apache_beam/tools/distribution_counter_microbenchmark.py -> apache-beam-2.9.0.dev0/apache_beam/tools
copying apache_beam/tools/map_fn_microbenchmark.py -> apache-beam-2.9.0.dev0/apache_beam/tools
copying apache_beam/tools/microbenchmarks_test.py -> apache-beam-2.9.0.dev0/apache_beam/tools
copying apache_beam/tools/sideinput_microbenchmark.py -> apache-beam-2.9.0.dev0/apache_beam/tools
copying apache_beam/tools/utils.py -> apache-beam-2.9.0.dev0/apache_beam/tools
copying apache_beam/transforms/__init__.py -> apache-beam-2.9.0.dev0/apache_beam/transforms
copying apache_beam/transforms/combiners.py -> apache-beam-2.9.0.dev0/apache_beam/transforms
copying apache_beam/transforms/combiners_test.py -> apache-beam-2.9.0.dev0/apache_beam/transforms
copying apache_beam/transforms/core.py -> apache-beam-2.9.0.dev0/apache_beam/transforms
copying apache_beam/transforms/create_source.py -> apache-beam-2.9.0.dev0/apache_beam/transforms
copying apache_beam/transforms/create_test.py -> apache-beam-2.9.0.dev0/apache_beam/transforms
copying apache_beam/transforms/cy_combiners.pxd -> apache-beam-2.9.0.dev0/apache_beam/transforms
copying apache_beam/transforms/cy_combiners.py -> apache-beam-2.9.0.dev0/apache_beam/transforms
copying apache_beam/transforms/cy_dataflow_distribution_counter.pxd -> apache-beam-2.9.0.dev0/apache_beam/transforms
copying apache_beam/transforms/cy_dataflow_distribution_counter.pyx -> apache-beam-2.9.0.dev0/apache_beam/transforms
copying apache_beam/transforms/dataflow_distribution_counter_test.py -> apache-beam-2.9.0.dev0/apache_beam/transforms
copying apache_beam/transforms/display.py -> apache-beam-2.9.0.dev0/apache_beam/transforms
copying apache_beam/transforms/display_test.py -> apache-beam-2.9.0.dev0/apache_beam/transforms
copying apache_beam/transforms/ptransform.py -> apache-beam-2.9.0.dev0/apache_beam/transforms
copying apache_beam/transforms/ptransform_test.py -> apache-beam-2.9.0.dev0/apache_beam/transforms
copying apache_beam/transforms/py_dataflow_distribution_counter.py -> apache-beam-2.9.0.dev0/apache_beam/transforms
copying apache_beam/transforms/sideinputs.py -> apache-beam-2.9.0.dev0/apache_beam/transforms
copying apache_beam/transforms/sideinputs_test.py -> apache-beam-2.9.0.dev0/apache_beam/transforms
copying apache_beam/transforms/timeutil.py -> apache-beam-2.9.0.dev0/apache_beam/transforms
copying apache_beam/transforms/trigger.py -> apache-beam-2.9.0.dev0/apache_beam/transforms
copying apache_beam/transforms/trigger_test.py -> apache-beam-2.9.0.dev0/apache_beam/transforms
copying apache_beam/transforms/userstate.py -> apache-beam-2.9.0.dev0/apache_beam/transforms
copying apache_beam/transforms/userstate_test.py -> apache-beam-2.9.0.dev0/apache_beam/transforms
copying apache_beam/transforms/util.py -> apache-beam-2.9.0.dev0/apache_beam/transforms
copying apache_beam/transforms/util_test.py -> apache-beam-2.9.0.dev0/apache_beam/transforms
copying apache_beam/transforms/window.py -> apache-beam-2.9.0.dev0/apache_beam/transforms
copying apache_beam/transforms/window_test.py -> apache-beam-2.9.0.dev0/apache_beam/transforms
copying apache_beam/transforms/write_ptransform_test.py -> apache-beam-2.9.0.dev0/apache_beam/transforms
copying apache_beam/typehints/__init__.py -> apache-beam-2.9.0.dev0/apache_beam/typehints
copying apache_beam/typehints/decorators.py -> apache-beam-2.9.0.dev0/apache_beam/typehints
copying apache_beam/typehints/native_type_compatibility.py -> apache-beam-2.9.0.dev0/apache_beam/typehints
copying apache_beam/typehints/native_type_compatibility_test.py -> apache-beam-2.9.0.dev0/apache_beam/typehints
copying apache_beam/typehints/opcodes.py -> apache-beam-2.9.0.dev0/apache_beam/typehints
copying apache_beam/typehints/trivial_inference.py -> apache-beam-2.9.0.dev0/apache_beam/typehints
copying apache_beam/typehints/trivial_inference_test.py -> apache-beam-2.9.0.dev0/apache_beam/typehints
copying apache_beam/typehints/typecheck.py -> apache-beam-2.9.0.dev0/apache_beam/typehints
copying apache_beam/typehints/typed_pipeline_test.py -> apache-beam-2.9.0.dev0/apache_beam/typehints
copying apache_beam/typehints/typehints.py -> apache-beam-2.9.0.dev0/apache_beam/typehints
copying apache_beam/typehints/typehints_test.py -> apache-beam-2.9.0.dev0/apache_beam/typehints
copying apache_beam/utils/__init__.py -> apache-beam-2.9.0.dev0/apache_beam/utils
copying apache_beam/utils/annotations.py -> apache-beam-2.9.0.dev0/apache_beam/utils
copying apache_beam/utils/annotations_test.py -> apache-beam-2.9.0.dev0/apache_beam/utils
copying apache_beam/utils/counters.pxd -> apache-beam-2.9.0.dev0/apache_beam/utils
copying apache_beam/utils/counters.py -> apache-beam-2.9.0.dev0/apache_beam/utils
copying apache_beam/utils/counters_test.py -> apache-beam-2.9.0.dev0/apache_beam/utils
copying apache_beam/utils/plugin.py -> apache-beam-2.9.0.dev0/apache_beam/utils
copying apache_beam/utils/processes.py -> apache-beam-2.9.0.dev0/apache_beam/utils
copying apache_beam/utils/processes_test.py -> apache-beam-2.9.0.dev0/apache_beam/utils
copying apache_beam/utils/profiler.py -> apache-beam-2.9.0.dev0/apache_beam/utils
copying apache_beam/utils/proto_utils.py -> apache-beam-2.9.0.dev0/apache_beam/utils
copying apache_beam/utils/retry.py -> apache-beam-2.9.0.dev0/apache_beam/utils
copying apache_beam/utils/retry_test.py -> apache-beam-2.9.0.dev0/apache_beam/utils
copying apache_beam/utils/timestamp.py -> apache-beam-2.9.0.dev0/apache_beam/utils
copying apache_beam/utils/timestamp_test.py -> apache-beam-2.9.0.dev0/apache_beam/utils
copying apache_beam/utils/urns.py -> apache-beam-2.9.0.dev0/apache_beam/utils
copying apache_beam/utils/windowed_value.pxd -> apache-beam-2.9.0.dev0/apache_beam/utils
copying apache_beam/utils/windowed_value.py -> apache-beam-2.9.0.dev0/apache_beam/utils
copying apache_beam/utils/windowed_value_test.py -> apache-beam-2.9.0.dev0/apache_beam/utils
Writing apache-beam-2.9.0.dev0/setup.cfg
creating dist
Creating tar archive
removing 'apache-beam-2.9.0.dev0' (and everything under it)
SDK_LOCATION=$(find dist/apache-beam-*.tar.gz)
find dist/apache-beam-*.tar.gz

# Run ValidatesRunner tests on Google Cloud Dataflow service
echo ">>> RUNNING DATAFLOW RUNNER VALIDATESCONTAINER TEST"
>>> RUNNING DATAFLOW RUNNER VALIDATESCONTAINER TEST
python setup.py nosetests \
  --attr ValidatesContainer \
  --nologcapture \
  --processes=1 \
  --process-timeout=900 \
  --test-pipeline-options=" \
    --runner=TestDataflowRunner \
    --project=$PROJECT \
    --worker_harness_container_image=$CONTAINER:$TAG \
    --staging_location=$GCS_LOCATION/staging-validatesrunner-test \
    --temp_location=$GCS_LOCATION/temp-validatesrunner-test \
    --output=$GCS_LOCATION/output \
    --sdk_location=$SDK_LOCATION \
    --num_workers=1"
<https://builds.apache.org/job/beam_PostCommit_Py_ValCont/ws/src/sdks/python/container/local/lib/python2.7/site-packages/setuptools/dist.py>:470: UserWarning: Normalizing '2.9.0.dev' to '2.9.0.dev0'
  normalized_version,
running nosetests
running egg_info
<https://builds.apache.org/job/beam_PostCommit_Py_ValCont/ws/src/sdks/python/gen_protos.py>:52: UserWarning: Installing grpcio-tools is recommended for development.
  warnings.warn('Installing grpcio-tools is recommended for development.')
writing requirements to apache_beam.egg-info/requires.txt
writing apache_beam.egg-info/PKG-INFO
writing top-level names to apache_beam.egg-info/top_level.txt
writing dependency_links to apache_beam.egg-info/dependency_links.txt
writing entry points to apache_beam.egg-info/entry_points.txt
reading manifest file 'apache_beam.egg-info/SOURCES.txt'
reading manifest template 'MANIFEST.in'
warning: no files found matching 'README.md'
warning: no files found matching 'NOTICE'
warning: no files found matching 'LICENSE'
writing manifest file 'apache_beam.egg-info/SOURCES.txt'
WARNING:root:python-snappy is not installed; some tests will be skipped.
WARNING:root:Tensorflow is not installed, so skipping some tests.
<https://builds.apache.org/job/beam_PostCommit_Py_ValCont/ws/src/sdks/python/apache_beam/runners/dataflow/dataflow_runner.py>:800: BeamDeprecationWarning: options is deprecated since First stable release. References to <pipeline>.options will not be supported
  options = pbegin.pipeline.options.view_as(DebugOptions)
test_wordcount_fnapi_it (apache_beam.examples.wordcount_it_test.WordCountIT) ... ERROR

======================================================================
ERROR: test_wordcount_fnapi_it (apache_beam.examples.wordcount_it_test.WordCountIT)
----------------------------------------------------------------------
Traceback (most recent call last):
  File "<https://builds.apache.org/job/beam_PostCommit_Py_ValCont/ws/src/sdks/python/container/local/lib/python2.7/site-packages/nose/plugins/multiprocess.py",> line 812, in run
    test(orig)
  File "<https://builds.apache.org/job/beam_PostCommit_Py_ValCont/ws/src/sdks/python/container/local/lib/python2.7/site-packages/nose/case.py",> line 45, in __call__
    return self.run(*arg, **kwarg)
  File "<https://builds.apache.org/job/beam_PostCommit_Py_ValCont/ws/src/sdks/python/container/local/lib/python2.7/site-packages/nose/case.py",> line 133, in run
    self.runTest(result)
  File "<https://builds.apache.org/job/beam_PostCommit_Py_ValCont/ws/src/sdks/python/container/local/lib/python2.7/site-packages/nose/case.py",> line 151, in runTest
    test(result)
  File "/usr/lib/python2.7/unittest/case.py", line 393, in __call__
    return self.run(*args, **kwds)
  File "/usr/lib/python2.7/unittest/case.py", line 329, in run
    testMethod()
  File "<https://builds.apache.org/job/beam_PostCommit_Py_ValCont/ws/src/sdks/python/apache_beam/examples/wordcount_it_test.py",> line 51, in test_wordcount_fnapi_it
    self._run_wordcount_it(experiment='beam_fn_api')
  File "<https://builds.apache.org/job/beam_PostCommit_Py_ValCont/ws/src/sdks/python/apache_beam/examples/wordcount_it_test.py",> line 75, in _run_wordcount_it
    wordcount.run(test_pipeline.get_full_options_as_args(**extra_opts))
  File "<https://builds.apache.org/job/beam_PostCommit_Py_ValCont/ws/src/sdks/python/apache_beam/examples/wordcount.py",> line 115, in run
    result = p.run()
  File "<https://builds.apache.org/job/beam_PostCommit_Py_ValCont/ws/src/sdks/python/apache_beam/pipeline.py",> line 405, in run
    self._options).run(False)
  File "<https://builds.apache.org/job/beam_PostCommit_Py_ValCont/ws/src/sdks/python/apache_beam/pipeline.py",> line 418, in run
    return self.runner.run_pipeline(self)
  File "<https://builds.apache.org/job/beam_PostCommit_Py_ValCont/ws/src/sdks/python/apache_beam/runners/dataflow/test_dataflow_runner.py",> line 70, in run_pipeline
    self.result.cancel()
  File "<https://builds.apache.org/job/beam_PostCommit_Py_ValCont/ws/src/sdks/python/apache_beam/runners/dataflow/dataflow_runner.py",> line 1201, in cancel
    self.job_id(), 'JOB_STATE_CANCELLED'):
  File "<https://builds.apache.org/job/beam_PostCommit_Py_ValCont/ws/src/sdks/python/apache_beam/utils/retry.py",> line 184, in wrapper
    return fun(*args, **kwargs)
  File "<https://builds.apache.org/job/beam_PostCommit_Py_ValCont/ws/src/sdks/python/apache_beam/runners/dataflow/internal/apiclient.py",> line 610, in modify_job_state
    self._client.projects_locations_jobs.Update(request)
  File "<https://builds.apache.org/job/beam_PostCommit_Py_ValCont/ws/src/sdks/python/apache_beam/runners/dataflow/internal/clients/dataflow/dataflow_v1b3_client.py",> line 682, in Update
    config, request, global_params=global_params)
  File "<https://builds.apache.org/job/beam_PostCommit_Py_ValCont/ws/src/sdks/python/container/local/lib/python2.7/site-packages/apitools/base/py/base_api.py",> line 729, in _RunMethod
    http, http_request, **opts)
  File "<https://builds.apache.org/job/beam_PostCommit_Py_ValCont/ws/src/sdks/python/container/local/lib/python2.7/site-packages/apitools/base/py/http_wrapper.py",> line 346, in MakeRequest
    check_response_func=check_response_func)
  File "<https://builds.apache.org/job/beam_PostCommit_Py_ValCont/ws/src/sdks/python/container/local/lib/python2.7/site-packages/apitools/base/py/http_wrapper.py",> line 396, in _MakeRequestNoRetry
    redirections=redirections, connection_type=connection_type)
  File "<https://builds.apache.org/job/beam_PostCommit_Py_ValCont/ws/src/sdks/python/container/local/lib/python2.7/site-packages/oauth2client/transport.py",> line 175, in new_request
    redirections, connection_type)
  File "<https://builds.apache.org/job/beam_PostCommit_Py_ValCont/ws/src/sdks/python/container/local/lib/python2.7/site-packages/oauth2client/transport.py",> line 282, in request
    connection_type=connection_type)
  File "<https://builds.apache.org/job/beam_PostCommit_Py_ValCont/ws/src/sdks/python/container/local/lib/python2.7/site-packages/oauth2client/transport.py",> line 175, in new_request
    redirections, connection_type)
  File "<https://builds.apache.org/job/beam_PostCommit_Py_ValCont/ws/src/sdks/python/container/local/lib/python2.7/site-packages/oauth2client/transport.py",> line 282, in request
    connection_type=connection_type)
  File "<https://builds.apache.org/job/beam_PostCommit_Py_ValCont/ws/src/sdks/python/container/local/lib/python2.7/site-packages/httplib2/__init__.py",> line 1694, in request
    (response, content) = self._request(conn, authority, uri, request_uri, method, body, headers, redirections, cachekey)
  File "<https://builds.apache.org/job/beam_PostCommit_Py_ValCont/ws/src/sdks/python/container/local/lib/python2.7/site-packages/httplib2/__init__.py",> line 1434, in _request
    (response, content) = self._conn_request(conn, request_uri, method, body, headers)
  File "<https://builds.apache.org/job/beam_PostCommit_Py_ValCont/ws/src/sdks/python/container/local/lib/python2.7/site-packages/httplib2/__init__.py",> line 1390, in _conn_request
    response = conn.getresponse()
  File "/usr/lib/python2.7/httplib.py", line 1136, in getresponse
    response.begin()
  File "/usr/lib/python2.7/httplib.py", line 453, in begin
    version, status, reason = self._read_status()
  File "/usr/lib/python2.7/httplib.py", line 409, in _read_status
    line = self.fp.readline(_MAXLINE + 1)
  File "/usr/lib/python2.7/socket.py", line 480, in readline
    data = self._sock.recv(self._rbufsize)
  File "/usr/lib/python2.7/ssl.py", line 756, in recv
    return self.read(buflen)
  File "/usr/lib/python2.7/ssl.py", line 643, in read
    v = self._sslobj.read(len)
  File "<https://builds.apache.org/job/beam_PostCommit_Py_ValCont/ws/src/sdks/python/container/local/lib/python2.7/site-packages/nose/plugins/multiprocess.py",> line 276, in signalhandler
    raise TimedOutException()
TimedOutException: 'test_wordcount_fnapi_it (apache_beam.examples.wordcount_it_test.WordCountIT)'

----------------------------------------------------------------------
XML: <https://builds.apache.org/job/beam_PostCommit_Py_ValCont/ws/src/sdks/python/nosetests.xml>
----------------------------------------------------------------------
Ran 1 test in 902.256s

FAILED (errors=1)
cleanup_container
Untagged: us.gcr.io/apache-beam-testing/jenkins/python:20181116-000008
Untagged: us.gcr.io/apache-beam-testing/jenkins/python@sha256:533f76fbee51c22461b297ab54cba8fcf4d481d5c827cfb3f3d43dca64ce08e6
Deleted: sha256:dffd00533209acb9771906bd6d5d96377348ff9072af5198a91a588d02164e4e
Deleted: sha256:e5074c74edbb419949ec756de71ebba3c29da4214bb3c9dae24b8f834b004b9d
Deleted: sha256:ff59b3ac83766be1712b41ec060e36bbb3dffb8b905252a77ecb646de3c0899c
Deleted: sha256:4681b978f84f7518c64dab22f264b858df180f3787c93df33cf8c9ff4fbea647
Deleted: sha256:05dc7df386c527757d487318e53a4d822c877792e68541a8fc5137f0801d19e4
Deleted: sha256:b09310ac59d308fa0d047f8dfdda5d2e0b57d893ebd6977b4321ef6e69781002
Deleted: sha256:401b767b211b02cfd0b4b4b594b2459597bbbcbbd33e51bede754cb445fe4cd4
Deleted: sha256:4873b6b02894dc41aebb3e7e1c53c6727fcad35e661cea6c75cb38604fcda3b1
Deleted: sha256:68938d61729427be3ea1f1b7db104e73e66364ce114c5434586eadc5dba0224d
Deleted: sha256:3c2a26a7d07435cdbb129eb63a0cc4c93a11969a649e6ff49a8b11f55ec311a5
Deleted: sha256:8f0ae14b0ae1cd844e6d73c73d10f5445a75f71eaf6ae19d3dc4e72ce5135b93
Deleted: sha256:e8754cedb08ca413c277ce7b1c27055aef9d61e2ade70041c73e9e1adff7032f
Deleted: sha256:5e9ba020663078a9aa982dea89f5e3c59334863e566d68e6fe4b6f2a73cbaadf
Deleted: sha256:33f7edd143ee055d42ae3cfd1f0529be964e6992635af70b58e899601a013eec
Digests:
- us.gcr.io/apache-beam-testing/jenkins/python@sha256:533f76fbee51c22461b297ab54cba8fcf4d481d5c827cfb3f3d43dca64ce08e6
  Associated tags:
 - 20181116-000008
Tags:
- us.gcr.io/apache-beam-testing/jenkins/python:20181116-000008
Deleted [us.gcr.io/apache-beam-testing/jenkins/python:20181116-000008].
Deleted [us.gcr.io/apache-beam-testing/jenkins/python@sha256:533f76fbee51c22461b297ab54cba8fcf4d481d5c827cfb3f3d43dca64ce08e6].
Removed the container
Build step 'Execute shell' marked build as failure

---------------------------------------------------------------------
To unsubscribe, e-mail: builds-unsubscribe@beam.apache.org
For additional commands, e-mail: builds-help@beam.apache.org


Build failed in Jenkins: beam_PostCommit_Py_ValCont #1432

Posted by Apache Jenkins Server <je...@builds.apache.org>.
See <https://builds.apache.org/job/beam_PostCommit_Py_ValCont/1432/display/redirect?page=changes>

Changes:

[aaltay] [BEAM-5939] Dedupe runner constants (#6976)

------------------------------------------
[...truncated 172.54 KB...]
copying apache_beam/runners/worker/worker_id_interceptor_test.py -> apache-beam-2.9.0.dev0/apache_beam/runners/worker
copying apache_beam/testing/__init__.py -> apache-beam-2.9.0.dev0/apache_beam/testing
copying apache_beam/testing/pipeline_verifiers.py -> apache-beam-2.9.0.dev0/apache_beam/testing
copying apache_beam/testing/pipeline_verifiers_test.py -> apache-beam-2.9.0.dev0/apache_beam/testing
copying apache_beam/testing/synthetic_pipeline.py -> apache-beam-2.9.0.dev0/apache_beam/testing
copying apache_beam/testing/synthetic_pipeline_test.py -> apache-beam-2.9.0.dev0/apache_beam/testing
copying apache_beam/testing/test_pipeline.py -> apache-beam-2.9.0.dev0/apache_beam/testing
copying apache_beam/testing/test_pipeline_test.py -> apache-beam-2.9.0.dev0/apache_beam/testing
copying apache_beam/testing/test_stream.py -> apache-beam-2.9.0.dev0/apache_beam/testing
copying apache_beam/testing/test_stream_test.py -> apache-beam-2.9.0.dev0/apache_beam/testing
copying apache_beam/testing/test_utils.py -> apache-beam-2.9.0.dev0/apache_beam/testing
copying apache_beam/testing/test_utils_test.py -> apache-beam-2.9.0.dev0/apache_beam/testing
copying apache_beam/testing/util.py -> apache-beam-2.9.0.dev0/apache_beam/testing
copying apache_beam/testing/util_test.py -> apache-beam-2.9.0.dev0/apache_beam/testing
copying apache_beam/testing/benchmarks/__init__.py -> apache-beam-2.9.0.dev0/apache_beam/testing/benchmarks
copying apache_beam/testing/benchmarks/nexmark/__init__.py -> apache-beam-2.9.0.dev0/apache_beam/testing/benchmarks/nexmark
copying apache_beam/testing/benchmarks/nexmark/nexmark_launcher.py -> apache-beam-2.9.0.dev0/apache_beam/testing/benchmarks/nexmark
copying apache_beam/testing/benchmarks/nexmark/nexmark_util.py -> apache-beam-2.9.0.dev0/apache_beam/testing/benchmarks/nexmark
copying apache_beam/testing/benchmarks/nexmark/models/__init__.py -> apache-beam-2.9.0.dev0/apache_beam/testing/benchmarks/nexmark/models
copying apache_beam/testing/benchmarks/nexmark/models/nexmark_model.py -> apache-beam-2.9.0.dev0/apache_beam/testing/benchmarks/nexmark/models
copying apache_beam/testing/benchmarks/nexmark/queries/__init__.py -> apache-beam-2.9.0.dev0/apache_beam/testing/benchmarks/nexmark/queries
copying apache_beam/testing/benchmarks/nexmark/queries/query0.py -> apache-beam-2.9.0.dev0/apache_beam/testing/benchmarks/nexmark/queries
copying apache_beam/testing/benchmarks/nexmark/queries/query1.py -> apache-beam-2.9.0.dev0/apache_beam/testing/benchmarks/nexmark/queries
copying apache_beam/testing/benchmarks/nexmark/queries/query2.py -> apache-beam-2.9.0.dev0/apache_beam/testing/benchmarks/nexmark/queries
copying apache_beam/testing/data/standard_coders.yaml -> apache-beam-2.9.0.dev0/apache_beam/testing/data
copying apache_beam/testing/data/trigger_transcripts.yaml -> apache-beam-2.9.0.dev0/apache_beam/testing/data
copying apache_beam/testing/load_tests/__init__.py -> apache-beam-2.9.0.dev0/apache_beam/testing/load_tests
copying apache_beam/testing/load_tests/co_group_by_key_test.py -> apache-beam-2.9.0.dev0/apache_beam/testing/load_tests
copying apache_beam/testing/load_tests/combine_test.py -> apache-beam-2.9.0.dev0/apache_beam/testing/load_tests
copying apache_beam/testing/load_tests/group_by_key_test.py -> apache-beam-2.9.0.dev0/apache_beam/testing/load_tests
copying apache_beam/testing/load_tests/load_test_metrics_utils.py -> apache-beam-2.9.0.dev0/apache_beam/testing/load_tests
copying apache_beam/testing/load_tests/pardo_test.py -> apache-beam-2.9.0.dev0/apache_beam/testing/load_tests
copying apache_beam/tools/__init__.py -> apache-beam-2.9.0.dev0/apache_beam/tools
copying apache_beam/tools/coders_microbenchmark.py -> apache-beam-2.9.0.dev0/apache_beam/tools
copying apache_beam/tools/distribution_counter_microbenchmark.py -> apache-beam-2.9.0.dev0/apache_beam/tools
copying apache_beam/tools/map_fn_microbenchmark.py -> apache-beam-2.9.0.dev0/apache_beam/tools
copying apache_beam/tools/microbenchmarks_test.py -> apache-beam-2.9.0.dev0/apache_beam/tools
copying apache_beam/tools/sideinput_microbenchmark.py -> apache-beam-2.9.0.dev0/apache_beam/tools
copying apache_beam/tools/utils.py -> apache-beam-2.9.0.dev0/apache_beam/tools
copying apache_beam/transforms/__init__.py -> apache-beam-2.9.0.dev0/apache_beam/transforms
copying apache_beam/transforms/combiners.py -> apache-beam-2.9.0.dev0/apache_beam/transforms
copying apache_beam/transforms/combiners_test.py -> apache-beam-2.9.0.dev0/apache_beam/transforms
copying apache_beam/transforms/core.py -> apache-beam-2.9.0.dev0/apache_beam/transforms
copying apache_beam/transforms/create_source.py -> apache-beam-2.9.0.dev0/apache_beam/transforms
copying apache_beam/transforms/create_test.py -> apache-beam-2.9.0.dev0/apache_beam/transforms
copying apache_beam/transforms/cy_combiners.pxd -> apache-beam-2.9.0.dev0/apache_beam/transforms
copying apache_beam/transforms/cy_combiners.py -> apache-beam-2.9.0.dev0/apache_beam/transforms
copying apache_beam/transforms/cy_dataflow_distribution_counter.pxd -> apache-beam-2.9.0.dev0/apache_beam/transforms
copying apache_beam/transforms/cy_dataflow_distribution_counter.pyx -> apache-beam-2.9.0.dev0/apache_beam/transforms
copying apache_beam/transforms/dataflow_distribution_counter_test.py -> apache-beam-2.9.0.dev0/apache_beam/transforms
copying apache_beam/transforms/display.py -> apache-beam-2.9.0.dev0/apache_beam/transforms
copying apache_beam/transforms/display_test.py -> apache-beam-2.9.0.dev0/apache_beam/transforms
copying apache_beam/transforms/ptransform.py -> apache-beam-2.9.0.dev0/apache_beam/transforms
copying apache_beam/transforms/ptransform_test.py -> apache-beam-2.9.0.dev0/apache_beam/transforms
copying apache_beam/transforms/py_dataflow_distribution_counter.py -> apache-beam-2.9.0.dev0/apache_beam/transforms
copying apache_beam/transforms/sideinputs.py -> apache-beam-2.9.0.dev0/apache_beam/transforms
copying apache_beam/transforms/sideinputs_test.py -> apache-beam-2.9.0.dev0/apache_beam/transforms
copying apache_beam/transforms/timeutil.py -> apache-beam-2.9.0.dev0/apache_beam/transforms
copying apache_beam/transforms/trigger.py -> apache-beam-2.9.0.dev0/apache_beam/transforms
copying apache_beam/transforms/trigger_test.py -> apache-beam-2.9.0.dev0/apache_beam/transforms
copying apache_beam/transforms/userstate.py -> apache-beam-2.9.0.dev0/apache_beam/transforms
copying apache_beam/transforms/userstate_test.py -> apache-beam-2.9.0.dev0/apache_beam/transforms
copying apache_beam/transforms/util.py -> apache-beam-2.9.0.dev0/apache_beam/transforms
copying apache_beam/transforms/util_test.py -> apache-beam-2.9.0.dev0/apache_beam/transforms
copying apache_beam/transforms/window.py -> apache-beam-2.9.0.dev0/apache_beam/transforms
copying apache_beam/transforms/window_test.py -> apache-beam-2.9.0.dev0/apache_beam/transforms
copying apache_beam/transforms/write_ptransform_test.py -> apache-beam-2.9.0.dev0/apache_beam/transforms
copying apache_beam/typehints/__init__.py -> apache-beam-2.9.0.dev0/apache_beam/typehints
copying apache_beam/typehints/decorators.py -> apache-beam-2.9.0.dev0/apache_beam/typehints
copying apache_beam/typehints/native_type_compatibility.py -> apache-beam-2.9.0.dev0/apache_beam/typehints
copying apache_beam/typehints/native_type_compatibility_test.py -> apache-beam-2.9.0.dev0/apache_beam/typehints
copying apache_beam/typehints/opcodes.py -> apache-beam-2.9.0.dev0/apache_beam/typehints
copying apache_beam/typehints/trivial_inference.py -> apache-beam-2.9.0.dev0/apache_beam/typehints
copying apache_beam/typehints/trivial_inference_test.py -> apache-beam-2.9.0.dev0/apache_beam/typehints
copying apache_beam/typehints/typecheck.py -> apache-beam-2.9.0.dev0/apache_beam/typehints
copying apache_beam/typehints/typed_pipeline_test.py -> apache-beam-2.9.0.dev0/apache_beam/typehints
copying apache_beam/typehints/typehints.py -> apache-beam-2.9.0.dev0/apache_beam/typehints
copying apache_beam/typehints/typehints_test.py -> apache-beam-2.9.0.dev0/apache_beam/typehints
copying apache_beam/utils/__init__.py -> apache-beam-2.9.0.dev0/apache_beam/utils
copying apache_beam/utils/annotations.py -> apache-beam-2.9.0.dev0/apache_beam/utils
copying apache_beam/utils/annotations_test.py -> apache-beam-2.9.0.dev0/apache_beam/utils
copying apache_beam/utils/counters.pxd -> apache-beam-2.9.0.dev0/apache_beam/utils
copying apache_beam/utils/counters.py -> apache-beam-2.9.0.dev0/apache_beam/utils
copying apache_beam/utils/counters_test.py -> apache-beam-2.9.0.dev0/apache_beam/utils
copying apache_beam/utils/plugin.py -> apache-beam-2.9.0.dev0/apache_beam/utils
copying apache_beam/utils/processes.py -> apache-beam-2.9.0.dev0/apache_beam/utils
copying apache_beam/utils/processes_test.py -> apache-beam-2.9.0.dev0/apache_beam/utils
copying apache_beam/utils/profiler.py -> apache-beam-2.9.0.dev0/apache_beam/utils
copying apache_beam/utils/proto_utils.py -> apache-beam-2.9.0.dev0/apache_beam/utils
copying apache_beam/utils/retry.py -> apache-beam-2.9.0.dev0/apache_beam/utils
copying apache_beam/utils/retry_test.py -> apache-beam-2.9.0.dev0/apache_beam/utils
copying apache_beam/utils/timestamp.py -> apache-beam-2.9.0.dev0/apache_beam/utils
copying apache_beam/utils/timestamp_test.py -> apache-beam-2.9.0.dev0/apache_beam/utils
copying apache_beam/utils/urns.py -> apache-beam-2.9.0.dev0/apache_beam/utils
copying apache_beam/utils/windowed_value.pxd -> apache-beam-2.9.0.dev0/apache_beam/utils
copying apache_beam/utils/windowed_value.py -> apache-beam-2.9.0.dev0/apache_beam/utils
copying apache_beam/utils/windowed_value_test.py -> apache-beam-2.9.0.dev0/apache_beam/utils
Writing apache-beam-2.9.0.dev0/setup.cfg
creating dist
Creating tar archive
removing 'apache-beam-2.9.0.dev0' (and everything under it)
SDK_LOCATION=$(find dist/apache-beam-*.tar.gz)
find dist/apache-beam-*.tar.gz

# Run ValidatesRunner tests on Google Cloud Dataflow service
echo ">>> RUNNING DATAFLOW RUNNER VALIDATESCONTAINER TEST"
>>> RUNNING DATAFLOW RUNNER VALIDATESCONTAINER TEST
python setup.py nosetests \
  --attr ValidatesContainer \
  --nologcapture \
  --processes=1 \
  --process-timeout=900 \
  --test-pipeline-options=" \
    --runner=TestDataflowRunner \
    --project=$PROJECT \
    --worker_harness_container_image=$CONTAINER:$TAG \
    --staging_location=$GCS_LOCATION/staging-validatesrunner-test \
    --temp_location=$GCS_LOCATION/temp-validatesrunner-test \
    --output=$GCS_LOCATION/output \
    --sdk_location=$SDK_LOCATION \
    --num_workers=1"
<https://builds.apache.org/job/beam_PostCommit_Py_ValCont/ws/src/sdks/python/container/local/lib/python2.7/site-packages/setuptools/dist.py>:470: UserWarning: Normalizing '2.9.0.dev' to '2.9.0.dev0'
  normalized_version,
running nosetests
running egg_info
<https://builds.apache.org/job/beam_PostCommit_Py_ValCont/ws/src/sdks/python/gen_protos.py>:52: UserWarning: Installing grpcio-tools is recommended for development.
  warnings.warn('Installing grpcio-tools is recommended for development.')
writing requirements to apache_beam.egg-info/requires.txt
writing apache_beam.egg-info/PKG-INFO
writing top-level names to apache_beam.egg-info/top_level.txt
writing dependency_links to apache_beam.egg-info/dependency_links.txt
writing entry points to apache_beam.egg-info/entry_points.txt
reading manifest file 'apache_beam.egg-info/SOURCES.txt'
reading manifest template 'MANIFEST.in'
warning: no files found matching 'README.md'
warning: no files found matching 'NOTICE'
warning: no files found matching 'LICENSE'
writing manifest file 'apache_beam.egg-info/SOURCES.txt'
WARNING:root:python-snappy is not installed; some tests will be skipped.
WARNING:root:Tensorflow is not installed, so skipping some tests.
<https://builds.apache.org/job/beam_PostCommit_Py_ValCont/ws/src/sdks/python/apache_beam/runners/dataflow/dataflow_runner.py>:800: BeamDeprecationWarning: options is deprecated since First stable release. References to <pipeline>.options will not be supported
  options = pbegin.pipeline.options.view_as(DebugOptions)
test_wordcount_fnapi_it (apache_beam.examples.wordcount_it_test.WordCountIT) ... ERROR

======================================================================
ERROR: test_wordcount_fnapi_it (apache_beam.examples.wordcount_it_test.WordCountIT)
----------------------------------------------------------------------
Traceback (most recent call last):
  File "<https://builds.apache.org/job/beam_PostCommit_Py_ValCont/ws/src/sdks/python/container/local/lib/python2.7/site-packages/nose/plugins/multiprocess.py",> line 812, in run
    test(orig)
  File "<https://builds.apache.org/job/beam_PostCommit_Py_ValCont/ws/src/sdks/python/container/local/lib/python2.7/site-packages/nose/case.py",> line 45, in __call__
    return self.run(*arg, **kwarg)
  File "<https://builds.apache.org/job/beam_PostCommit_Py_ValCont/ws/src/sdks/python/container/local/lib/python2.7/site-packages/nose/case.py",> line 133, in run
    self.runTest(result)
  File "<https://builds.apache.org/job/beam_PostCommit_Py_ValCont/ws/src/sdks/python/container/local/lib/python2.7/site-packages/nose/case.py",> line 151, in runTest
    test(result)
  File "/usr/lib/python2.7/unittest/case.py", line 393, in __call__
    return self.run(*args, **kwds)
  File "/usr/lib/python2.7/unittest/case.py", line 329, in run
    testMethod()
  File "<https://builds.apache.org/job/beam_PostCommit_Py_ValCont/ws/src/sdks/python/apache_beam/examples/wordcount_it_test.py",> line 51, in test_wordcount_fnapi_it
    self._run_wordcount_it(experiment='beam_fn_api')
  File "<https://builds.apache.org/job/beam_PostCommit_Py_ValCont/ws/src/sdks/python/apache_beam/examples/wordcount_it_test.py",> line 75, in _run_wordcount_it
    wordcount.run(test_pipeline.get_full_options_as_args(**extra_opts))
  File "<https://builds.apache.org/job/beam_PostCommit_Py_ValCont/ws/src/sdks/python/apache_beam/examples/wordcount.py",> line 115, in run
    result = p.run()
  File "<https://builds.apache.org/job/beam_PostCommit_Py_ValCont/ws/src/sdks/python/apache_beam/pipeline.py",> line 405, in run
    self._options).run(False)
  File "<https://builds.apache.org/job/beam_PostCommit_Py_ValCont/ws/src/sdks/python/apache_beam/pipeline.py",> line 418, in run
    return self.runner.run_pipeline(self)
  File "<https://builds.apache.org/job/beam_PostCommit_Py_ValCont/ws/src/sdks/python/apache_beam/runners/dataflow/test_dataflow_runner.py",> line 70, in run_pipeline
    self.result.cancel()
  File "<https://builds.apache.org/job/beam_PostCommit_Py_ValCont/ws/src/sdks/python/apache_beam/runners/dataflow/dataflow_runner.py",> line 1201, in cancel
    self.job_id(), 'JOB_STATE_CANCELLED'):
  File "<https://builds.apache.org/job/beam_PostCommit_Py_ValCont/ws/src/sdks/python/apache_beam/utils/retry.py",> line 184, in wrapper
    return fun(*args, **kwargs)
  File "<https://builds.apache.org/job/beam_PostCommit_Py_ValCont/ws/src/sdks/python/apache_beam/runners/dataflow/internal/apiclient.py",> line 610, in modify_job_state
    self._client.projects_locations_jobs.Update(request)
  File "<https://builds.apache.org/job/beam_PostCommit_Py_ValCont/ws/src/sdks/python/apache_beam/runners/dataflow/internal/clients/dataflow/dataflow_v1b3_client.py",> line 682, in Update
    config, request, global_params=global_params)
  File "<https://builds.apache.org/job/beam_PostCommit_Py_ValCont/ws/src/sdks/python/container/local/lib/python2.7/site-packages/apitools/base/py/base_api.py",> line 729, in _RunMethod
    http, http_request, **opts)
  File "<https://builds.apache.org/job/beam_PostCommit_Py_ValCont/ws/src/sdks/python/container/local/lib/python2.7/site-packages/apitools/base/py/http_wrapper.py",> line 346, in MakeRequest
    check_response_func=check_response_func)
  File "<https://builds.apache.org/job/beam_PostCommit_Py_ValCont/ws/src/sdks/python/container/local/lib/python2.7/site-packages/apitools/base/py/http_wrapper.py",> line 396, in _MakeRequestNoRetry
    redirections=redirections, connection_type=connection_type)
  File "<https://builds.apache.org/job/beam_PostCommit_Py_ValCont/ws/src/sdks/python/container/local/lib/python2.7/site-packages/oauth2client/transport.py",> line 175, in new_request
    redirections, connection_type)
  File "<https://builds.apache.org/job/beam_PostCommit_Py_ValCont/ws/src/sdks/python/container/local/lib/python2.7/site-packages/oauth2client/transport.py",> line 282, in request
    connection_type=connection_type)
  File "<https://builds.apache.org/job/beam_PostCommit_Py_ValCont/ws/src/sdks/python/container/local/lib/python2.7/site-packages/oauth2client/transport.py",> line 175, in new_request
    redirections, connection_type)
  File "<https://builds.apache.org/job/beam_PostCommit_Py_ValCont/ws/src/sdks/python/container/local/lib/python2.7/site-packages/oauth2client/transport.py",> line 282, in request
    connection_type=connection_type)
  File "<https://builds.apache.org/job/beam_PostCommit_Py_ValCont/ws/src/sdks/python/container/local/lib/python2.7/site-packages/httplib2/__init__.py",> line 1694, in request
    (response, content) = self._request(conn, authority, uri, request_uri, method, body, headers, redirections, cachekey)
  File "<https://builds.apache.org/job/beam_PostCommit_Py_ValCont/ws/src/sdks/python/container/local/lib/python2.7/site-packages/httplib2/__init__.py",> line 1434, in _request
    (response, content) = self._conn_request(conn, request_uri, method, body, headers)
  File "<https://builds.apache.org/job/beam_PostCommit_Py_ValCont/ws/src/sdks/python/container/local/lib/python2.7/site-packages/httplib2/__init__.py",> line 1390, in _conn_request
    response = conn.getresponse()
  File "/usr/lib/python2.7/httplib.py", line 1136, in getresponse
    response.begin()
  File "/usr/lib/python2.7/httplib.py", line 453, in begin
    version, status, reason = self._read_status()
  File "/usr/lib/python2.7/httplib.py", line 409, in _read_status
    line = self.fp.readline(_MAXLINE + 1)
  File "/usr/lib/python2.7/socket.py", line 480, in readline
    data = self._sock.recv(self._rbufsize)
  File "/usr/lib/python2.7/ssl.py", line 756, in recv
    return self.read(buflen)
  File "/usr/lib/python2.7/ssl.py", line 643, in read
    v = self._sslobj.read(len)
  File "<https://builds.apache.org/job/beam_PostCommit_Py_ValCont/ws/src/sdks/python/container/local/lib/python2.7/site-packages/nose/plugins/multiprocess.py",> line 276, in signalhandler
    raise TimedOutException()
TimedOutException: 'test_wordcount_fnapi_it (apache_beam.examples.wordcount_it_test.WordCountIT)'

----------------------------------------------------------------------
XML: <https://builds.apache.org/job/beam_PostCommit_Py_ValCont/ws/src/sdks/python/nosetests.xml>
----------------------------------------------------------------------
Ran 1 test in 902.309s

FAILED (errors=1)
cleanup_container
Untagged: us.gcr.io/apache-beam-testing/jenkins/python:20181115-214552
Untagged: us.gcr.io/apache-beam-testing/jenkins/python@sha256:f142cb6e6681c33e76e4b9d6ac2172d89b60a74ac9a2a25ae25eb6a796eefc44
Deleted: sha256:e224e28ff93ec75139e9599a1be84becc3c80bcf7787765bf68e566ce78f1a68
Deleted: sha256:1754dcb221c06ee08feb201b68a7dc6137fabe5c75d3721b3988fa33ed636b42
Deleted: sha256:ea71907e135daf84943ae80c4d9c1b9e06953df91460e343840eac34797aae28
Deleted: sha256:caa86a8c2b44fad731eb594fffaabe209674d7aa3f110c278f9107246e044fbf
Deleted: sha256:a46c4b2aaad56f8f84070027c468123cd383cb137a594b36eac0e0fe907f220c
Deleted: sha256:a1f17ce1952be566cda35031eb63325e37f6d0d54d699641860cd52b6a95db6e
Deleted: sha256:50dd58272804bb2ed4474ea8991b7c7a627c9e2c01a2b4e6ac31e8f17a952d28
Deleted: sha256:67005bc6889ea46a84455d0ef6714720bc0a2d13b91d3c284307e4377c223008
Deleted: sha256:980ef410e139d7f179b67d1e79babc59277fb826c9d893cf751a8c9ecc3fe467
Deleted: sha256:370b05ff7261c393b37390dc804b6b7989f1608846e4bd4574a9d1e55fb7aedd
Deleted: sha256:93bf1c901f92d2d6ca029cda56e5f37087e8d3a4233908e2014c81f2269a7f56
Deleted: sha256:069407807c3e96632c417bb72e782324d9541a9b625e2c424d4882ea924b78e3
Deleted: sha256:18b482d56c94bff19fb9bb36a635b4fc69c222956891aa44dd7ead1ff30378c7
Deleted: sha256:aa465e42ffb09a44bdc43c5cb0120b496b5cf0a99c3b545bb5e23ddd57d65b24
Digests:
- us.gcr.io/apache-beam-testing/jenkins/python@sha256:f142cb6e6681c33e76e4b9d6ac2172d89b60a74ac9a2a25ae25eb6a796eefc44
  Associated tags:
 - 20181115-214552
Tags:
- us.gcr.io/apache-beam-testing/jenkins/python:20181115-214552
Deleted [us.gcr.io/apache-beam-testing/jenkins/python:20181115-214552].
Deleted [us.gcr.io/apache-beam-testing/jenkins/python@sha256:f142cb6e6681c33e76e4b9d6ac2172d89b60a74ac9a2a25ae25eb6a796eefc44].
Removed the container
Build step 'Execute shell' marked build as failure

---------------------------------------------------------------------
To unsubscribe, e-mail: builds-unsubscribe@beam.apache.org
For additional commands, e-mail: builds-help@beam.apache.org