You are viewing a plain text version of this content. The canonical link for it is here.
Posted to notifications@directory.apache.org by gm...@apache.org on 2016/03/20 10:32:53 UTC

Build failed in Jenkins: directory-fortress-commander #848

See <https://analysis.apache.org/jenkins/job/directory-fortress-commander/848/changes>

Changes:

[smckinney] release prep

[smckinney] [maven-release-plugin] prepare release 1.0-RC42

[smckinney] [maven-release-plugin] prepare for next development iteration

------------------------------------------
Started by timer
Building in workspace <https://analysis.apache.org/jenkins/job/directory-fortress-commander/ws/>
 > git rev-parse --is-inside-work-tree # timeout=10
Fetching changes from the remote Git repository
 > git config remote.origin.url https://git-wip-us.apache.org/repos/asf/directory-fortress-commander.git # timeout=10
Fetching upstream changes from https://git-wip-us.apache.org/repos/asf/directory-fortress-commander.git
 > git --version # timeout=10
 > git -c core.askpass=true fetch --tags --progress https://git-wip-us.apache.org/repos/asf/directory-fortress-commander.git +refs/heads/*:refs/remotes/origin/*
Seen branch in repository origin/1.0-RC41
Seen branch in repository origin/master
Seen 2 remote branches
Checking out Revision ab354cd1e98181bbcb876ac3858784fadecb1a22 (origin/master)
 > git config core.sparsecheckout # timeout=10
 > git checkout -f ab354cd1e98181bbcb876ac3858784fadecb1a22
 > git rev-list 2b3a9a5f48b99da146b975ea0a785caa15f85fa7 # timeout=10
 > git tag -a -f -m Jenkins Build #848 jenkins-directory-fortress-commander-848 # timeout=10
Parsing POMs
Modules changed, recalculating dependency graph
Established TCP socket on 41345
[workspace] $ /x1/jenkins/jenkins-master/jenkins-home/tools/hudson.model.JDK/jdk1.7.0_65/bin/java -Xms256m -Xmx512m -XX:+UseCompressedOops -XX:MaxPermSize=256m -cp /x1/jenkins/jenkins-master/jenkins-home/plugins/maven-plugin/WEB-INF/lib/maven3-agent-1.7.jar:/x1/jenkins/jenkins-master/jenkins-home/tools/hudson.tasks.Maven_MavenInstallation/maven-3.0.5/boot/plexus-classworlds-2.4.jar org.jvnet.hudson.maven3.agent.Maven3Main /x1/jenkins/jenkins-master/jenkins-home/tools/hudson.tasks.Maven_MavenInstallation/maven-3.0.5 /x1/jenkins/jenkins-master/catalina-base/work/Catalina/localhost/jenkins/WEB-INF/lib/remoting-2.53.3.jar /x1/jenkins/jenkins-master/jenkins-home/plugins/maven-plugin/WEB-INF/lib/maven3-interceptor-1.7.jar /x1/jenkins/jenkins-master/jenkins-home/plugins/maven-plugin/WEB-INF/lib/maven3-interceptor-commons-1.7.jar 41345
<===[JENKINS REMOTING CAPACITY]===>   channel started
Executing Maven:  -B -f <https://analysis.apache.org/jenkins/job/directory-fortress-commander/ws/pom.xml> clean install -U -DskipTests -fae
[INFO] Scanning for projects...
[INFO]                                                                         
[INFO] ------------------------------------------------------------------------
[INFO] Building Apache Fortress Web 1.0-RC43-SNAPSHOT
[INFO] ------------------------------------------------------------------------
Downloading: http://repo1.maven.org/maven2/org/apache/directory/fortress/fortress-realm-impl/1.0-RC42/fortress-realm-impl-1.0-RC42.pom
Downloading: http://repo.maven.apache.org/maven2/org/apache/directory/fortress/fortress-realm-impl/1.0-RC42/fortress-realm-impl-1.0-RC42.pom
[WARNING] The POM for org.apache.directory.fortress:fortress-realm-impl:jar:1.0-RC42 is missing, no dependency information available
Downloading: http://repo1.maven.org/maven2/org/apache/directory/fortress/fortress-realm-impl/1.0-RC42/fortress-realm-impl-1.0-RC42.jar
Downloading: http://repo.maven.apache.org/maven2/org/apache/directory/fortress/fortress-realm-impl/1.0-RC42/fortress-realm-impl-1.0-RC42.jar
[INFO] ------------------------------------------------------------------------
[INFO] BUILD FAILURE
[INFO] ------------------------------------------------------------------------
[INFO] Total time: 20.344s
[INFO] Finished at: Sun Mar 20 09:32:50 UTC 2016
[INFO] Final Memory: 15M/246M
[INFO] ------------------------------------------------------------------------
Waiting for Jenkins to finish collecting data[ERROR] Failed to execute goal on project fortress-web: Could not resolve dependencies for project org.apache.directory.fortress:fortress-web:war:1.0-RC43-SNAPSHOT: Could not find artifact org.apache.directory.fortress:fortress-realm-impl:jar:1.0-RC42 in maven2 (http://repo1.maven.org/maven2) -> [Help 1]
[ERROR] 
[ERROR] To see the full stack trace of the errors, re-run Maven with the -e switch.
[ERROR] Re-run Maven using the -X switch to enable full debug logging.
[ERROR] 
[ERROR] For more information about the errors and possible solutions, please read the following articles:
[ERROR] [Help 1] http://cwiki.apache.org/confluence/display/MAVEN/DependencyResolutionException

[JENKINS] Archiving <https://analysis.apache.org/jenkins/job/directory-fortress-commander/ws/pom.xml> to org.apache.directory.fortress/fortress-web/1.0-RC43-SNAPSHOT/fortress-web-1.0-RC43-SNAPSHOT.pom
Sending e-mails to: notifications@directory.apache.org
channel stopped
Skipping sonar analysis due to bad build status FAILURE

Jenkins build is back to normal : directory-fortress-commander #853

Posted by gm...@apache.org.
See <https://analysis.apache.org/jenkins/job/directory-fortress-commander/853/>


Build failed in Jenkins: directory-fortress-commander #852

Posted by gm...@apache.org.
See <https://analysis.apache.org/jenkins/job/directory-fortress-commander/852/>

------------------------------------------
Started by timer
Building in workspace <https://analysis.apache.org/jenkins/job/directory-fortress-commander/ws/>
 > git rev-parse --is-inside-work-tree # timeout=10
Fetching changes from the remote Git repository
 > git config remote.origin.url https://git-wip-us.apache.org/repos/asf/directory-fortress-commander.git # timeout=10
Fetching upstream changes from https://git-wip-us.apache.org/repos/asf/directory-fortress-commander.git
 > git --version # timeout=10
 > git -c core.askpass=true fetch --tags --progress https://git-wip-us.apache.org/repos/asf/directory-fortress-commander.git +refs/heads/*:refs/remotes/origin/*
Seen branch in repository origin/1.0-RC41
Seen branch in repository origin/master
Seen 2 remote branches
Checking out Revision 32f0104d3e148a67466d080a5d1687c0eb678c49 (origin/master)
 > git config core.sparsecheckout # timeout=10
 > git checkout -f 32f0104d3e148a67466d080a5d1687c0eb678c49
 > git rev-list 32f0104d3e148a67466d080a5d1687c0eb678c49 # timeout=10
 > git tag -a -f -m Jenkins Build #852 jenkins-directory-fortress-commander-852 # timeout=10
Parsing POMs
Established TCP socket on 33324
[workspace] $ /x1/jenkins/jenkins-master/jenkins-home/tools/hudson.model.JDK/jdk1.7.0_65/bin/java -Xms256m -Xmx512m -XX:+UseCompressedOops -XX:MaxPermSize=256m -cp /x1/jenkins/jenkins-master/jenkins-home/plugins/maven-plugin/WEB-INF/lib/maven3-agent-1.7.jar:/x1/jenkins/jenkins-master/jenkins-home/tools/hudson.tasks.Maven_MavenInstallation/maven-3.0.5/boot/plexus-classworlds-2.4.jar org.jvnet.hudson.maven3.agent.Maven3Main /x1/jenkins/jenkins-master/jenkins-home/tools/hudson.tasks.Maven_MavenInstallation/maven-3.0.5 /x1/jenkins/jenkins-master/catalina-base/work/Catalina/localhost/jenkins/WEB-INF/lib/remoting-2.53.3.jar /x1/jenkins/jenkins-master/jenkins-home/plugins/maven-plugin/WEB-INF/lib/maven3-interceptor-1.7.jar /x1/jenkins/jenkins-master/jenkins-home/plugins/maven-plugin/WEB-INF/lib/maven3-interceptor-commons-1.7.jar 33324
<===[JENKINS REMOTING CAPACITY]===>   channel started
Executing Maven:  -B -f <https://analysis.apache.org/jenkins/job/directory-fortress-commander/ws/pom.xml> clean install -U -DskipTests -fae
[INFO] Scanning for projects...
[INFO]                                                                         
[INFO] ------------------------------------------------------------------------
[INFO] Building Apache Fortress Web 1.0-RC43-SNAPSHOT
[INFO] ------------------------------------------------------------------------
Downloading: http://repo1.maven.org/maven2/org/apache/directory/fortress/fortress-realm-impl/1.0-RC42/fortress-realm-impl-1.0-RC42.pom
Downloading: http://repo.maven.apache.org/maven2/org/apache/directory/fortress/fortress-realm-impl/1.0-RC42/fortress-realm-impl-1.0-RC42.pom
[WARNING] The POM for org.apache.directory.fortress:fortress-realm-impl:jar:1.0-RC42 is missing, no dependency information available
Downloading: http://repo1.maven.org/maven2/org/apache/directory/fortress/fortress-realm-impl/1.0-RC42/fortress-realm-impl-1.0-RC42.jar
Downloading: http://repo.maven.apache.org/maven2/org/apache/directory/fortress/fortress-realm-impl/1.0-RC42/fortress-realm-impl-1.0-RC42.jar
[INFO] ------------------------------------------------------------------------
[INFO] BUILD FAILURE
[INFO] ------------------------------------------------------------------------
[INFO] Total time: 17.443s
[INFO] Finished at: Thu Mar 24 09:32:42 UTC 2016
[INFO] Final Memory: 15M/246M
[INFO] ------------------------------------------------------------------------
Waiting for Jenkins to finish collecting data[ERROR] Failed to execute goal on project fortress-web: Could not resolve dependencies for project org.apache.directory.fortress:fortress-web:war:1.0-RC43-SNAPSHOT: Could not find artifact org.apache.directory.fortress:fortress-realm-impl:jar:1.0-RC42 in maven2 (http://repo1.maven.org/maven2) -> [Help 1]
[ERROR] 
[ERROR] To see the full stack trace of the errors, re-run Maven with the -e switch.
[ERROR] Re-run Maven using the -X switch to enable full debug logging.
[ERROR] 
[ERROR] For more information about the errors and possible solutions, please read the following articles:
[ERROR] [Help 1] http://cwiki.apache.org/confluence/display/MAVEN/DependencyResolutionException

[JENKINS] Archiving <https://analysis.apache.org/jenkins/job/directory-fortress-commander/ws/pom.xml> to org.apache.directory.fortress/fortress-web/1.0-RC43-SNAPSHOT/fortress-web-1.0-RC43-SNAPSHOT.pom
Sending e-mails to: notifications@directory.apache.org
channel stopped
Skipping sonar analysis due to bad build status FAILURE

Build failed in Jenkins: directory-fortress-commander #851

Posted by gm...@apache.org.
See <https://analysis.apache.org/jenkins/job/directory-fortress-commander/851/>

------------------------------------------
Started by timer
Building in workspace <https://analysis.apache.org/jenkins/job/directory-fortress-commander/ws/>
 > git rev-parse --is-inside-work-tree # timeout=10
Fetching changes from the remote Git repository
 > git config remote.origin.url https://git-wip-us.apache.org/repos/asf/directory-fortress-commander.git # timeout=10
Fetching upstream changes from https://git-wip-us.apache.org/repos/asf/directory-fortress-commander.git
 > git --version # timeout=10
 > git -c core.askpass=true fetch --tags --progress https://git-wip-us.apache.org/repos/asf/directory-fortress-commander.git +refs/heads/*:refs/remotes/origin/*
Seen branch in repository origin/1.0-RC41
Seen branch in repository origin/master
Seen 2 remote branches
Checking out Revision 32f0104d3e148a67466d080a5d1687c0eb678c49 (origin/master)
 > git config core.sparsecheckout # timeout=10
 > git checkout -f 32f0104d3e148a67466d080a5d1687c0eb678c49
 > git rev-list 32f0104d3e148a67466d080a5d1687c0eb678c49 # timeout=10
 > git tag -a -f -m Jenkins Build #851 jenkins-directory-fortress-commander-851 # timeout=10
Parsing POMs
Established TCP socket on 41814
[workspace] $ /x1/jenkins/jenkins-master/jenkins-home/tools/hudson.model.JDK/jdk1.7.0_65/bin/java -Xms256m -Xmx512m -XX:+UseCompressedOops -XX:MaxPermSize=256m -cp /x1/jenkins/jenkins-master/jenkins-home/plugins/maven-plugin/WEB-INF/lib/maven3-agent-1.7.jar:/x1/jenkins/jenkins-master/jenkins-home/tools/hudson.tasks.Maven_MavenInstallation/maven-3.0.5/boot/plexus-classworlds-2.4.jar org.jvnet.hudson.maven3.agent.Maven3Main /x1/jenkins/jenkins-master/jenkins-home/tools/hudson.tasks.Maven_MavenInstallation/maven-3.0.5 /x1/jenkins/jenkins-master/catalina-base/work/Catalina/localhost/jenkins/WEB-INF/lib/remoting-2.53.3.jar /x1/jenkins/jenkins-master/jenkins-home/plugins/maven-plugin/WEB-INF/lib/maven3-interceptor-1.7.jar /x1/jenkins/jenkins-master/jenkins-home/plugins/maven-plugin/WEB-INF/lib/maven3-interceptor-commons-1.7.jar 41814
<===[JENKINS REMOTING CAPACITY]===>   channel started
Executing Maven:  -B -f <https://analysis.apache.org/jenkins/job/directory-fortress-commander/ws/pom.xml> clean install -U -DskipTests -fae
[INFO] Scanning for projects...
[INFO]                                                                         
[INFO] ------------------------------------------------------------------------
[INFO] Building Apache Fortress Web 1.0-RC43-SNAPSHOT
[INFO] ------------------------------------------------------------------------
Downloading: http://repo1.maven.org/maven2/org/apache/directory/fortress/fortress-realm-impl/1.0-RC42/fortress-realm-impl-1.0-RC42.pom
Downloading: http://repo.maven.apache.org/maven2/org/apache/directory/fortress/fortress-realm-impl/1.0-RC42/fortress-realm-impl-1.0-RC42.pom
[WARNING] The POM for org.apache.directory.fortress:fortress-realm-impl:jar:1.0-RC42 is missing, no dependency information available
Downloading: http://repo1.maven.org/maven2/org/apache/directory/fortress/fortress-realm-impl/1.0-RC42/fortress-realm-impl-1.0-RC42.jar
Downloading: http://repo.maven.apache.org/maven2/org/apache/directory/fortress/fortress-realm-impl/1.0-RC42/fortress-realm-impl-1.0-RC42.jar
[INFO] ------------------------------------------------------------------------
[INFO] BUILD FAILURE
[INFO] ------------------------------------------------------------------------
[INFO] Total time: 19.659s
[INFO] Finished at: Wed Mar 23 09:32:48 UTC 2016
[INFO] Final Memory: 14M/246M
[INFO] ------------------------------------------------------------------------
Waiting for Jenkins to finish collecting data[ERROR] Failed to execute goal on project fortress-web: Could not resolve dependencies for project org.apache.directory.fortress:fortress-web:war:1.0-RC43-SNAPSHOT: Could not find artifact org.apache.directory.fortress:fortress-realm-impl:jar:1.0-RC42 in maven2 (http://repo1.maven.org/maven2) -> [Help 1]
[ERROR] 
[ERROR] To see the full stack trace of the errors, re-run Maven with the -e switch.
[ERROR] Re-run Maven using the -X switch to enable full debug logging.
[ERROR] 
[ERROR] For more information about the errors and possible solutions, please read the following articles:
[ERROR] [Help 1] http://cwiki.apache.org/confluence/display/MAVEN/DependencyResolutionException

[JENKINS] Archiving <https://analysis.apache.org/jenkins/job/directory-fortress-commander/ws/pom.xml> to org.apache.directory.fortress/fortress-web/1.0-RC43-SNAPSHOT/fortress-web-1.0-RC43-SNAPSHOT.pom
Sending e-mails to: notifications@directory.apache.org
Skipping sonar analysis due to bad build status FAILURE
channel stopped

Build failed in Jenkins: directory-fortress-commander #850

Posted by gm...@apache.org.
See <https://analysis.apache.org/jenkins/job/directory-fortress-commander/850/changes>

Changes:

[smckinney] wicket.version>6.22.0

------------------------------------------
Started by timer
Building in workspace <https://analysis.apache.org/jenkins/job/directory-fortress-commander/ws/>
 > git rev-parse --is-inside-work-tree # timeout=10
Fetching changes from the remote Git repository
 > git config remote.origin.url https://git-wip-us.apache.org/repos/asf/directory-fortress-commander.git # timeout=10
Fetching upstream changes from https://git-wip-us.apache.org/repos/asf/directory-fortress-commander.git
 > git --version # timeout=10
 > git -c core.askpass=true fetch --tags --progress https://git-wip-us.apache.org/repos/asf/directory-fortress-commander.git +refs/heads/*:refs/remotes/origin/*
Seen branch in repository origin/1.0-RC41
Seen branch in repository origin/master
Seen 2 remote branches
Checking out Revision 32f0104d3e148a67466d080a5d1687c0eb678c49 (origin/master)
 > git config core.sparsecheckout # timeout=10
 > git checkout -f 32f0104d3e148a67466d080a5d1687c0eb678c49
 > git rev-list ab354cd1e98181bbcb876ac3858784fadecb1a22 # timeout=10
 > git tag -a -f -m Jenkins Build #850 jenkins-directory-fortress-commander-850 # timeout=10
Parsing POMs
Modules changed, recalculating dependency graph
Established TCP socket on 51225
[workspace] $ /x1/jenkins/jenkins-master/jenkins-home/tools/hudson.model.JDK/jdk1.7.0_65/bin/java -Xms256m -Xmx512m -XX:+UseCompressedOops -XX:MaxPermSize=256m -cp /x1/jenkins/jenkins-master/jenkins-home/plugins/maven-plugin/WEB-INF/lib/maven3-agent-1.7.jar:/x1/jenkins/jenkins-master/jenkins-home/tools/hudson.tasks.Maven_MavenInstallation/maven-3.0.5/boot/plexus-classworlds-2.4.jar org.jvnet.hudson.maven3.agent.Maven3Main /x1/jenkins/jenkins-master/jenkins-home/tools/hudson.tasks.Maven_MavenInstallation/maven-3.0.5 /x1/jenkins/jenkins-master/catalina-base/work/Catalina/localhost/jenkins/WEB-INF/lib/remoting-2.53.3.jar /x1/jenkins/jenkins-master/jenkins-home/plugins/maven-plugin/WEB-INF/lib/maven3-interceptor-1.7.jar /x1/jenkins/jenkins-master/jenkins-home/plugins/maven-plugin/WEB-INF/lib/maven3-interceptor-commons-1.7.jar 51225
<===[JENKINS REMOTING CAPACITY]===>   channel started
Executing Maven:  -B -f <https://analysis.apache.org/jenkins/job/directory-fortress-commander/ws/pom.xml> clean install -U -DskipTests -fae
[INFO] Scanning for projects...
[INFO]                                                                         
[INFO] ------------------------------------------------------------------------
[INFO] Building Apache Fortress Web 1.0-RC43-SNAPSHOT
[INFO] ------------------------------------------------------------------------
Downloading: http://repo1.maven.org/maven2/org/apache/directory/fortress/fortress-realm-impl/1.0-RC42/fortress-realm-impl-1.0-RC42.pom
Downloading: http://repo.maven.apache.org/maven2/org/apache/directory/fortress/fortress-realm-impl/1.0-RC42/fortress-realm-impl-1.0-RC42.pom
[WARNING] The POM for org.apache.directory.fortress:fortress-realm-impl:jar:1.0-RC42 is missing, no dependency information available
Downloading: http://repo1.maven.org/maven2/org/apache/wicket/wicket-extensions/6.22.0/wicket-extensions-6.22.0.pom
Downloaded: http://repo1.maven.org/maven2/org/apache/wicket/wicket-extensions/6.22.0/wicket-extensions-6.22.0.pom (4 KB at 30.1 KB/sec)
Downloading: http://repo1.maven.org/maven2/org/apache/wicket/wicket-parent/6.22.0/wicket-parent-6.22.0.pom
Downloaded: http://repo1.maven.org/maven2/org/apache/wicket/wicket-parent/6.22.0/wicket-parent-6.22.0.pom (31 KB at 112.6 KB/sec)
Downloading: http://repo1.maven.org/maven2/org/apache/wicket/wicket-core/6.22.0/wicket-core-6.22.0.pom
Downloaded: http://repo1.maven.org/maven2/org/apache/wicket/wicket-core/6.22.0/wicket-core-6.22.0.pom (5 KB at 40.2 KB/sec)
Downloading: http://repo1.maven.org/maven2/org/apache/wicket/wicket-util/6.22.0/wicket-util-6.22.0.pom
Downloaded: http://repo1.maven.org/maven2/org/apache/wicket/wicket-util/6.22.0/wicket-util-6.22.0.pom (3 KB at 13.5 KB/sec)
Downloading: http://repo1.maven.org/maven2/org/apache/wicket/wicket-request/6.22.0/wicket-request-6.22.0.pom
Downloaded: http://repo1.maven.org/maven2/org/apache/wicket/wicket-request/6.22.0/wicket-request-6.22.0.pom (3 KB at 28.8 KB/sec)
Downloading: http://repo1.maven.org/maven2/org/apache/wicket/wicket-guice/6.22.0/wicket-guice-6.22.0.pom
Downloaded: http://repo1.maven.org/maven2/org/apache/wicket/wicket-guice/6.22.0/wicket-guice-6.22.0.pom (3 KB at 25.5 KB/sec)
Downloading: http://repo1.maven.org/maven2/org/apache/wicket/wicket-ioc/6.22.0/wicket-ioc-6.22.0.pom
Downloaded: http://repo1.maven.org/maven2/org/apache/wicket/wicket-ioc/6.22.0/wicket-ioc-6.22.0.pom (3 KB at 39.6 KB/sec)
Downloading: http://repo1.maven.org/maven2/org/apache/wicket/wicket-jmx/6.22.0/wicket-jmx-6.22.0.pom
Downloaded: http://repo1.maven.org/maven2/org/apache/wicket/wicket-jmx/6.22.0/wicket-jmx-6.22.0.pom (3 KB at 26.8 KB/sec)
Downloading: http://repo1.maven.org/maven2/org/apache/wicket/wicket-datetime/6.22.0/wicket-datetime-6.22.0.pom
Downloaded: http://repo1.maven.org/maven2/org/apache/wicket/wicket-datetime/6.22.0/wicket-datetime-6.22.0.pom (4 KB at 30.2 KB/sec)
Downloading: http://repo1.maven.org/maven2/org/apache/wicket/wicket-velocity/6.22.0/wicket-velocity-6.22.0.pom
Downloaded: http://repo1.maven.org/maven2/org/apache/wicket/wicket-velocity/6.22.0/wicket-velocity-6.22.0.pom (3 KB at 11.9 KB/sec)
Downloading: http://repo1.maven.org/maven2/org/apache/wicket/wicket-spring/6.22.0/wicket-spring-6.22.0.pom
Downloaded: http://repo1.maven.org/maven2/org/apache/wicket/wicket-spring/6.22.0/wicket-spring-6.22.0.pom (3 KB at 35.1 KB/sec)
Downloading: http://repo1.maven.org/maven2/org/apache/wicket/wicket-devutils/6.22.0/wicket-devutils-6.22.0.pom
Downloaded: http://repo1.maven.org/maven2/org/apache/wicket/wicket-devutils/6.22.0/wicket-devutils-6.22.0.pom (3 KB at 19.0 KB/sec)
Downloading: http://repo1.maven.org/maven2/org/apache/directory/fortress/fortress-realm-impl/1.0-RC42/fortress-realm-impl-1.0-RC42.jar
Downloading: http://repo1.maven.org/maven2/org/apache/wicket/wicket-core/6.22.0/wicket-core-6.22.0.jar
Downloading: http://repo1.maven.org/maven2/org/apache/wicket/wicket-extensions/6.22.0/wicket-extensions-6.22.0.jar
Downloading: http://repo1.maven.org/maven2/org/apache/wicket/wicket-request/6.22.0/wicket-request-6.22.0.jar
Downloading: http://repo1.maven.org/maven2/org/apache/wicket/wicket-util/6.22.0/wicket-util-6.22.0.jar
Downloading: http://repo1.maven.org/maven2/org/apache/wicket/wicket-guice/6.22.0/wicket-guice-6.22.0.jar
Downloaded: http://repo1.maven.org/maven2/org/apache/wicket/wicket-guice/6.22.0/wicket-guice-6.22.0.jar (19 KB at 116.6 KB/sec)
Downloading: http://repo1.maven.org/maven2/org/apache/wicket/wicket-ioc/6.22.0/wicket-ioc-6.22.0.jar
Downloaded: http://repo1.maven.org/maven2/org/apache/wicket/wicket-ioc/6.22.0/wicket-ioc-6.22.0.jar (24 KB at 212.5 KB/sec)
Downloading: http://repo1.maven.org/maven2/org/apache/wicket/wicket-jmx/6.22.0/wicket-jmx-6.22.0.jar
Downloaded: http://repo1.maven.org/maven2/org/apache/wicket/wicket-extensions/6.22.0/wicket-extensions-6.22.0.jar (1358 KB at 2881.7 KB/sec)
Downloading: http://repo1.maven.org/maven2/org/apache/wicket/wicket-datetime/6.22.0/wicket-datetime-6.22.0.jar
Downloaded: http://repo1.maven.org/maven2/org/apache/wicket/wicket-datetime/6.22.0/wicket-datetime-6.22.0.jar (234 KB at 1111.9 KB/sec)
Downloading: http://repo1.maven.org/maven2/org/apache/wicket/wicket-velocity/6.22.0/wicket-velocity-6.22.0.jar
Downloaded: http://repo1.maven.org/maven2/org/apache/wicket/wicket-jmx/6.22.0/wicket-jmx-6.22.0.jar (28 KB at 37.2 KB/sec)
Downloading: http://repo1.maven.org/maven2/org/apache/wicket/wicket-spring/6.22.0/wicket-spring-6.22.0.jar
Downloaded: http://repo1.maven.org/maven2/org/apache/wicket/wicket-request/6.22.0/wicket-request-6.22.0.jar (86 KB at 78.5 KB/sec)
Downloading: http://repo1.maven.org/maven2/org/apache/wicket/wicket-devutils/6.22.0/wicket-devutils-6.22.0.jar
Downloaded: http://repo1.maven.org/maven2/org/apache/wicket/wicket-spring/6.22.0/wicket-spring-6.22.0.jar (26 KB at 284.1 KB/sec)
Downloaded: http://repo1.maven.org/maven2/org/apache/wicket/wicket-devutils/6.22.0/wicket-devutils-6.22.0.jar (112 KB at 833.8 KB/sec)
Downloaded: http://repo1.maven.org/maven2/org/apache/wicket/wicket-velocity/6.22.0/wicket-velocity-6.22.0.jar (20 KB at 23.2 KB/sec)
Downloaded: http://repo1.maven.org/maven2/org/apache/wicket/wicket-util/6.22.0/wicket-util-6.22.0.jar (422 KB at 119.1 KB/sec)
Downloaded: http://repo1.maven.org/maven2/org/apache/wicket/wicket-core/6.22.0/wicket-core-6.22.0.jar (2096 KB at 158.5 KB/sec)
Downloading: http://repo.maven.apache.org/maven2/org/apache/directory/fortress/fortress-realm-impl/1.0-RC42/fortress-realm-impl-1.0-RC42.jar
[INFO] ------------------------------------------------------------------------
[INFO] BUILD FAILURE
[INFO] ------------------------------------------------------------------------
[INFO] Total time: 50.056s
[INFO] Finished at: Tue Mar 22 09:42:22 UTC 2016
[INFO] Final Memory: 15M/246M
[INFO] ------------------------------------------------------------------------
Waiting for Jenkins to finish collecting data[ERROR] Failed to execute goal on project fortress-web: Could not resolve dependencies for project org.apache.directory.fortress:fortress-web:war:1.0-RC43-SNAPSHOT: Could not find artifact org.apache.directory.fortress:fortress-realm-impl:jar:1.0-RC42 in maven2 (http://repo1.maven.org/maven2) -> [Help 1]
[ERROR] 
[ERROR] To see the full stack trace of the errors, re-run Maven with the -e switch.
[ERROR] Re-run Maven using the -X switch to enable full debug logging.
[ERROR] 
[ERROR] For more information about the errors and possible solutions, please read the following articles:
[ERROR] [Help 1] http://cwiki.apache.org/confluence/display/MAVEN/DependencyResolutionException

[JENKINS] Archiving <https://analysis.apache.org/jenkins/job/directory-fortress-commander/ws/pom.xml> to org.apache.directory.fortress/fortress-web/1.0-RC43-SNAPSHOT/fortress-web-1.0-RC43-SNAPSHOT.pom
Sending e-mails to: notifications@directory.apache.org
channel stopped
Skipping sonar analysis due to bad build status FAILURE

Build failed in Jenkins: directory-fortress-commander #849

Posted by gm...@apache.org.
See <https://analysis.apache.org/jenkins/job/directory-fortress-commander/849/>

------------------------------------------
Started by timer
Building in workspace <https://analysis.apache.org/jenkins/job/directory-fortress-commander/ws/>
 > git rev-parse --is-inside-work-tree # timeout=10
Fetching changes from the remote Git repository
 > git config remote.origin.url https://git-wip-us.apache.org/repos/asf/directory-fortress-commander.git # timeout=10
Fetching upstream changes from https://git-wip-us.apache.org/repos/asf/directory-fortress-commander.git
 > git --version # timeout=10
 > git -c core.askpass=true fetch --tags --progress https://git-wip-us.apache.org/repos/asf/directory-fortress-commander.git +refs/heads/*:refs/remotes/origin/*
Seen branch in repository origin/1.0-RC41
Seen branch in repository origin/master
Seen 2 remote branches
Checking out Revision ab354cd1e98181bbcb876ac3858784fadecb1a22 (origin/master)
 > git config core.sparsecheckout # timeout=10
 > git checkout -f ab354cd1e98181bbcb876ac3858784fadecb1a22
 > git rev-list ab354cd1e98181bbcb876ac3858784fadecb1a22 # timeout=10
 > git tag -a -f -m Jenkins Build #849 jenkins-directory-fortress-commander-849 # timeout=10
Parsing POMs
Established TCP socket on 52259
[workspace] $ /x1/jenkins/jenkins-master/jenkins-home/tools/hudson.model.JDK/jdk1.7.0_65/bin/java -Xms256m -Xmx512m -XX:+UseCompressedOops -XX:MaxPermSize=256m -cp /x1/jenkins/jenkins-master/jenkins-home/plugins/maven-plugin/WEB-INF/lib/maven3-agent-1.7.jar:/x1/jenkins/jenkins-master/jenkins-home/tools/hudson.tasks.Maven_MavenInstallation/maven-3.0.5/boot/plexus-classworlds-2.4.jar org.jvnet.hudson.maven3.agent.Maven3Main /x1/jenkins/jenkins-master/jenkins-home/tools/hudson.tasks.Maven_MavenInstallation/maven-3.0.5 /x1/jenkins/jenkins-master/catalina-base/work/Catalina/localhost/jenkins/WEB-INF/lib/remoting-2.53.3.jar /x1/jenkins/jenkins-master/jenkins-home/plugins/maven-plugin/WEB-INF/lib/maven3-interceptor-1.7.jar /x1/jenkins/jenkins-master/jenkins-home/plugins/maven-plugin/WEB-INF/lib/maven3-interceptor-commons-1.7.jar 52259
<===[JENKINS REMOTING CAPACITY]===>   channel started
Executing Maven:  -B -f <https://analysis.apache.org/jenkins/job/directory-fortress-commander/ws/pom.xml> clean install -U -DskipTests -fae
[INFO] Scanning for projects...
[INFO]                                                                         
[INFO] ------------------------------------------------------------------------
[INFO] Building Apache Fortress Web 1.0-RC43-SNAPSHOT
[INFO] ------------------------------------------------------------------------
Downloading: http://repo1.maven.org/maven2/org/apache/directory/fortress/fortress-realm-impl/1.0-RC42/fortress-realm-impl-1.0-RC42.pom
Downloading: http://repo.maven.apache.org/maven2/org/apache/directory/fortress/fortress-realm-impl/1.0-RC42/fortress-realm-impl-1.0-RC42.pom
[WARNING] The POM for org.apache.directory.fortress:fortress-realm-impl:jar:1.0-RC42 is missing, no dependency information available
Downloading: http://repo1.maven.org/maven2/org/apache/directory/fortress/fortress-realm-impl/1.0-RC42/fortress-realm-impl-1.0-RC42.jar
Downloading: http://repo.maven.apache.org/maven2/org/apache/directory/fortress/fortress-realm-impl/1.0-RC42/fortress-realm-impl-1.0-RC42.jar
[INFO] ------------------------------------------------------------------------
[INFO] BUILD FAILURE
[INFO] ------------------------------------------------------------------------
[INFO] Total time: 16.455s
[INFO] Finished at: Mon Mar 21 09:32:43 UTC 2016
[INFO] Final Memory: 15M/246M
[INFO] ------------------------------------------------------------------------
Waiting for Jenkins to finish collecting data[ERROR] Failed to execute goal on project fortress-web: Could not resolve dependencies for project org.apache.directory.fortress:fortress-web:war:1.0-RC43-SNAPSHOT: Could not find artifact org.apache.directory.fortress:fortress-realm-impl:jar:1.0-RC42 in maven2 (http://repo1.maven.org/maven2) -> [Help 1]
[ERROR] 
[ERROR] To see the full stack trace of the errors, re-run Maven with the -e switch.
[ERROR] Re-run Maven using the -X switch to enable full debug logging.
[ERROR] 
[ERROR] For more information about the errors and possible solutions, please read the following articles:
[ERROR] [Help 1] http://cwiki.apache.org/confluence/display/MAVEN/DependencyResolutionException

[JENKINS] Archiving <https://analysis.apache.org/jenkins/job/directory-fortress-commander/ws/pom.xml> to org.apache.directory.fortress/fortress-web/1.0-RC43-SNAPSHOT/fortress-web-1.0-RC43-SNAPSHOT.pom
Sending e-mails to: notifications@directory.apache.org
channel stopped
Skipping sonar analysis due to bad build status FAILURE