You are viewing a plain text version of this content. The canonical link for it is here.
Posted to builds@cassandra.apache.org by Apache Jenkins Server <je...@builds.apache.org> on 2021/08/24 02:55:46 UTC

Build complete: Cassandra-trunk #675 [UNSTABLE] ee81d8dff43b087029fcb84d600ea0da07ad8385

-------------------------------------------------------------------------------
Build Cassandra-trunk #675 Still Unstable
URL: https://ci-cassandra.apache.org/job/Cassandra-trunk/675/
-------------------------------------------------------------------------------
Changes:
[Stefan Miklosovic] validate SASI tokenizer options before adding index to schema


-------------------------------------------------------------------------------
Failed Tests:
8 tests failed.
FAILED:  dtest.auth_test.TestAuth.test_modify_and_select_auth
FAILED:  org.apache.cassandra.distributed.upgrade.CompactStorageUpgradeTest.compactStorageHiddenColumnTest
FAILED:  junit.framework.TestSuite.org.apache.cassandra.distributed.upgrade.CompactStorageUpgradeTest
FAILED:  org.apache.cassandra.distributed.upgrade.CompactStorageUpgradeTest.compactStorageHiddenColumnTest
FAILED:  org.apache.cassandra.metrics.TableMetricsTest.testLoggedPartitionsPerBatch-compression
FAILED:  org.apache.cassandra.net.ProxyHandlerConnectionsTest.testExpireSome-compression
FAILED:  org.apache.cassandra.distributed.upgrade.MixedModeReadTest.mixedModeReadColumnSubsetDigestCheck
FAILED:  org.apache.cassandra.distributed.upgrade.CompactStorageUpgradeTest.compactStorageUpgradeTest

-------------------------------------------------------------------------------
For complete test report and logs see https://nightlies.apache.org/cassandra/Cassandra-trunk/675/