You are viewing a plain text version of this content. The canonical link for it is here.
Posted to commits@beam.apache.org by Apache Jenkins Server <je...@builds.apache.org> on 2018/06/27 12:19:52 UTC

Build failed in Jenkins: beam_PostCommit_Python_Verify #5456

See <https://builds.apache.org/job/beam_PostCommit_Python_Verify/5456/display/redirect?page=changes>

Changes:

[klk] Apply rename of JobBuilder to Samza VR job

------------------------------------------
[...truncated 1.64 MB...]
        component_coder_ids: "ref_Coder_TupleCoder_11"
        component_coder_ids: "ref_Coder_GlobalWindowCoder_3"
      }
    }
    coders {
      key: "ref_Coder_WindowedValueCoder_12"
      value {
        spec {
          spec {
            urn: "beam:coder:windowed_value:v1"
          }
        }
        component_coder_ids: "ref_Coder_TupleCoder_9"
        component_coder_ids: "ref_Coder_GlobalWindowCoder_3"
      }
    }
    coders {
      key: "ref_Coder_WindowedValueCoder_12_bytes"
      value {
        spec {
          spec {
            urn: "beam:coder:windowed_value:v1"
          }
        }
        component_coder_ids: "ref_Coder_TupleCoder_9_bytes"
        component_coder_ids: "ref_Coder_GlobalWindowCoder_3"
      }
    }
    coders {
      key: "ref_Coder_WindowedValueCoder_12_len_prefix"
      value {
        spec {
          spec {
            urn: "beam:coder:windowed_value:v1"
          }
        }
        component_coder_ids: "ref_Coder_TupleCoder_9_len_prefix"
        component_coder_ids: "ref_Coder_GlobalWindowCoder_3"
      }
    }
    coders {
      key: "ref_Coder_WindowedValueCoder_13"
      value {
        spec {
          spec {
            urn: "beam:coder:windowed_value:v1"
          }
        }
        component_coder_ids: "ref_Coder_VarIntCoder_14"
        component_coder_ids: "ref_Coder_GlobalWindowCoder_3"
      }
    }
    coders {
      key: "ref_Coder_WindowedValueCoder_15"
      value {
        spec {
          spec {
            urn: "beam:coder:windowed_value:v1"
          }
        }
        component_coder_ids: "ref_Coder_FastPrimitivesCoder_6"
        component_coder_ids: "ref_Coder_GlobalWindowCoder_3"
      }
    }
    coders {
      key: "ref_Coder_WindowedValueCoder_16"
      value {
        spec {
          spec {
            urn: "beam:coder:windowed_value:v1"
          }
        }
        component_coder_ids: "ref_Coder_TupleCoder_17"
        component_coder_ids: "ref_Coder_GlobalWindowCoder_3"
      }
    }
    coders {
      key: "ref_Coder_WindowedValueCoder_18"
      value {
        spec {
          spec {
            urn: "beam:coder:windowed_value:v1"
          }
        }
        component_coder_ids: "ref_Coder_TupleCoder_19"
        component_coder_ids: "ref_Coder_GlobalWindowCoder_3"
      }
    }
    coders {
      key: "ref_Coder_WindowedValueCoder_18_bytes"
      value {
        spec {
          spec {
            urn: "beam:coder:windowed_value:v1"
          }
        }
        component_coder_ids: "ref_Coder_TupleCoder_19_bytes"
        component_coder_ids: "ref_Coder_GlobalWindowCoder_3"
      }
    }
    coders {
      key: "ref_Coder_WindowedValueCoder_18_len_prefix"
      value {
        spec {
          spec {
            urn: "beam:coder:windowed_value:v1"
          }
        }
        component_coder_ids: "ref_Coder_TupleCoder_19_len_prefix"
        component_coder_ids: "ref_Coder_GlobalWindowCoder_3"
      }
    }
    coders {
      key: "ref_Coder_WindowedValueCoder_21"
      value {
        spec {
          spec {
            urn: "beam:coder:windowed_value:v1"
          }
        }
        component_coder_ids: "ref_Coder_TupleCoder_22"
        component_coder_ids: "ref_Coder_GlobalWindowCoder_3"
      }
    }
    coders {
      key: "ref_Coder_WindowedValueCoder_23"
      value {
        spec {
          spec {
            urn: "beam:coder:windowed_value:v1"
          }
        }
        component_coder_ids: "ref_Coder_TupleCoder_24"
        component_coder_ids: "ref_Coder_GlobalWindowCoder_3"
      }
    }
    coders {
      key: "ref_Coder_WindowedValueCoder_4"
      value {
        spec {
          spec {
            urn: "beam:coder:windowed_value:v1"
          }
        }
        component_coder_ids: "ref_Coder_TupleCoder_5"
        component_coder_ids: "ref_Coder_GlobalWindowCoder_3"
      }
    }
    coders {
      key: "ref_Coder_WindowedValueCoder_7"
      value {
        spec {
          spec {
            urn: "beam:coder:windowed_value:v1"
          }
        }
        component_coder_ids: "ref_Coder_TupleCoder_8"
        component_coder_ids: "ref_Coder_GlobalWindowCoder_3"
      }
    }
  }
}

root: DEBUG: CONTROL RESPONSE instruction_id: "control_5"
register {
}

root: DEBUG: CONTROL REQUEST instruction_id: "bundle_56"
process_bundle {
  process_bundle_descriptor_reference: "4"
}

root: INFO: start <DoOperation assert_that/Match output_tags=['out']>
root: INFO: start <DoOperation assert_that/Unkey output_tags=['out']>
root: INFO: start <DoOperation assert_that/Group/Map(_merge_tagged_vals_under_key) output_tags=['out']>
root: INFO: start <DataInputOperation assert_that/Group/GroupByKey/Read receivers=[ConsumerSet[assert_that/Group/GroupByKey/Read.out0, coder=WindowedValueCoder[TupleCoder[LengthPrefixCoder[FastPrimitivesCoder], IterableCoder[LengthPrefixCoder[FastPrimitivesCoder]]]], len(consumers)=1]]>
--------------------- >> end captured logging << ---------------------

----------------------------------------------------------------------
XML: <https://builds.apache.org/job/beam_PostCommit_Python_Verify/ws/src/sdks/python/nosetests.xml>
----------------------------------------------------------------------
Ran 1611 tests in 196.057s

FAILED (SKIP=288, errors=1)
ERROR: InvocationError for command '<https://builds.apache.org/job/beam_PostCommit_Python_Verify/ws/src/sdks/python/target/.tox/py27-cython/bin/python> setup.py nosetests' (exited with code 1)
___________________________________ summary ____________________________________
ERROR:   py27-cython: commands failed

> Task :beam-sdks-python:testCython FAILED
:beam-sdks-python:testCython (Thread[Task worker for ':',5,main]) completed. Took 5 mins 38.454 secs.

FAILURE: Build completed with 3 failures.

1: Task failed with an exception.
-----------
* Where:
Build file '<https://builds.apache.org/job/beam_PostCommit_Python_Verify/ws/src/sdks/python/build.gradle'> line: 122

* What went wrong:
Execution failed for task ':beam-sdks-python:testGcp'.
> Process 'command 'sh'' finished with non-zero exit value 1

* Try:
Run with --stacktrace option to get the stack trace. Run with --debug option to get more log output. Run with --scan to get full insights.
==============================================================================

2: Task failed with an exception.
-----------
* Where:
Build file '<https://builds.apache.org/job/beam_PostCommit_Python_Verify/ws/src/sdks/python/build.gradle'> line: 132

* What went wrong:
Execution failed for task ':beam-sdks-python:testPython'.
> Process 'command 'sh'' finished with non-zero exit value 1

* Try:
Run with --stacktrace option to get the stack trace. Run with --debug option to get more log output. Run with --scan to get full insights.
==============================================================================

3: Task failed with an exception.
-----------
* Where:
Build file '<https://builds.apache.org/job/beam_PostCommit_Python_Verify/ws/src/sdks/python/build.gradle'> line: 142

* What went wrong:
Execution failed for task ':beam-sdks-python:testCython'.
> Process 'command 'sh'' finished with non-zero exit value 1

* Try:
Run with --stacktrace option to get the stack trace. Run with --debug option to get more log output. Run with --scan to get full insights.
==============================================================================

* Get more help at https://help.gradle.org

Deprecated Gradle features were used in this build, making it incompatible with Gradle 5.0.
See https://docs.gradle.org/4.8/userguide/command_line_interface.html#sec:command_line_warnings

BUILD FAILED in 38m 40s
12 actionable tasks: 12 executed

Publishing build scan...
https://gradle.com/s/5c2v5awtpth6a

Build step 'Invoke Gradle script' changed build result to FAILURE
Build step 'Invoke Gradle script' marked build as failure
Not sending mail to unregistered user amaliujia@163.com
Not sending mail to unregistered user ekirpichov@gmail.com
Not sending mail to unregistered user xiliu@xiliu-ld1.linkedin.biz
Not sending mail to unregistered user klk@google.com

Jenkins build is back to normal : beam_PostCommit_Python_Verify #5459

Posted by Apache Jenkins Server <je...@builds.apache.org>.
See <https://builds.apache.org/job/beam_PostCommit_Python_Verify/5459/display/redirect?page=changes>


Build failed in Jenkins: beam_PostCommit_Python_Verify #5458

Posted by Apache Jenkins Server <je...@builds.apache.org>.
See <https://builds.apache.org/job/beam_PostCommit_Python_Verify/5458/display/redirect?page=changes>

Changes:

[scott] Fix ErrorProne warnings in sdks-java-core project

[scott] Enable ErrorProne analysis for all Java projects.

[scott] Enable failOnWarnings for all projects.

------------------------------------------
[...truncated 1.65 MB...]
        component_coder_ids: "ref_Coder_GlobalWindowCoder_3"
      }
    }
    coders {
      key: "ref_Coder_WindowedValueCoder_12"
      value {
        spec {
          spec {
            urn: "beam:coder:windowed_value:v1"
          }
        }
        component_coder_ids: "ref_Coder_TupleCoder_9"
        component_coder_ids: "ref_Coder_GlobalWindowCoder_3"
      }
    }
    coders {
      key: "ref_Coder_WindowedValueCoder_12_bytes"
      value {
        spec {
          spec {
            urn: "beam:coder:windowed_value:v1"
          }
        }
        component_coder_ids: "ref_Coder_TupleCoder_9_bytes"
        component_coder_ids: "ref_Coder_GlobalWindowCoder_3"
      }
    }
    coders {
      key: "ref_Coder_WindowedValueCoder_12_len_prefix"
      value {
        spec {
          spec {
            urn: "beam:coder:windowed_value:v1"
          }
        }
        component_coder_ids: "ref_Coder_TupleCoder_9_len_prefix"
        component_coder_ids: "ref_Coder_GlobalWindowCoder_3"
      }
    }
    coders {
      key: "ref_Coder_WindowedValueCoder_13"
      value {
        spec {
          spec {
            urn: "beam:coder:windowed_value:v1"
          }
        }
        component_coder_ids: "ref_Coder_VarIntCoder_14"
        component_coder_ids: "ref_Coder_GlobalWindowCoder_3"
      }
    }
    coders {
      key: "ref_Coder_WindowedValueCoder_15"
      value {
        spec {
          spec {
            urn: "beam:coder:windowed_value:v1"
          }
        }
        component_coder_ids: "ref_Coder_FastPrimitivesCoder_6"
        component_coder_ids: "ref_Coder_GlobalWindowCoder_3"
      }
    }
    coders {
      key: "ref_Coder_WindowedValueCoder_16"
      value {
        spec {
          spec {
            urn: "beam:coder:windowed_value:v1"
          }
        }
        component_coder_ids: "ref_Coder_TupleCoder_17"
        component_coder_ids: "ref_Coder_GlobalWindowCoder_3"
      }
    }
    coders {
      key: "ref_Coder_WindowedValueCoder_18"
      value {
        spec {
          spec {
            urn: "beam:coder:windowed_value:v1"
          }
        }
        component_coder_ids: "ref_Coder_TupleCoder_19"
        component_coder_ids: "ref_Coder_GlobalWindowCoder_3"
      }
    }
    coders {
      key: "ref_Coder_WindowedValueCoder_18_bytes"
      value {
        spec {
          spec {
            urn: "beam:coder:windowed_value:v1"
          }
        }
        component_coder_ids: "ref_Coder_TupleCoder_19_bytes"
        component_coder_ids: "ref_Coder_GlobalWindowCoder_3"
      }
    }
    coders {
      key: "ref_Coder_WindowedValueCoder_18_len_prefix"
      value {
        spec {
          spec {
            urn: "beam:coder:windowed_value:v1"
          }
        }
        component_coder_ids: "ref_Coder_TupleCoder_19_len_prefix"
        component_coder_ids: "ref_Coder_GlobalWindowCoder_3"
      }
    }
    coders {
      key: "ref_Coder_WindowedValueCoder_21"
      value {
        spec {
          spec {
            urn: "beam:coder:windowed_value:v1"
          }
        }
        component_coder_ids: "ref_Coder_TupleCoder_22"
        component_coder_ids: "ref_Coder_GlobalWindowCoder_3"
      }
    }
    coders {
      key: "ref_Coder_WindowedValueCoder_23"
      value {
        spec {
          spec {
            urn: "beam:coder:windowed_value:v1"
          }
        }
        component_coder_ids: "ref_Coder_TupleCoder_24"
        component_coder_ids: "ref_Coder_GlobalWindowCoder_3"
      }
    }
    coders {
      key: "ref_Coder_WindowedValueCoder_4"
      value {
        spec {
          spec {
            urn: "beam:coder:windowed_value:v1"
          }
        }
        component_coder_ids: "ref_Coder_TupleCoder_5"
        component_coder_ids: "ref_Coder_GlobalWindowCoder_3"
      }
    }
    coders {
      key: "ref_Coder_WindowedValueCoder_7"
      value {
        spec {
          spec {
            urn: "beam:coder:windowed_value:v1"
          }
        }
        component_coder_ids: "ref_Coder_TupleCoder_8"
        component_coder_ids: "ref_Coder_GlobalWindowCoder_3"
      }
    }
  }
}

root: DEBUG: CONTROL RESPONSE instruction_id: "control_5"
register {
}

root: DEBUG: CONTROL REQUEST instruction_id: "bundle_56"
process_bundle {
  process_bundle_descriptor_reference: "4"
}

root: INFO: start <DoOperation assert_that/Match output_tags=['out']>
root: INFO: start <DoOperation assert_that/Unkey output_tags=['out']>
root: INFO: start <DoOperation assert_that/Group/Map(_merge_tagged_vals_under_key) output_tags=['out']>
root: INFO: start <DataInputOperation assert_that/Group/GroupByKey/Read receivers=[ConsumerSet[assert_that/Group/GroupByKey/Read.out0, coder=WindowedValueCoder[TupleCoder[LengthPrefixCoder[FastPrimitivesCoder], IterableCoder[LengthPrefixCoder[FastPrimitivesCoder]]]], len(consumers)=1]]>
--------------------- >> end captured logging << ---------------------

----------------------------------------------------------------------
XML: <https://builds.apache.org/job/beam_PostCommit_Python_Verify/ws/src/sdks/python/nosetests.xml>
----------------------------------------------------------------------
Ran 1611 tests in 201.827s

FAILED (SKIP=288, errors=1)
ERROR: InvocationError for command '<https://builds.apache.org/job/beam_PostCommit_Python_Verify/ws/src/sdks/python/target/.tox/py27-cython/bin/python> setup.py nosetests' (exited with code 1)
___________________________________ summary ____________________________________
ERROR:   py27-cython: commands failed

> Task :beam-sdks-python:testCython FAILED
:beam-sdks-python:testCython (Thread[Task worker for ':',5,main]) completed. Took 5 mins 56.455 secs.

FAILURE: Build completed with 3 failures.

1: Task failed with an exception.
-----------
* Where:
Build file '<https://builds.apache.org/job/beam_PostCommit_Python_Verify/ws/src/sdks/python/build.gradle'> line: 122

* What went wrong:
Execution failed for task ':beam-sdks-python:testGcp'.
> Process 'command 'sh'' finished with non-zero exit value 1

* Try:
Run with --stacktrace option to get the stack trace. Run with --debug option to get more log output. Run with --scan to get full insights.
==============================================================================

2: Task failed with an exception.
-----------
* Where:
Build file '<https://builds.apache.org/job/beam_PostCommit_Python_Verify/ws/src/sdks/python/build.gradle'> line: 132

* What went wrong:
Execution failed for task ':beam-sdks-python:testPython'.
> Process 'command 'sh'' finished with non-zero exit value 1

* Try:
Run with --stacktrace option to get the stack trace. Run with --debug option to get more log output. Run with --scan to get full insights.
==============================================================================

3: Task failed with an exception.
-----------
* Where:
Build file '<https://builds.apache.org/job/beam_PostCommit_Python_Verify/ws/src/sdks/python/build.gradle'> line: 142

* What went wrong:
Execution failed for task ':beam-sdks-python:testCython'.
> Process 'command 'sh'' finished with non-zero exit value 1

* Try:
Run with --stacktrace option to get the stack trace. Run with --debug option to get more log output. Run with --scan to get full insights.
==============================================================================

* Get more help at https://help.gradle.org

Deprecated Gradle features were used in this build, making it incompatible with Gradle 5.0.
See https://docs.gradle.org/4.8/userguide/command_line_interface.html#sec:command_line_warnings

BUILD FAILED in 41m 25s
12 actionable tasks: 12 executed

Publishing build scan...
https://gradle.com/s/6sbcsja7m55ao

Stopped 1 worker daemon(s).
Build step 'Invoke Gradle script' changed build result to FAILURE
Build step 'Invoke Gradle script' marked build as failure
Not sending mail to unregistered user amaliujia@163.com
Not sending mail to unregistered user ekirpichov@gmail.com
Not sending mail to unregistered user xiliu@xiliu-ld1.linkedin.biz
Not sending mail to unregistered user klk@google.com

Build failed in Jenkins: beam_PostCommit_Python_Verify #5457

Posted by Apache Jenkins Server <je...@builds.apache.org>.
See <https://builds.apache.org/job/beam_PostCommit_Python_Verify/5457/display/redirect?page=changes>

Changes:

[iemejia] Fix maven build part 9

------------------------------------------
[...truncated 1.66 MB...]
        component_coder_ids: "ref_Coder_TupleCoder_11"
        component_coder_ids: "ref_Coder_GlobalWindowCoder_3"
      }
    }
    coders {
      key: "ref_Coder_WindowedValueCoder_12"
      value {
        spec {
          spec {
            urn: "beam:coder:windowed_value:v1"
          }
        }
        component_coder_ids: "ref_Coder_VarIntCoder_13"
        component_coder_ids: "ref_Coder_GlobalWindowCoder_3"
      }
    }
    coders {
      key: "ref_Coder_WindowedValueCoder_14"
      value {
        spec {
          spec {
            urn: "beam:coder:windowed_value:v1"
          }
        }
        component_coder_ids: "ref_Coder_TupleCoder_9"
        component_coder_ids: "ref_Coder_GlobalWindowCoder_3"
      }
    }
    coders {
      key: "ref_Coder_WindowedValueCoder_14_bytes"
      value {
        spec {
          spec {
            urn: "beam:coder:windowed_value:v1"
          }
        }
        component_coder_ids: "ref_Coder_TupleCoder_9_bytes"
        component_coder_ids: "ref_Coder_GlobalWindowCoder_3"
      }
    }
    coders {
      key: "ref_Coder_WindowedValueCoder_14_len_prefix"
      value {
        spec {
          spec {
            urn: "beam:coder:windowed_value:v1"
          }
        }
        component_coder_ids: "ref_Coder_TupleCoder_9_len_prefix"
        component_coder_ids: "ref_Coder_GlobalWindowCoder_3"
      }
    }
    coders {
      key: "ref_Coder_WindowedValueCoder_15"
      value {
        spec {
          spec {
            urn: "beam:coder:windowed_value:v1"
          }
        }
        component_coder_ids: "ref_Coder_TupleCoder_16"
        component_coder_ids: "ref_Coder_GlobalWindowCoder_3"
      }
    }
    coders {
      key: "ref_Coder_WindowedValueCoder_17"
      value {
        spec {
          spec {
            urn: "beam:coder:windowed_value:v1"
          }
        }
        component_coder_ids: "ref_Coder_FastPrimitivesCoder_6"
        component_coder_ids: "ref_Coder_GlobalWindowCoder_3"
      }
    }
    coders {
      key: "ref_Coder_WindowedValueCoder_18"
      value {
        spec {
          spec {
            urn: "beam:coder:windowed_value:v1"
          }
        }
        component_coder_ids: "ref_Coder_TupleCoder_19"
        component_coder_ids: "ref_Coder_GlobalWindowCoder_3"
      }
    }
    coders {
      key: "ref_Coder_WindowedValueCoder_20"
      value {
        spec {
          spec {
            urn: "beam:coder:windowed_value:v1"
          }
        }
        component_coder_ids: "ref_Coder_TupleCoder_21"
        component_coder_ids: "ref_Coder_GlobalWindowCoder_3"
      }
    }
    coders {
      key: "ref_Coder_WindowedValueCoder_20_bytes"
      value {
        spec {
          spec {
            urn: "beam:coder:windowed_value:v1"
          }
        }
        component_coder_ids: "ref_Coder_TupleCoder_21_bytes"
        component_coder_ids: "ref_Coder_GlobalWindowCoder_3"
      }
    }
    coders {
      key: "ref_Coder_WindowedValueCoder_20_len_prefix"
      value {
        spec {
          spec {
            urn: "beam:coder:windowed_value:v1"
          }
        }
        component_coder_ids: "ref_Coder_TupleCoder_21_len_prefix"
        component_coder_ids: "ref_Coder_GlobalWindowCoder_3"
      }
    }
    coders {
      key: "ref_Coder_WindowedValueCoder_23"
      value {
        spec {
          spec {
            urn: "beam:coder:windowed_value:v1"
          }
        }
        component_coder_ids: "ref_Coder_TupleCoder_24"
        component_coder_ids: "ref_Coder_GlobalWindowCoder_3"
      }
    }
    coders {
      key: "ref_Coder_WindowedValueCoder_4"
      value {
        spec {
          spec {
            urn: "beam:coder:windowed_value:v1"
          }
        }
        component_coder_ids: "ref_Coder_TupleCoder_5"
        component_coder_ids: "ref_Coder_GlobalWindowCoder_3"
      }
    }
    coders {
      key: "ref_Coder_WindowedValueCoder_7"
      value {
        spec {
          spec {
            urn: "beam:coder:windowed_value:v1"
          }
        }
        component_coder_ids: "ref_Coder_TupleCoder_8"
        component_coder_ids: "ref_Coder_GlobalWindowCoder_3"
      }
    }
  }
}

root: DEBUG: CONTROL RESPONSE instruction_id: "control_5"
register {
}

root: DEBUG: CONTROL REQUEST instruction_id: "bundle_56"
process_bundle {
  process_bundle_descriptor_reference: "4"
}

root: INFO: start <DoOperation assert_that/Match output_tags=['out']>
root: INFO: start <DoOperation assert_that/Unkey output_tags=['out']>
root: INFO: start <DoOperation assert_that/Group/Map(_merge_tagged_vals_under_key) output_tags=['out']>
root: INFO: start <DataInputOperation assert_that/Group/GroupByKey/Read receivers=[ConsumerSet[assert_that/Group/GroupByKey/Read.out0, coder=WindowedValueCoder[TupleCoder[LengthPrefixCoder[FastPrimitivesCoder], IterableCoder[LengthPrefixCoder[FastPrimitivesCoder]]]], len(consumers)=1]]>
--------------------- >> end captured logging << ---------------------

----------------------------------------------------------------------
XML: <https://builds.apache.org/job/beam_PostCommit_Python_Verify/ws/src/sdks/python/nosetests.xml>
----------------------------------------------------------------------
Ran 1611 tests in 209.244s

FAILED (SKIP=288, errors=1)
ERROR: InvocationError for command '<https://builds.apache.org/job/beam_PostCommit_Python_Verify/ws/src/sdks/python/target/.tox/py27-cython/bin/python> setup.py nosetests' (exited with code 1)
___________________________________ summary ____________________________________
ERROR:   py27-cython: commands failed

> Task :beam-sdks-python:testCython FAILED
:beam-sdks-python:testCython (Thread[Task worker for ':' Thread 14,5,main]) completed. Took 6 mins 12.346 secs.

FAILURE: Build completed with 3 failures.

1: Task failed with an exception.
-----------
* Where:
Build file '<https://builds.apache.org/job/beam_PostCommit_Python_Verify/ws/src/sdks/python/build.gradle'> line: 122

* What went wrong:
Execution failed for task ':beam-sdks-python:testGcp'.
> Process 'command 'sh'' finished with non-zero exit value 1

* Try:
Run with --stacktrace option to get the stack trace. Run with --debug option to get more log output. Run with --scan to get full insights.
==============================================================================

2: Task failed with an exception.
-----------
* Where:
Build file '<https://builds.apache.org/job/beam_PostCommit_Python_Verify/ws/src/sdks/python/build.gradle'> line: 132

* What went wrong:
Execution failed for task ':beam-sdks-python:testPython'.
> Process 'command 'sh'' finished with non-zero exit value 1

* Try:
Run with --stacktrace option to get the stack trace. Run with --debug option to get more log output. Run with --scan to get full insights.
==============================================================================

3: Task failed with an exception.
-----------
* Where:
Build file '<https://builds.apache.org/job/beam_PostCommit_Python_Verify/ws/src/sdks/python/build.gradle'> line: 142

* What went wrong:
Execution failed for task ':beam-sdks-python:testCython'.
> Process 'command 'sh'' finished with non-zero exit value 1

* Try:
Run with --stacktrace option to get the stack trace. Run with --debug option to get more log output. Run with --scan to get full insights.
==============================================================================

* Get more help at https://help.gradle.org

Deprecated Gradle features were used in this build, making it incompatible with Gradle 5.0.
See https://docs.gradle.org/4.8/userguide/command_line_interface.html#sec:command_line_warnings

BUILD FAILED in 40m 25s
12 actionable tasks: 12 executed

Publishing build scan...
https://gradle.com/s/vl7rxakxkd6ag

Build step 'Invoke Gradle script' changed build result to FAILURE
Build step 'Invoke Gradle script' marked build as failure
Not sending mail to unregistered user amaliujia@163.com
Not sending mail to unregistered user ekirpichov@gmail.com
Not sending mail to unregistered user xiliu@xiliu-ld1.linkedin.biz
Not sending mail to unregistered user klk@google.com