You are viewing a plain text version of this content. The canonical link for it is here.
Posted to dev@kafka.apache.org by Apache Jenkins Server <je...@builds.apache.org> on 2016/01/27 18:17:18 UTC
Build failed in Jenkins: kafka-trunk-jdk8 #322
See <https://builds.apache.org/job/kafka-trunk-jdk8/322/changes>
Changes:
[junrao] KAFKA-3152; kafka-acl doesn't allow space in principal name
------------------------------------------
Started by an SCM change
[EnvInject] - Loading node environment variables.
Building remotely on H11 (docker Ubuntu ubuntu yahoo-not-h2) in workspace <https://builds.apache.org/job/kafka-trunk-jdk8/ws/>
> git rev-parse --is-inside-work-tree # timeout=10
Fetching changes from the remote Git repository
> git config remote.origin.url https://git-wip-us.apache.org/repos/asf/kafka.git # timeout=10
Fetching upstream changes from https://git-wip-us.apache.org/repos/asf/kafka.git
> git --version # timeout=10
> git -c core.askpass=true fetch --tags --progress https://git-wip-us.apache.org/repos/asf/kafka.git +refs/heads/*:refs/remotes/origin/*
> git rev-parse refs/remotes/origin/trunk^{commit} # timeout=10
> git rev-parse refs/remotes/origin/origin/trunk^{commit} # timeout=10
Checking out Revision 523562c109b29cc5a5e56313f16f1b1ff6c5dd9c (refs/remotes/origin/trunk)
> git config core.sparsecheckout # timeout=10
> git checkout -f 523562c109b29cc5a5e56313f16f1b1ff6c5dd9c
> git rev-list 22de0a8ab5d0e84fa40016754f9a8eff8193aa89 # timeout=10
Setting JDK1_8_0_45_HOME=/home/jenkins/jenkins-slave/tools/hudson.model.JDK/jdk1.8.0_45
Setting GRADLE_2_4_RC_2_HOME=/home/jenkins/jenkins-slave/tools/hudson.plugins.gradle.GradleInstallation/Gradle_2.4-rc-2
[kafka-trunk-jdk8] $ /bin/bash -xe /tmp/hudson8849527785541476764.sh
+ /home/jenkins/jenkins-slave/tools/hudson.plugins.gradle.GradleInstallation/Gradle_2.4-rc-2/bin/gradle
To honour the JVM settings for this build a new JVM will be forked. Please consider using the daemon: http://gradle.org/docs/2.4-rc-2/userguide/gradle_daemon.html.
Building project 'core' with Scala version 2.10.6
:downloadWrapper
BUILD SUCCESSFUL
Total time: 28.856 secs
Setting JDK1_8_0_45_HOME=/home/jenkins/jenkins-slave/tools/hudson.model.JDK/jdk1.8.0_45
Setting GRADLE_2_4_RC_2_HOME=/home/jenkins/jenkins-slave/tools/hudson.plugins.gradle.GradleInstallation/Gradle_2.4-rc-2
[kafka-trunk-jdk8] $ /bin/bash -xe /tmp/hudson1099343098162977238.sh
+ export GRADLE_OPTS=-Xmx1024m
+ GRADLE_OPTS=-Xmx1024m
+ ./gradlew -Dorg.gradle.project.maxParallelForks=1 clean jarAll testAll
To honour the JVM settings for this build a new JVM will be forked. Please consider using the daemon: https://docs.gradle.org/2.10/userguide/gradle_daemon.html.
Building project 'core' with Scala version 2.10.6
:clean UP-TO-DATE
:clients:clean UP-TO-DATE
:connect:clean UP-TO-DATE
:core:clean UP-TO-DATE
:examples:clean UP-TO-DATE
:log4j-appender:clean UP-TO-DATE
:streams:clean UP-TO-DATE
:tools:clean UP-TO-DATE
:connect:api:clean UP-TO-DATE
:connect:file:clean UP-TO-DATE
:connect:json:clean UP-TO-DATE
:connect:runtime:clean UP-TO-DATE
:streams:examples:clean UP-TO-DATE
:jar_core_2_10
Building project 'core' with Scala version 2.10.6
:kafka-trunk-jdk8:clients:compileJava
:jar_core_2_10 FAILED
FAILURE: Build failed with an exception.
* What went wrong:
Failed to capture snapshot of input files for task 'compileJava' during up-to-date check. See stacktrace for details.
> Could not add entry '/home/jenkins/.gradle/caches/modules-2/files-2.1/net.jpountz.lz4/lz4/1.3.0/c708bb2590c0652a642236ef45d9f99ff842a2ce/lz4-1.3.0.jar' to cache fileHashes.bin (<https://builds.apache.org/job/kafka-trunk-jdk8/ws/.gradle/2.10/taskArtifacts/fileHashes.bin).>
* Try:
Run with --stacktrace option to get the stack trace. Run with --info or --debug option to get more log output.
BUILD FAILED
Total time: 30.963 secs
Build step 'Execute shell' marked build as failure
Recording test results
Setting JDK1_8_0_45_HOME=/home/jenkins/jenkins-slave/tools/hudson.model.JDK/jdk1.8.0_45
Setting GRADLE_2_4_RC_2_HOME=/home/jenkins/jenkins-slave/tools/hudson.plugins.gradle.GradleInstallation/Gradle_2.4-rc-2
ERROR: Publisher 'Publish JUnit test result report' failed: No test report files were found. Configuration error?
Setting JDK1_8_0_45_HOME=/home/jenkins/jenkins-slave/tools/hudson.model.JDK/jdk1.8.0_45
Setting GRADLE_2_4_RC_2_HOME=/home/jenkins/jenkins-slave/tools/hudson.plugins.gradle.GradleInstallation/Gradle_2.4-rc-2
Jenkins build is back to normal : kafka-trunk-jdk8 #327
Posted by Apache Jenkins Server <je...@builds.apache.org>.
See <https://builds.apache.org/job/kafka-trunk-jdk8/327/changes>
Build failed in Jenkins: kafka-trunk-jdk8 #326
Posted by Apache Jenkins Server <je...@builds.apache.org>.
See <https://builds.apache.org/job/kafka-trunk-jdk8/326/changes>
Changes:
[wangguoz] KAFKA-2143: fix replica offset truncate to beginning during leader
[wangguoz] KAFKA-2221: Log the real exception which triggered a reconnect
[wangguoz] MINOR: Add Rolling Upgrade Notes to Security Docs
------------------------------------------
[...truncated 4648 lines...]
kafka.log.BrokerCompressionTest > testBrokerSideCompression[0] PASSED
kafka.log.BrokerCompressionTest > testBrokerSideCompression[1] PASSED
kafka.log.BrokerCompressionTest > testBrokerSideCompression[2] PASSED
kafka.log.BrokerCompressionTest > testBrokerSideCompression[3] PASSED
kafka.log.BrokerCompressionTest > testBrokerSideCompression[4] PASSED
kafka.log.BrokerCompressionTest > testBrokerSideCompression[5] PASSED
kafka.log.BrokerCompressionTest > testBrokerSideCompression[6] PASSED
kafka.log.BrokerCompressionTest > testBrokerSideCompression[7] PASSED
kafka.log.BrokerCompressionTest > testBrokerSideCompression[8] PASSED
kafka.log.BrokerCompressionTest > testBrokerSideCompression[9] PASSED
kafka.log.BrokerCompressionTest > testBrokerSideCompression[10] PASSED
kafka.log.BrokerCompressionTest > testBrokerSideCompression[11] PASSED
kafka.log.BrokerCompressionTest > testBrokerSideCompression[12] PASSED
kafka.log.BrokerCompressionTest > testBrokerSideCompression[13] PASSED
kafka.log.BrokerCompressionTest > testBrokerSideCompression[14] PASSED
kafka.log.BrokerCompressionTest > testBrokerSideCompression[15] PASSED
kafka.log.BrokerCompressionTest > testBrokerSideCompression[16] PASSED
kafka.log.BrokerCompressionTest > testBrokerSideCompression[17] PASSED
kafka.log.BrokerCompressionTest > testBrokerSideCompression[18] PASSED
kafka.log.BrokerCompressionTest > testBrokerSideCompression[19] PASSED
kafka.log.OffsetMapTest > testClear PASSED
kafka.log.OffsetMapTest > testBasicValidation PASSED
kafka.log.LogManagerTest > testCleanupSegmentsToMaintainSize PASSED
kafka.log.LogManagerTest > testRecoveryDirectoryMappingWithRelativeDirectory PASSED
kafka.log.LogManagerTest > testGetNonExistentLog PASSED
kafka.log.LogManagerTest > testTwoLogManagersUsingSameDirFails PASSED
kafka.log.LogManagerTest > testLeastLoadedAssignment PASSED
kafka.log.LogManagerTest > testCleanupExpiredSegments PASSED
kafka.log.LogManagerTest > testCheckpointRecoveryPoints PASSED
kafka.log.LogManagerTest > testTimeBasedFlush PASSED
kafka.log.LogManagerTest > testCreateLog PASSED
kafka.log.LogManagerTest > testRecoveryDirectoryMappingWithTrailingSlash PASSED
kafka.log.LogSegmentTest > testRecoveryWithCorruptMessage PASSED
kafka.log.LogSegmentTest > testRecoveryFixesCorruptIndex PASSED
kafka.log.LogSegmentTest > testReadFromGap PASSED
kafka.log.LogSegmentTest > testTruncate PASSED
kafka.log.LogSegmentTest > testReadBeforeFirstOffset PASSED
kafka.log.LogSegmentTest > testCreateWithInitFileSizeAppendMessage PASSED
kafka.log.LogSegmentTest > testChangeFileSuffixes PASSED
kafka.log.LogSegmentTest > testMaxOffset PASSED
kafka.log.LogSegmentTest > testNextOffsetCalculation PASSED
kafka.log.LogSegmentTest > testReadOnEmptySegment PASSED
kafka.log.LogSegmentTest > testReadAfterLast PASSED
kafka.log.LogSegmentTest > testCreateWithInitFileSizeClearShutdown PASSED
kafka.log.LogSegmentTest > testTruncateFull PASSED
kafka.log.FileMessageSetTest > testTruncate PASSED
kafka.log.FileMessageSetTest > testIterationOverPartialAndTruncation PASSED
kafka.log.FileMessageSetTest > testRead PASSED
kafka.log.FileMessageSetTest > testFileSize PASSED
kafka.log.FileMessageSetTest > testIteratorWithLimits PASSED
kafka.log.FileMessageSetTest > testPreallocateTrue PASSED
kafka.log.FileMessageSetTest > testIteratorIsConsistent PASSED
kafka.log.FileMessageSetTest > testIterationDoesntChangePosition PASSED
kafka.log.FileMessageSetTest > testWrittenEqualsRead PASSED
kafka.log.FileMessageSetTest > testWriteTo PASSED
kafka.log.FileMessageSetTest > testPreallocateFalse PASSED
kafka.log.FileMessageSetTest > testPreallocateClearShutdown PASSED
kafka.log.FileMessageSetTest > testSearch PASSED
kafka.log.FileMessageSetTest > testSizeInBytes PASSED
kafka.log.LogCleanerIntegrationTest > cleanerTest[0] PASSED
kafka.log.LogCleanerIntegrationTest > cleanerTest[1] PASSED
kafka.log.LogCleanerIntegrationTest > cleanerTest[2] PASSED
kafka.log.LogCleanerIntegrationTest > cleanerTest[3] PASSED
kafka.log.LogTest > testParseTopicPartitionNameForMissingTopic PASSED
kafka.log.LogTest > testIndexRebuild PASSED
kafka.log.LogTest > testLogRolls PASSED
kafka.log.LogTest > testMessageSizeCheck PASSED
kafka.log.LogTest > testAsyncDelete PASSED
kafka.log.LogTest > testReadOutOfRange PASSED
kafka.log.LogTest > testReadAtLogGap PASSED
kafka.log.LogTest > testTimeBasedLogRoll PASSED
kafka.log.LogTest > testLoadEmptyLog PASSED
kafka.log.LogTest > testMessageSetSizeCheck PASSED
kafka.log.LogTest > testIndexResizingAtTruncation PASSED
kafka.log.LogTest > testCompactedTopicConstraints PASSED
kafka.log.LogTest > testThatGarbageCollectingSegmentsDoesntChangeOffset PASSED
kafka.log.LogTest > testAppendAndReadWithSequentialOffsets PASSED
kafka.log.LogTest > testParseTopicPartitionNameForNull PASSED
kafka.log.LogTest > testAppendAndReadWithNonSequentialOffsets PASSED
kafka.log.LogTest > testParseTopicPartitionNameForMissingSeparator PASSED
kafka.log.LogTest > testCorruptIndexRebuild PASSED
kafka.log.LogTest > testBogusIndexSegmentsAreRemoved PASSED
kafka.log.LogTest > testCompressedMessages PASSED
kafka.log.LogTest > testAppendMessageWithNullPayload PASSED
kafka.log.LogTest > testCorruptLog PASSED
kafka.log.LogTest > testLogRecoversToCorrectOffset PASSED
kafka.log.LogTest > testReopenThenTruncate PASSED
kafka.log.LogTest > testParseTopicPartitionNameForMissingPartition PASSED
kafka.log.LogTest > testParseTopicPartitionNameForEmptyName PASSED
kafka.log.LogTest > testOpenDeletesObsoleteFiles PASSED
kafka.log.LogTest > testSizeBasedLogRoll PASSED
kafka.log.LogTest > testTimeBasedLogRollJitter PASSED
kafka.log.LogTest > testParseTopicPartitionName PASSED
kafka.log.LogTest > testTruncateTo PASSED
kafka.log.LogTest > testCleanShutdownFile PASSED
kafka.log.LogConfigTest > testFromPropsEmpty PASSED
kafka.log.LogConfigTest > testKafkaConfigToProps PASSED
kafka.log.LogConfigTest > testFromPropsInvalid PASSED
kafka.log.CleanerTest > testBuildOffsetMap PASSED
kafka.log.CleanerTest > testSegmentGrouping PASSED
kafka.log.CleanerTest > testCleanSegmentsWithAbort PASSED
kafka.log.CleanerTest > testSegmentGroupingWithSparseOffsets PASSED
kafka.log.CleanerTest > testRecoveryAfterCrash PASSED
kafka.log.CleanerTest > testLogToClean PASSED
kafka.log.CleanerTest > testCleaningWithDeletes PASSED
kafka.log.CleanerTest > testCleanSegments PASSED
kafka.log.CleanerTest > testCleaningWithUnkeyedMessages PASSED
kafka.log.OffsetIndexTest > lookupExtremeCases PASSED
kafka.log.OffsetIndexTest > appendTooMany PASSED
kafka.log.OffsetIndexTest > randomLookupTest PASSED
kafka.log.OffsetIndexTest > testReopen PASSED
kafka.log.OffsetIndexTest > appendOutOfOrder PASSED
kafka.log.OffsetIndexTest > truncate PASSED
654 tests completed, 1 failed
:kafka-trunk-jdk8:core:test FAILED
:test_core_2_11 FAILED
FAILURE: Build failed with an exception.
* What went wrong:
Execution failed for task ':core:test'.
> There were failing tests. See the report at: file://<https://builds.apache.org/job/kafka-trunk-jdk8/ws/core/build/reports/tests/index.html>
* Try:
Run with --stacktrace option to get the stack trace. Run with --info or --debug option to get more log output.
BUILD FAILED
Total time: 1 hrs 5 mins 47.357 secs
Build step 'Execute shell' marked build as failure
Recording test results
Setting JDK1_8_0_45_HOME=/jenkins/tools/hudson.model.JDK/jdk1.8.0_45
Setting GRADLE_2_4_RC_2_HOME=/jenkins/tools/hudson.plugins.gradle.GradleInstallation/Gradle_2.4-rc-2
Setting JDK1_8_0_45_HOME=/jenkins/tools/hudson.model.JDK/jdk1.8.0_45
Setting GRADLE_2_4_RC_2_HOME=/jenkins/tools/hudson.plugins.gradle.GradleInstallation/Gradle_2.4-rc-2
Build failed in Jenkins: kafka-trunk-jdk8 #325
Posted by Apache Jenkins Server <je...@builds.apache.org>.
See <https://builds.apache.org/job/kafka-trunk-jdk8/325/changes>
Changes:
[wangguoz] MINOR: Fix mis-spell in ConsumerConfig.scala
------------------------------------------
[...truncated 82 lines...]
/x1/jenkins/jenkins-slave/workspace/kafka-trunk-jdk8/core/src/main/scala/kafka/server/KafkaServer.scala:305: a pure expression does nothing in statement position; you may be omitting necessary parentheses
ControllerStats.leaderElectionTimer
^
/x1/jenkins/jenkins-slave/workspace/kafka-trunk-jdk8/core/src/main/scala/kafka/controller/ControllerChannelManager.scala:389: class BrokerEndPoint in object UpdateMetadataRequest is deprecated: see corresponding Javadoc for more information.
new UpdateMetadataRequest.BrokerEndPoint(brokerEndPoint.id, brokerEndPoint.host, brokerEndPoint.port)
^
/x1/jenkins/jenkins-slave/workspace/kafka-trunk-jdk8/core/src/main/scala/kafka/controller/ControllerChannelManager.scala:391: constructor UpdateMetadataRequest in class UpdateMetadataRequest is deprecated: see corresponding Javadoc for more information.
new UpdateMetadataRequest(controllerId, controllerEpoch, liveBrokers.asJava, partitionStates.asJava)
^
/x1/jenkins/jenkins-slave/workspace/kafka-trunk-jdk8/core/src/main/scala/kafka/network/BlockingChannel.scala:129: method readFromReadableChannel in class NetworkReceive is deprecated: see corresponding Javadoc for more information.
response.readFromReadableChannel(channel)
^
there were 15 feature warning(s); re-run with -feature for details
11 warnings found
warning: [options] bootstrap class path not set in conjunction with -source 1.7
1 warning
:kafka-trunk-jdk8:core:processResources UP-TO-DATE
:kafka-trunk-jdk8:core:classes
:kafka-trunk-jdk8:clients:compileTestJavawarning: [options] bootstrap class path not set in conjunction with -source 1.7
Note: /x1/jenkins/jenkins-slave/workspace/kafka-trunk-jdk8/clients/src/test/java/org/apache/kafka/common/requests/RequestResponseTest.java uses or overrides a deprecated API.
Note: Recompile with -Xlint:deprecation for details.
1 warning
:kafka-trunk-jdk8:clients:processTestResources
:kafka-trunk-jdk8:clients:testClasses
:kafka-trunk-jdk8:core:copyDependantLibs
:kafka-trunk-jdk8:core:copyDependantTestLibs
:kafka-trunk-jdk8:core:jar
:jar_core_2_11
Building project 'core' with Scala version 2.11.7
:kafka-trunk-jdk8:clients:compileJava UP-TO-DATE
:kafka-trunk-jdk8:clients:processResources UP-TO-DATE
:kafka-trunk-jdk8:clients:classes UP-TO-DATE
:kafka-trunk-jdk8:clients:determineCommitId UP-TO-DATE
:kafka-trunk-jdk8:clients:createVersionFile
:kafka-trunk-jdk8:clients:jar UP-TO-DATE
:kafka-trunk-jdk8:core:compileJava UP-TO-DATE
:kafka-trunk-jdk8:core:compileScalaJava HotSpot(TM) 64-Bit Server VM warning: ignoring option MaxPermSize=512m; support was removed in 8.0
/x1/jenkins/jenkins-slave/workspace/kafka-trunk-jdk8/core/src/main/scala/kafka/api/OffsetCommitRequest.scala:79: value DEFAULT_TIMESTAMP in object OffsetCommitRequest is deprecated: see corresponding Javadoc for more information.
org.apache.kafka.common.requests.OffsetCommitRequest.DEFAULT_TIMESTAMP
^
/x1/jenkins/jenkins-slave/workspace/kafka-trunk-jdk8/core/src/main/scala/kafka/common/OffsetMetadataAndError.scala:36: value DEFAULT_TIMESTAMP in object OffsetCommitRequest is deprecated: see corresponding Javadoc for more information.
commitTimestamp: Long = org.apache.kafka.common.requests.OffsetCommitRequest.DEFAULT_TIMESTAMP,
^
/x1/jenkins/jenkins-slave/workspace/kafka-trunk-jdk8/core/src/main/scala/kafka/common/OffsetMetadataAndError.scala:37: value DEFAULT_TIMESTAMP in object OffsetCommitRequest is deprecated: see corresponding Javadoc for more information.
expireTimestamp: Long = org.apache.kafka.common.requests.OffsetCommitRequest.DEFAULT_TIMESTAMP) {
^
/x1/jenkins/jenkins-slave/workspace/kafka-trunk-jdk8/core/src/main/scala/kafka/coordinator/GroupMetadataManager.scala:395: value DEFAULT_TIMESTAMP in object OffsetCommitRequest is deprecated: see corresponding Javadoc for more information.
if (value.expireTimestamp == org.apache.kafka.common.requests.OffsetCommitRequest.DEFAULT_TIMESTAMP)
^
/x1/jenkins/jenkins-slave/workspace/kafka-trunk-jdk8/core/src/main/scala/kafka/server/KafkaApis.scala:293: value DEFAULT_TIMESTAMP in object OffsetCommitRequest is deprecated: see corresponding Javadoc for more information.
if (offsetAndMetadata.commitTimestamp == org.apache.kafka.common.requests.OffsetCommitRequest.DEFAULT_TIMESTAMP)
^
/x1/jenkins/jenkins-slave/workspace/kafka-trunk-jdk8/core/src/main/scala/kafka/server/KafkaServer.scala:304: a pure expression does nothing in statement position; you may be omitting necessary parentheses
ControllerStats.uncleanLeaderElectionRate
^
/x1/jenkins/jenkins-slave/workspace/kafka-trunk-jdk8/core/src/main/scala/kafka/server/KafkaServer.scala:305: a pure expression does nothing in statement position; you may be omitting necessary parentheses
ControllerStats.leaderElectionTimer
^
/x1/jenkins/jenkins-slave/workspace/kafka-trunk-jdk8/core/src/main/scala/kafka/admin/AclCommand.scala:245: method readLine in class DeprecatedConsole is deprecated: Use the method in scala.io.StdIn
Console.readLine().equalsIgnoreCase("y")
^
/x1/jenkins/jenkins-slave/workspace/kafka-trunk-jdk8/core/src/main/scala/kafka/admin/TopicCommand.scala:366: method readLine in class DeprecatedConsole is deprecated: Use the method in scala.io.StdIn
if (!Console.readLine().equalsIgnoreCase("y")) {
^
/x1/jenkins/jenkins-slave/workspace/kafka-trunk-jdk8/core/src/main/scala/kafka/controller/ControllerChannelManager.scala:389: class BrokerEndPoint in object UpdateMetadataRequest is deprecated: see corresponding Javadoc for more information.
new UpdateMetadataRequest.BrokerEndPoint(brokerEndPoint.id, brokerEndPoint.host, brokerEndPoint.port)
^
/x1/jenkins/jenkins-slave/workspace/kafka-trunk-jdk8/core/src/main/scala/kafka/controller/ControllerChannelManager.scala:391: constructor UpdateMetadataRequest in class UpdateMetadataRequest is deprecated: see corresponding Javadoc for more information.
new UpdateMetadataRequest(controllerId, controllerEpoch, liveBrokers.asJava, partitionStates.asJava)
^
/x1/jenkins/jenkins-slave/workspace/kafka-trunk-jdk8/core/src/main/scala/kafka/network/BlockingChannel.scala:129: method readFromReadableChannel in class NetworkReceive is deprecated: see corresponding Javadoc for more information.
response.readFromReadableChannel(channel)
^
there were 15 feature warnings; re-run with -feature for details
13 warnings found
warning: [options] bootstrap class path not set in conjunction with -source 1.7
1 warning
:kafka-trunk-jdk8:core:processResources UP-TO-DATE
:kafka-trunk-jdk8:core:classes
:kafka-trunk-jdk8:clients:compileTestJava UP-TO-DATE
:kafka-trunk-jdk8:clients:processTestResources UP-TO-DATE
:kafka-trunk-jdk8:clients:testClasses UP-TO-DATE
:kafka-trunk-jdk8:core:copyDependantLibs
:kafka-trunk-jdk8:core:copyDependantTestLibs
:kafka-trunk-jdk8:core:jar
:clients:compileJava UP-TO-DATE
:clients:processResources UP-TO-DATE
:clients:classes UP-TO-DATE
:clients:determineCommitId UP-TO-DATE
:clients:createVersionFile
:clients:jar UP-TO-DATE
:core:compileJava UP-TO-DATE
:core:compileScalaJava HotSpot(TM) 64-Bit Server VM warning: ignoring option MaxPermSize=512m; support was removed in 8.0
/x1/jenkins/jenkins-slave/workspace/kafka-trunk-jdk8/core/src/main/scala/kafka/api/OffsetCommitRequest.scala:79: value DEFAULT_TIMESTAMP in object OffsetCommitRequest is deprecated: see corresponding Javadoc for more information.
org.apache.kafka.common.requests.OffsetCommitRequest.DEFAULT_TIMESTAMP
^
/x1/jenkins/jenkins-slave/workspace/kafka-trunk-jdk8/core/src/main/scala/kafka/common/OffsetMetadataAndError.scala:36: value DEFAULT_TIMESTAMP in object OffsetCommitRequest is deprecated: see corresponding Javadoc for more information.
commitTimestamp: Long = org.apache.kafka.common.requests.OffsetCommitRequest.DEFAULT_TIMESTAMP,
^
/x1/jenkins/jenkins-slave/workspace/kafka-trunk-jdk8/core/src/main/scala/kafka/common/OffsetMetadataAndError.scala:37: value DEFAULT_TIMESTAMP in object OffsetCommitRequest is deprecated: see corresponding Javadoc for more information.
expireTimestamp: Long = org.apache.kafka.common.requests.OffsetCommitRequest.DEFAULT_TIMESTAMP) {
^
/x1/jenkins/jenkins-slave/workspace/kafka-trunk-jdk8/core/src/main/scala/kafka/coordinator/GroupMetadataManager.scala:395: value DEFAULT_TIMESTAMP in object OffsetCommitRequest is deprecated: see corresponding Javadoc for more information.
if (value.expireTimestamp == org.apache.kafka.common.requests.OffsetCommitRequest.DEFAULT_TIMESTAMP)
^
/x1/jenkins/jenkins-slave/workspace/kafka-trunk-jdk8/core/src/main/scala/kafka/server/KafkaApis.scala:293: value DEFAULT_TIMESTAMP in object OffsetCommitRequest is deprecated: see corresponding Javadoc for more information.
if (offsetAndMetadata.commitTimestamp == org.apache.kafka.common.requests.OffsetCommitRequest.DEFAULT_TIMESTAMP)
^
/x1/jenkins/jenkins-slave/workspace/kafka-trunk-jdk8/core/src/main/scala/kafka/server/KafkaServer.scala:304: a pure expression does nothing in statement position; you may be omitting necessary parentheses
ControllerStats.uncleanLeaderElectionRate
^
/x1/jenkins/jenkins-slave/workspace/kafka-trunk-jdk8/core/src/main/scala/kafka/server/KafkaServer.scala:305: a pure expression does nothing in statement position; you may be omitting necessary parentheses
ControllerStats.leaderElectionTimer
^
/x1/jenkins/jenkins-slave/workspace/kafka-trunk-jdk8/core/src/main/scala/kafka/controller/ControllerChannelManager.scala:389: class BrokerEndPoint in object UpdateMetadataRequest is deprecated: see corresponding Javadoc for more information.
new UpdateMetadataRequest.BrokerEndPoint(brokerEndPoint.id, brokerEndPoint.host, brokerEndPoint.port)
^
/x1/jenkins/jenkins-slave/workspace/kafka-trunk-jdk8/core/src/main/scala/kafka/controller/ControllerChannelManager.scala:391: constructor UpdateMetadataRequest in class UpdateMetadataRequest is deprecated: see corresponding Javadoc for more information.
new UpdateMetadataRequest(controllerId, controllerEpoch, liveBrokers.asJava, partitionStates.asJava)
^
/x1/jenkins/jenkins-slave/workspace/kafka-trunk-jdk8/core/src/main/scala/kafka/network/BlockingChannel.scala:129: method readFromReadableChannel in class NetworkReceive is deprecated: see corresponding Javadoc for more information.
response.readFromReadableChannel(channel)
^
there were 15 feature warning(s); re-run with -feature for details
11 warnings found
warning: [options] bootstrap class path not set in conjunction with -source 1.7
1 warning
:core:processResources UP-TO-DATE
:core:classes
:clients:compileTestJava UP-TO-DATE
:clients:processTestResources UP-TO-DATE
:clients:testClasses UP-TO-DATE
:core:copyDependantLibs UP-TO-DATE
:core:copyDependantTestLibs
:core:jar UP-TO-DATE
:examples:compileJavawarning: [options] bootstrap class path not set in conjunction with -source 1.7
1 warning
:examples:processResources UP-TO-DATE
:examples:classes
:examples:jar
:log4j-appender:compileJavawarning: [options] bootstrap class path not set in conjunction with -source 1.7
1 warning
:log4j-appender:processResources UP-TO-DATE
:log4j-appender:classes
:log4j-appender:jar
:connect:api:compileJavawarning: [options] bootstrap class path not set in conjunction with -source 1.7
Note: /x1/jenkins/jenkins-slave/workspace/kafka-trunk-jdk8/connect/api/src/main/java/org/apache/kafka/connect/data/Struct.java uses unchecked or unsafe operations.
Note: Recompile with -Xlint:unchecked for details.
1 warning
:connect:api:processResources UP-TO-DATE
:connect:api:classes
:connect:api:copyDependantLibs
:connect:api:jar
:connect:json:compileJavawarning: [options] bootstrap class path not set in conjunction with -source 1.7
Note: /x1/jenkins/jenkins-slave/workspace/kafka-trunk-jdk8/connect/json/src/main/java/org/apache/kafka/connect/json/JsonConverter.java uses or overrides a deprecated API.
Note: Recompile with -Xlint:deprecation for details.
1 warning
:connect:json:processResources UP-TO-DATE
:connect:json:classes
:connect:json:copyDependantLibs
:connect:json:jar
:streams:compileJavawarning: [options] bootstrap class path not set in conjunction with -source 1.7
Note: Some input files use unchecked or unsafe operations.
Note: Recompile with -Xlint:unchecked for details.
1 warning
:streams:processResources UP-TO-DATE
:streams:classes
:streams:copyDependantLibs
:streams:jar
:tools:compileJavawarning: [options] bootstrap class path not set in conjunction with -source 1.7
1 warning
:tools:processResources UP-TO-DATE
:tools:classes
:tools:copyDependantLibs
:tools:jar
:connect:file:compileJavawarning: [options] bootstrap class path not set in conjunction with -source 1.7
1 warning
:connect:file:processResources UP-TO-DATE
:connect:file:classes
:connect:file:copyDependantLibs
:connect:file:jar
:connect:runtime:compileJavawarning: [options] bootstrap class path not set in conjunction with -source 1.7
Note: Some input files use unchecked or unsafe operations.
Note: Recompile with -Xlint:unchecked for details.
1 warning
:connect:runtime:processResources UP-TO-DATE
:connect:runtime:classes
:connect:runtime:copyDependantLibs
:connect:runtime:jar
:jarAll
:test_core_2_10
Building project 'core' with Scala version 2.10.6
:kafka-trunk-jdk8:clients:compileJava UP-TO-DATE
:kafka-trunk-jdk8:clients:processResources UP-TO-DATE
:kafka-trunk-jdk8:clients:classes UP-TO-DATE
:kafka-trunk-jdk8:clients:determineCommitId UP-TO-DATE
:kafka-trunk-jdk8:clients:createVersionFile
:kafka-trunk-jdk8:clients:jar UP-TO-DATE
:kafka-trunk-jdk8:clients:compileTestJava UP-TO-DATE
:kafka-trunk-jdk8:clients:processTestResources UP-TO-DATE
:kafka-trunk-jdk8:clients:testClasses UP-TO-DATE
:kafka-trunk-jdk8:core:compileJava UP-TO-DATE
:kafka-trunk-jdk8:core:compileScala UP-TO-DATE
:kafka-trunk-jdk8:core:processResources UP-TO-DATE
:kafka-trunk-jdk8:core:classes UP-TO-DATE
:kafka-trunk-jdk8:core:checkstyleMain
:kafka-trunk-jdk8:core:compileTestJava UP-TO-DATE
:kafka-trunk-jdk8:core:compileTestScalaJava HotSpot(TM) 64-Bit Server VM warning: ignoring option MaxPermSize=512m; support was removed in 8.0
/x1/jenkins/jenkins-slave/workspace/kafka-trunk-jdk8/core/src/test/scala/integration/kafka/api/QuotasTest.scala:74: value BLOCK_ON_BUFFER_FULL_CONFIG in object ProducerConfig is deprecated: see corresponding Javadoc for more information.
producerProps.put(ProducerConfig.BLOCK_ON_BUFFER_FULL_CONFIG, "false")
^
/x1/jenkins/jenkins-slave/workspace/kafka-trunk-jdk8/core/src/test/scala/kafka/tools/TestLogCleaning.scala:250: value BLOCK_ON_BUFFER_FULL_CONFIG in object ProducerConfig is deprecated: see corresponding Javadoc for more information.
producerProps.setProperty(ProducerConfig.BLOCK_ON_BUFFER_FULL_CONFIG, "true")
^
there were 4 feature warning(s); re-run with -feature for details
three warnings found
:kafka-trunk-jdk8:core:processTestResources
:test_core_2_10 FAILED
FAILURE: Build failed with an exception.
* What went wrong:
org.gradle.api.internal.changedetection.state.DefaultFileCollectionSnapshotter$FileCollectionSnapshotImpl cannot be cast to org.gradle.api.internal.changedetection.state.OutputFilesCollectionSnapshotter$OutputFilesSnapshot
* Try:
Run with --stacktrace option to get the stack trace. Run with --info or --debug option to get more log output.
BUILD FAILED
Total time: 11 mins 26.23 secs
Build step 'Execute shell' marked build as failure
Recording test results
Setting JDK1_8_0_45_HOME=/home/jenkins/jenkins-slave/tools/hudson.model.JDK/jdk1.8.0_45
Setting GRADLE_2_4_RC_2_HOME=/home/jenkins/jenkins-slave/tools/hudson.plugins.gradle.GradleInstallation/Gradle_2.4-rc-2
ERROR: Publisher 'Publish JUnit test result report' failed: No test report files were found. Configuration error?
Setting JDK1_8_0_45_HOME=/home/jenkins/jenkins-slave/tools/hudson.model.JDK/jdk1.8.0_45
Setting GRADLE_2_4_RC_2_HOME=/home/jenkins/jenkins-slave/tools/hudson.plugins.gradle.GradleInstallation/Gradle_2.4-rc-2
Build failed in Jenkins: kafka-trunk-jdk8 #324
Posted by Apache Jenkins Server <je...@builds.apache.org>.
See <https://builds.apache.org/job/kafka-trunk-jdk8/324/changes>
Changes:
[wangguoz] KAFKA-3103; Fix transient Failure in
------------------------------------------
Started by an SCM change
[EnvInject] - Loading node environment variables.
Building remotely on ubuntu-2 (docker Ubuntu ubuntu yahoo-not-h2) in workspace <https://builds.apache.org/job/kafka-trunk-jdk8/ws/>
> git rev-parse --is-inside-work-tree # timeout=10
Fetching changes from the remote Git repository
> git config remote.origin.url https://git-wip-us.apache.org/repos/asf/kafka.git # timeout=10
Fetching upstream changes from https://git-wip-us.apache.org/repos/asf/kafka.git
> git --version # timeout=10
> git -c core.askpass=true fetch --tags --progress https://git-wip-us.apache.org/repos/asf/kafka.git +refs/heads/*:refs/remotes/origin/*
> git rev-parse refs/remotes/origin/trunk^{commit} # timeout=10
> git rev-parse refs/remotes/origin/origin/trunk^{commit} # timeout=10
Checking out Revision 9ce595d130c39ce83030e81765702697920dfcfa (refs/remotes/origin/trunk)
> git config core.sparsecheckout # timeout=10
> git checkout -f 9ce595d130c39ce83030e81765702697920dfcfa
> git rev-list a40a2a260a8ddde8651dd8278bf70da7c67b2c1d # timeout=10
Setting JDK1_8_0_45_HOME=/home/jenkins/jenkins-slave/tools/hudson.model.JDK/jdk1.8.0_45
Setting GRADLE_2_4_RC_2_HOME=/home/jenkins/jenkins-slave/tools/hudson.plugins.gradle.GradleInstallation/Gradle_2.4-rc-2
[kafka-trunk-jdk8] $ /bin/bash -xe /tmp/hudson4363201639265259686.sh
+ /home/jenkins/jenkins-slave/tools/hudson.plugins.gradle.GradleInstallation/Gradle_2.4-rc-2/bin/gradle
To honour the JVM settings for this build a new JVM will be forked. Please consider using the daemon: http://gradle.org/docs/2.4-rc-2/userguide/gradle_daemon.html.
Building project 'core' with Scala version 2.10.6
:downloadWrapper
BUILD SUCCESSFUL
Total time: 9.438 secs
Setting JDK1_8_0_45_HOME=/home/jenkins/jenkins-slave/tools/hudson.model.JDK/jdk1.8.0_45
Setting GRADLE_2_4_RC_2_HOME=/home/jenkins/jenkins-slave/tools/hudson.plugins.gradle.GradleInstallation/Gradle_2.4-rc-2
[kafka-trunk-jdk8] $ /bin/bash -xe /tmp/hudson5508586029781354287.sh
+ export GRADLE_OPTS=-Xmx1024m
+ GRADLE_OPTS=-Xmx1024m
+ ./gradlew -Dorg.gradle.project.maxParallelForks=1 clean jarAll testAll
To honour the JVM settings for this build a new JVM will be forked. Please consider using the daemon: https://docs.gradle.org/2.10/userguide/gradle_daemon.html.
Building project 'core' with Scala version 2.10.6
:clean UP-TO-DATE
:clients:clean UP-TO-DATE
:connect:clean UP-TO-DATE
:core:clean UP-TO-DATE
:examples:clean UP-TO-DATE
:log4j-appender:clean UP-TO-DATE
:streams:clean UP-TO-DATE
:tools:clean UP-TO-DATE
:connect:api:clean UP-TO-DATE
:connect:file:clean UP-TO-DATE
:connect:json:clean UP-TO-DATE
:connect:runtime:clean UP-TO-DATE
:streams:examples:clean UP-TO-DATE
:jar_core_2_10
Building project 'core' with Scala version 2.10.6
:kafka-trunk-jdk8:clients:compileJava
:jar_core_2_10 FAILED
FAILURE: Build failed with an exception.
* What went wrong:
Failed to capture snapshot of input files for task 'compileJava' during up-to-date check. See stacktrace for details.
> Could not add entry '/home/jenkins/.gradle/caches/modules-2/files-2.1/net.jpountz.lz4/lz4/1.3.0/c708bb2590c0652a642236ef45d9f99ff842a2ce/lz4-1.3.0.jar' to cache fileHashes.bin (<https://builds.apache.org/job/kafka-trunk-jdk8/ws/.gradle/2.10/taskArtifacts/fileHashes.bin).>
* Try:
Run with --stacktrace option to get the stack trace. Run with --info or --debug option to get more log output.
BUILD FAILED
Total time: 11.11 secs
Build step 'Execute shell' marked build as failure
Recording test results
Setting JDK1_8_0_45_HOME=/home/jenkins/jenkins-slave/tools/hudson.model.JDK/jdk1.8.0_45
Setting GRADLE_2_4_RC_2_HOME=/home/jenkins/jenkins-slave/tools/hudson.plugins.gradle.GradleInstallation/Gradle_2.4-rc-2
ERROR: Publisher 'Publish JUnit test result report' failed: No test report files were found. Configuration error?
Setting JDK1_8_0_45_HOME=/home/jenkins/jenkins-slave/tools/hudson.model.JDK/jdk1.8.0_45
Setting GRADLE_2_4_RC_2_HOME=/home/jenkins/jenkins-slave/tools/hudson.plugins.gradle.GradleInstallation/Gradle_2.4-rc-2
Build failed in Jenkins: kafka-trunk-jdk8 #323
Posted by Apache Jenkins Server <je...@builds.apache.org>.
See <https://builds.apache.org/job/kafka-trunk-jdk8/323/changes>
Changes:
[wangguoz] MINOR: Fix syntax used for comment in JAAS config file
------------------------------------------
[...truncated 6712 lines...]
org.apache.kafka.connect.runtime.rest.resources.ConnectorsResourceTest > testGetConnectorTaskConfigsConnectorNotFound PASSED
org.apache.kafka.connect.runtime.rest.resources.ConnectorsResourceTest > testPutConnectorTaskConfigs PASSED
org.apache.kafka.connect.runtime.rest.resources.ConnectorsResourceTest > testPutConnectorTaskConfigsConnectorNotFound PASSED
org.apache.kafka.connect.runtime.rest.resources.ConnectorsResourceTest > testPutConnectorConfig PASSED
org.apache.kafka.connect.runtime.rest.resources.ConnectorsResourceTest > testCreateConnector PASSED
org.apache.kafka.connect.util.ShutdownableThreadTest > testGracefulShutdown PASSED
org.apache.kafka.connect.util.ShutdownableThreadTest > testForcibleShutdown PASSED
org.apache.kafka.connect.util.KafkaBasedLogTest > testStartStop PASSED
org.apache.kafka.connect.util.KafkaBasedLogTest > testReloadOnStart PASSED
org.apache.kafka.connect.util.KafkaBasedLogTest > testSendAndReadToEnd PASSED
org.apache.kafka.connect.util.KafkaBasedLogTest > testConsumerError PASSED
org.apache.kafka.connect.util.KafkaBasedLogTest > testProducerError PASSED
org.apache.kafka.connect.storage.KafkaOffsetBackingStoreTest > testMissingTopic PASSED
org.apache.kafka.connect.storage.KafkaOffsetBackingStoreTest > testGetSet PASSED
org.apache.kafka.connect.storage.KafkaOffsetBackingStoreTest > testSetFailure PASSED
org.apache.kafka.connect.storage.KafkaOffsetBackingStoreTest > testStartStop PASSED
org.apache.kafka.connect.storage.KafkaOffsetBackingStoreTest > testReloadOnStart PASSED
org.apache.kafka.connect.storage.KafkaConfigStorageTest > testRestore PASSED
org.apache.kafka.connect.storage.KafkaConfigStorageTest > testPutConnectorConfig PASSED
org.apache.kafka.connect.storage.KafkaConfigStorageTest > testPutTaskConfigs PASSED
org.apache.kafka.connect.storage.KafkaConfigStorageTest > testStartStop PASSED
org.apache.kafka.connect.storage.KafkaConfigStorageTest > testPutTaskConfigsDoesNotResolveAllInconsistencies PASSED
org.apache.kafka.connect.storage.OffsetStorageWriterTest > testWriteNullValueFlush PASSED
org.apache.kafka.connect.storage.OffsetStorageWriterTest > testWriteFlush PASSED
org.apache.kafka.connect.storage.OffsetStorageWriterTest > testCancelBeforeAwaitFlush PASSED
org.apache.kafka.connect.storage.OffsetStorageWriterTest > testCancelAfterAwaitFlush PASSED
org.apache.kafka.connect.storage.OffsetStorageWriterTest > testWriteNullKeyFlush PASSED
org.apache.kafka.connect.storage.OffsetStorageWriterTest > testNoOffsetsToFlush PASSED
org.apache.kafka.connect.storage.OffsetStorageWriterTest > testAlreadyFlushing PASSED
org.apache.kafka.connect.storage.OffsetStorageWriterTest > testFlushFailureReplacesOffsets PASSED
org.apache.kafka.connect.storage.FileOffsetBackingStoreTest > testSaveRestore PASSED
org.apache.kafka.connect.storage.FileOffsetBackingStoreTest > testGetSet PASSED
:testAll
BUILD SUCCESSFUL
Total time: 1 hrs 4 mins 1.981 secs
+ ./gradlew --stacktrace docsJarAll
To honour the JVM settings for this build a new JVM will be forked. Please consider using the daemon: https://docs.gradle.org/2.10/userguide/gradle_daemon.html.
Building project 'core' with Scala version 2.10.6
:docsJar_2_10
Building project 'core' with Scala version 2.10.6
:kafka-trunk-jdk8:clients:compileJava UP-TO-DATE
:kafka-trunk-jdk8:clients:processResources UP-TO-DATE
:kafka-trunk-jdk8:clients:classes UP-TO-DATE
:kafka-trunk-jdk8:clients:determineCommitId UP-TO-DATE
:kafka-trunk-jdk8:clients:createVersionFile
:kafka-trunk-jdk8:clients:jar UP-TO-DATE
:kafka-trunk-jdk8:clients:javadoc
:docsJar_2_10 FAILED
FAILURE: Build failed with an exception.
* What went wrong:
Could not add entry '<https://builds.apache.org/job/kafka-trunk-jdk8/ws/clients/build/docs/javadoc/allclasses-frame.html'> to cache fileHashes.bin (<https://builds.apache.org/job/kafka-trunk-jdk8/ws/.gradle/2.10/taskArtifacts/fileHashes.bin).>
> Corrupted FreeListBlock 676889 found in cache '<https://builds.apache.org/job/kafka-trunk-jdk8/ws/.gradle/2.10/taskArtifacts/fileHashes.bin'.>
* Try:
Run with --info or --debug option to get more log output.
* Exception is:
org.gradle.api.UncheckedIOException: Could not add entry '<https://builds.apache.org/job/kafka-trunk-jdk8/ws/clients/build/docs/javadoc/allclasses-frame.html'> to cache fileHashes.bin (<https://builds.apache.org/job/kafka-trunk-jdk8/ws/.gradle/2.10/taskArtifacts/fileHashes.bin).>
at org.gradle.cache.internal.btree.BTreePersistentIndexedCache.put(BTreePersistentIndexedCache.java:155)
at org.gradle.cache.internal.DefaultMultiProcessSafePersistentIndexedCache$2.run(DefaultMultiProcessSafePersistentIndexedCache.java:51)
at org.gradle.cache.internal.DefaultFileLockManager$DefaultFileLock.doWriteAction(DefaultFileLockManager.java:173)
at org.gradle.cache.internal.DefaultFileLockManager$DefaultFileLock.writeFile(DefaultFileLockManager.java:163)
at org.gradle.cache.internal.DefaultCacheAccess$UnitOfWorkFileAccess.writeFile(DefaultCacheAccess.java:404)
at org.gradle.cache.internal.DefaultMultiProcessSafePersistentIndexedCache.put(DefaultMultiProcessSafePersistentIndexedCache.java:49)
at org.gradle.api.internal.changedetection.state.InMemoryTaskArtifactCache$1.put(InMemoryTaskArtifactCache.java:98)
at org.gradle.api.internal.changedetection.state.CachingFileSnapshotter.snapshot(CachingFileSnapshotter.java:59)
at org.gradle.api.internal.changedetection.state.CachingFileSnapshotter.snapshot(CachingFileSnapshotter.java:46)
at org.gradle.api.internal.changedetection.state.CachingFileSnapshotter.snapshot(CachingFileSnapshotter.java:29)
at org.gradle.api.internal.changedetection.state.DefaultFileCollectionSnapshotter$1.run(DefaultFileCollectionSnapshotter.java:70)
at org.gradle.internal.Factories$1.create(Factories.java:22)
at org.gradle.cache.internal.DefaultCacheAccess.useCache(DefaultCacheAccess.java:192)
at org.gradle.cache.internal.DefaultCacheAccess.useCache(DefaultCacheAccess.java:175)
at org.gradle.cache.internal.DefaultPersistentDirectoryStore.useCache(DefaultPersistentDirectoryStore.java:106)
at org.gradle.cache.internal.DefaultCacheFactory$ReferenceTrackingCache.useCache(DefaultCacheFactory.java:187)
at org.gradle.api.internal.changedetection.state.DefaultTaskArtifactStateCacheAccess.useCache(DefaultTaskArtifactStateCacheAccess.java:60)
at org.gradle.api.internal.changedetection.state.DefaultFileCollectionSnapshotter.snapshot(DefaultFileCollectionSnapshotter.java:62)
at org.gradle.api.internal.changedetection.state.OutputFilesCollectionSnapshotter.snapshot(OutputFilesCollectionSnapshotter.java:93)
at org.gradle.api.internal.changedetection.state.OutputFilesCollectionSnapshotter.snapshot(OutputFilesCollectionSnapshotter.java:44)
at org.gradle.api.internal.changedetection.rules.OutputFilesStateChangeRule$1.snapshotAfterTask(OutputFilesStateChangeRule.java:79)
at org.gradle.api.internal.changedetection.rules.CachingTaskStateChanges.snapshotAfterTask(CachingTaskStateChanges.java:84)
at org.gradle.api.internal.changedetection.rules.SummaryTaskStateChanges.snapshotAfterTask(SummaryTaskStateChanges.java:73)
at org.gradle.api.internal.changedetection.changes.DefaultTaskArtifactStateRepository$TaskArtifactStateImpl.afterTask(DefaultTaskArtifactStateRepository.java:123)
at org.gradle.api.internal.tasks.execution.SkipUpToDateTaskExecuter.execute(SkipUpToDateTaskExecuter.java:66)
at org.gradle.api.internal.tasks.execution.ValidatingTaskExecuter.execute(ValidatingTaskExecuter.java:58)
at org.gradle.api.internal.tasks.execution.SkipEmptySourceFilesTaskExecuter.execute(SkipEmptySourceFilesTaskExecuter.java:52)
at org.gradle.api.internal.tasks.execution.SkipTaskWithNoActionsExecuter.execute(SkipTaskWithNoActionsExecuter.java:52)
at org.gradle.api.internal.tasks.execution.SkipOnlyIfTaskExecuter.execute(SkipOnlyIfTaskExecuter.java:53)
at org.gradle.api.internal.tasks.execution.ExecuteAtMostOnceTaskExecuter.execute(ExecuteAtMostOnceTaskExecuter.java:43)
at org.gradle.execution.taskgraph.DefaultTaskGraphExecuter$EventFiringTaskWorker.execute(DefaultTaskGraphExecuter.java:203)
at org.gradle.execution.taskgraph.DefaultTaskGraphExecuter$EventFiringTaskWorker.execute(DefaultTaskGraphExecuter.java:185)
at org.gradle.execution.taskgraph.AbstractTaskPlanExecutor$TaskExecutorWorker.processTask(AbstractTaskPlanExecutor.java:66)
at org.gradle.execution.taskgraph.AbstractTaskPlanExecutor$TaskExecutorWorker.run(AbstractTaskPlanExecutor.java:50)
at org.gradle.execution.taskgraph.DefaultTaskPlanExecutor.process(DefaultTaskPlanExecutor.java:25)
at org.gradle.execution.taskgraph.DefaultTaskGraphExecuter.execute(DefaultTaskGraphExecuter.java:110)
at org.gradle.execution.SelectedTaskExecutionAction.execute(SelectedTaskExecutionAction.java:37)
at org.gradle.execution.DefaultBuildExecuter.execute(DefaultBuildExecuter.java:37)
at org.gradle.execution.DefaultBuildExecuter.access$000(DefaultBuildExecuter.java:23)
at org.gradle.execution.DefaultBuildExecuter$1.proceed(DefaultBuildExecuter.java:43)
at org.gradle.execution.DryRunBuildExecutionAction.execute(DryRunBuildExecutionAction.java:32)
at org.gradle.execution.DefaultBuildExecuter.execute(DefaultBuildExecuter.java:37)
at org.gradle.execution.DefaultBuildExecuter.execute(DefaultBuildExecuter.java:30)
at org.gradle.initialization.DefaultGradleLauncher$4.run(DefaultGradleLauncher.java:154)
at org.gradle.internal.Factories$1.create(Factories.java:22)
at org.gradle.internal.progress.DefaultBuildOperationExecutor.run(DefaultBuildOperationExecutor.java:90)
at org.gradle.internal.progress.DefaultBuildOperationExecutor.run(DefaultBuildOperationExecutor.java:52)
at org.gradle.initialization.DefaultGradleLauncher.doBuildStages(DefaultGradleLauncher.java:151)
at org.gradle.initialization.DefaultGradleLauncher.access$200(DefaultGradleLauncher.java:32)
at org.gradle.initialization.DefaultGradleLauncher$1.create(DefaultGradleLauncher.java:99)
at org.gradle.initialization.DefaultGradleLauncher$1.create(DefaultGradleLauncher.java:93)
at org.gradle.internal.progress.DefaultBuildOperationExecutor.run(DefaultBuildOperationExecutor.java:90)
at org.gradle.internal.progress.DefaultBuildOperationExecutor.run(DefaultBuildOperationExecutor.java:62)
at org.gradle.initialization.DefaultGradleLauncher.doBuild(DefaultGradleLauncher.java:93)
at org.gradle.initialization.DefaultGradleLauncher.run(DefaultGradleLauncher.java:82)
at org.gradle.api.tasks.GradleBuild.build(GradleBuild.java:117)
at org.gradle.internal.reflect.JavaMethod.invoke(JavaMethod.java:75)
at org.gradle.api.internal.project.taskfactory.AnnotationProcessingTaskFactory$StandardTaskAction.doExecute(AnnotationProcessingTaskFactory.java:227)
at org.gradle.api.internal.project.taskfactory.AnnotationProcessingTaskFactory$StandardTaskAction.execute(AnnotationProcessingTaskFactory.java:220)
at org.gradle.api.internal.project.taskfactory.AnnotationProcessingTaskFactory$StandardTaskAction.execute(AnnotationProcessingTaskFactory.java:209)
at org.gradle.api.internal.AbstractTask$TaskActionWrapper.execute(AbstractTask.java:585)
at org.gradle.api.internal.AbstractTask$TaskActionWrapper.execute(AbstractTask.java:568)
at org.gradle.api.internal.tasks.execution.ExecuteActionsTaskExecuter.executeAction(ExecuteActionsTaskExecuter.java:80)
at org.gradle.api.internal.tasks.execution.ExecuteActionsTaskExecuter.executeActions(ExecuteActionsTaskExecuter.java:61)
at org.gradle.api.internal.tasks.execution.ExecuteActionsTaskExecuter.execute(ExecuteActionsTaskExecuter.java:46)
at org.gradle.api.internal.tasks.execution.PostExecutionAnalysisTaskExecuter.execute(PostExecutionAnalysisTaskExecuter.java:35)
at org.gradle.api.internal.tasks.execution.SkipUpToDateTaskExecuter.execute(SkipUpToDateTaskExecuter.java:64)
at org.gradle.api.internal.tasks.execution.ValidatingTaskExecuter.execute(ValidatingTaskExecuter.java:58)
at org.gradle.api.internal.tasks.execution.SkipEmptySourceFilesTaskExecuter.execute(SkipEmptySourceFilesTaskExecuter.java:52)
at org.gradle.api.internal.tasks.execution.SkipTaskWithNoActionsExecuter.execute(SkipTaskWithNoActionsExecuter.java:52)
at org.gradle.api.internal.tasks.execution.SkipOnlyIfTaskExecuter.execute(SkipOnlyIfTaskExecuter.java:53)
at org.gradle.api.internal.tasks.execution.ExecuteAtMostOnceTaskExecuter.execute(ExecuteAtMostOnceTaskExecuter.java:43)
at org.gradle.execution.taskgraph.DefaultTaskGraphExecuter$EventFiringTaskWorker.execute(DefaultTaskGraphExecuter.java:203)
at org.gradle.execution.taskgraph.DefaultTaskGraphExecuter$EventFiringTaskWorker.execute(DefaultTaskGraphExecuter.java:185)
at org.gradle.execution.taskgraph.AbstractTaskPlanExecutor$TaskExecutorWorker.processTask(AbstractTaskPlanExecutor.java:66)
at org.gradle.execution.taskgraph.AbstractTaskPlanExecutor$TaskExecutorWorker.run(AbstractTaskPlanExecutor.java:50)
at org.gradle.execution.taskgraph.DefaultTaskPlanExecutor.process(DefaultTaskPlanExecutor.java:25)
at org.gradle.execution.taskgraph.DefaultTaskGraphExecuter.execute(DefaultTaskGraphExecuter.java:110)
at org.gradle.execution.SelectedTaskExecutionAction.execute(SelectedTaskExecutionAction.java:37)
at org.gradle.execution.DefaultBuildExecuter.execute(DefaultBuildExecuter.java:37)
at org.gradle.execution.DefaultBuildExecuter.access$000(DefaultBuildExecuter.java:23)
at org.gradle.execution.DefaultBuildExecuter$1.proceed(DefaultBuildExecuter.java:43)
at org.gradle.execution.DryRunBuildExecutionAction.execute(DryRunBuildExecutionAction.java:32)
at org.gradle.execution.DefaultBuildExecuter.execute(DefaultBuildExecuter.java:37)
at org.gradle.execution.DefaultBuildExecuter.execute(DefaultBuildExecuter.java:30)
at org.gradle.initialization.DefaultGradleLauncher$4.run(DefaultGradleLauncher.java:154)
at org.gradle.internal.Factories$1.create(Factories.java:22)
at org.gradle.internal.progress.DefaultBuildOperationExecutor.run(DefaultBuildOperationExecutor.java:90)
at org.gradle.internal.progress.DefaultBuildOperationExecutor.run(DefaultBuildOperationExecutor.java:52)
at org.gradle.initialization.DefaultGradleLauncher.doBuildStages(DefaultGradleLauncher.java:151)
at org.gradle.initialization.DefaultGradleLauncher.access$200(DefaultGradleLauncher.java:32)
at org.gradle.initialization.DefaultGradleLauncher$1.create(DefaultGradleLauncher.java:99)
at org.gradle.initialization.DefaultGradleLauncher$1.create(DefaultGradleLauncher.java:93)
at org.gradle.internal.progress.DefaultBuildOperationExecutor.run(DefaultBuildOperationExecutor.java:90)
at org.gradle.internal.progress.DefaultBuildOperationExecutor.run(DefaultBuildOperationExecutor.java:62)
at org.gradle.initialization.DefaultGradleLauncher.doBuild(DefaultGradleLauncher.java:93)
at org.gradle.initialization.DefaultGradleLauncher.run(DefaultGradleLauncher.java:82)
at org.gradle.launcher.exec.InProcessBuildActionExecuter$DefaultBuildController.run(InProcessBuildActionExecuter.java:94)
at org.gradle.tooling.internal.provider.ExecuteBuildActionRunner.run(ExecuteBuildActionRunner.java:28)
at org.gradle.launcher.exec.ChainingBuildActionRunner.run(ChainingBuildActionRunner.java:35)
at org.gradle.launcher.exec.InProcessBuildActionExecuter.execute(InProcessBuildActionExecuter.java:43)
at org.gradle.launcher.exec.InProcessBuildActionExecuter.execute(InProcessBuildActionExecuter.java:28)
at org.gradle.launcher.exec.ContinuousBuildActionExecuter.execute(ContinuousBuildActionExecuter.java:78)
at org.gradle.launcher.exec.ContinuousBuildActionExecuter.execute(ContinuousBuildActionExecuter.java:48)
at org.gradle.launcher.daemon.server.exec.ExecuteBuild.doBuild(ExecuteBuild.java:52)
at org.gradle.launcher.daemon.server.exec.BuildCommandOnly.execute(BuildCommandOnly.java:36)
at org.gradle.launcher.daemon.server.api.DaemonCommandExecution.proceed(DaemonCommandExecution.java:120)
at org.gradle.launcher.daemon.server.exec.WatchForDisconnection.execute(WatchForDisconnection.java:37)
at org.gradle.launcher.daemon.server.api.DaemonCommandExecution.proceed(DaemonCommandExecution.java:120)
at org.gradle.launcher.daemon.server.exec.ResetDeprecationLogger.execute(ResetDeprecationLogger.java:26)
at org.gradle.launcher.daemon.server.api.DaemonCommandExecution.proceed(DaemonCommandExecution.java:120)
at org.gradle.launcher.daemon.server.exec.RequestStopIfSingleUsedDaemon.execute(RequestStopIfSingleUsedDaemon.java:34)
at org.gradle.launcher.daemon.server.api.DaemonCommandExecution.proceed(DaemonCommandExecution.java:120)
at org.gradle.launcher.daemon.server.exec.ForwardClientInput$2.call(ForwardClientInput.java:74)
at org.gradle.launcher.daemon.server.exec.ForwardClientInput$2.call(ForwardClientInput.java:72)
at org.gradle.util.Swapper.swap(Swapper.java:38)
at org.gradle.launcher.daemon.server.exec.ForwardClientInput.execute(ForwardClientInput.java:72)
at org.gradle.launcher.daemon.server.api.DaemonCommandExecution.proceed(DaemonCommandExecution.java:120)
at org.gradle.launcher.daemon.server.health.DaemonHealthTracker.execute(DaemonHealthTracker.java:40)
at org.gradle.launcher.daemon.server.api.DaemonCommandExecution.proceed(DaemonCommandExecution.java:120)
at org.gradle.launcher.daemon.server.exec.LogToClient.doBuild(LogToClient.java:66)
at org.gradle.launcher.daemon.server.exec.BuildCommandOnly.execute(BuildCommandOnly.java:36)
at org.gradle.launcher.daemon.server.api.DaemonCommandExecution.proceed(DaemonCommandExecution.java:120)
at org.gradle.launcher.daemon.server.exec.EstablishBuildEnvironment.doBuild(EstablishBuildEnvironment.java:72)
at org.gradle.launcher.daemon.server.exec.BuildCommandOnly.execute(BuildCommandOnly.java:36)
at org.gradle.launcher.daemon.server.api.DaemonCommandExecution.proceed(DaemonCommandExecution.java:120)
at org.gradle.launcher.daemon.server.health.HintGCAfterBuild.execute(HintGCAfterBuild.java:41)
at org.gradle.launcher.daemon.server.api.DaemonCommandExecution.proceed(DaemonCommandExecution.java:120)
at org.gradle.launcher.daemon.server.exec.StartBuildOrRespondWithBusy$1.run(StartBuildOrRespondWithBusy.java:50)
at org.gradle.launcher.daemon.server.DaemonStateCoordinator$1.run(DaemonStateCoordinator.java:246)
at org.gradle.internal.concurrent.ExecutorPolicy$CatchAndRecordFailures.onExecute(ExecutorPolicy.java:54)
at org.gradle.internal.concurrent.StoppableExecutorImpl$1.run(StoppableExecutorImpl.java:40)
Caused by: org.gradle.cache.internal.btree.CorruptedCacheException: Corrupted FreeListBlock 676889 found in cache '<https://builds.apache.org/job/kafka-trunk-jdk8/ws/.gradle/2.10/taskArtifacts/fileHashes.bin'.>
at org.gradle.cache.internal.btree.FileBackedBlockStore$BlockImpl.blockCorruptedException(FileBackedBlockStore.java:247)
at org.gradle.cache.internal.btree.FileBackedBlockStore$BlockImpl.read(FileBackedBlockStore.java:210)
at org.gradle.cache.internal.btree.FileBackedBlockStore.read(FileBackedBlockStore.java:98)
at org.gradle.cache.internal.btree.CachingBlockStore.read(CachingBlockStore.java:84)
at org.gradle.cache.internal.btree.FreeListBlockStore.read(FreeListBlockStore.java:78)
at org.gradle.cache.internal.btree.FreeListBlockStore$FreeListBlock.getNextBlock(FreeListBlockStore.java:204)
at org.gradle.cache.internal.btree.FreeListBlockStore$FreeListBlock.alloc(FreeListBlockStore.java:221)
at org.gradle.cache.internal.btree.FreeListBlockStore.attach(FreeListBlockStore.java:88)
at org.gradle.cache.internal.btree.FreeListBlockStore.write(FreeListBlockStore.java:82)
at org.gradle.cache.internal.btree.StateCheckBlockStore.write(StateCheckBlockStore.java:66)
at org.gradle.cache.internal.btree.BTreePersistentIndexedCache.put(BTreePersistentIndexedCache.java:150)
... 131 more
BUILD FAILED
Total time: 14.052 secs
Build step 'Execute shell' marked build as failure
Recording test results
Setting JDK1_8_0_45_HOME=/jenkins/tools/hudson.model.JDK/jdk1.8.0_45
Setting GRADLE_2_4_RC_2_HOME=/jenkins/tools/hudson.plugins.gradle.GradleInstallation/Gradle_2.4-rc-2
Setting JDK1_8_0_45_HOME=/jenkins/tools/hudson.model.JDK/jdk1.8.0_45
Setting GRADLE_2_4_RC_2_HOME=/jenkins/tools/hudson.plugins.gradle.GradleInstallation/Gradle_2.4-rc-2