You are viewing a plain text version of this content. The canonical link for it is here.
Posted to builds@beam.apache.org by Apache Jenkins Server <je...@builds.apache.org> on 2018/11/14 00:12:50 UTC

Build failed in Jenkins: beam_PostCommit_Go_GradleBuild #1664

See <https://builds.apache.org/job/beam_PostCommit_Go_GradleBuild/1664/display/redirect>

------------------------------------------
[...truncated 673.54 KB...]
13: Impulse[0]
1: ParDo[passert.failFn] Out:[]
2: Discard
3: ParDo[passert.failFn] Out:[]
4: ParDo[passert.diffFn] Out:[1 2 3]
5: wait[2] Out:4
6: buffer[6]. wait:5 Out:4
7: buffer[7]. wait:5 Out:4
8: Flatten[7]. Out:buffer[6]. wait:5 Out:4
9: ParDo[beam.partitionFn] Out:[8 8 8 8 8 8 8]
10: Multiplex. Out:[9 7]
11: ParDo[beam.createFn] Out:[10]
2018/11/14 00:12:00 wait[5] unblocked w/ 1 [false]
2018/11/14 00:12:00 wait[5] done
--- PASS: TestPartitionFlattenIdentity (0.00s)
=== RUN   Example_metricsDeclaredAnywhere
--- PASS: Example_metricsDeclaredAnywhere (0.00s)
=== RUN   Example_metricsReusable
--- PASS: Example_metricsReusable (0.00s)
PASS
coverage: 44.8% of statements
ok  	github.com/apache/beam/sdks/go/pkg/beam	0.016s	coverage: 44.8% of statements

> Task :beam-sdks-go:test
Test for github.com/apache/beam/sdks/go/pkg/beam/core/runtime/harness finished, 1 completed, 0 failed
Result of package github.com/apache/beam/sdks/go/pkg/beam:
Test for github.com/apache/beam/sdks/go/pkg/beam finished, 7 completed, 0 failed
Result of package github.com/apache/beam/sdks/go/pkg/beam/core/runtime:

=== RUN   TestOptions
--- PASS: TestOptions (0.00s)
=== RUN   TestKey
--- PASS: TestKey (0.00s)
=== RUN   TestRegister
--- PASS: TestRegister (0.00s)
PASS
coverage: 48.5% of statements
ok  	github.com/apache/beam/sdks/go/pkg/beam/core/runtime	0.003s	coverage: 48.5% of statements
=== RUN   TestMergeMaps
--- PASS: TestMergeMaps (0.00s)
=== RUN   TestShallowClone
--- PASS: TestShallowClone (0.00s)
=== RUN   TestShallowCloneNil
--- PASS: TestShallowCloneNil (0.00s)
PASS
coverage: 6.4% of statements
ok  	github.com/apache/beam/sdks/go/pkg/beam/core/util/reflectx	0.004s	coverage: 6.4% of statements

> Task :beam-sdks-go:test
Test for github.com/apache/beam/sdks/go/pkg/beam/core/runtime finished, 3 completed, 0 failed
Result of package github.com/apache/beam/sdks/go/pkg/beam/core/util/reflectx:
Test for github.com/apache/beam/sdks/go/pkg/beam/core/util/reflectx finished, 3 completed, 0 failed
Generating HTML test report...
Finished generating test html results (0.139 secs) into: <https://builds.apache.org/job/beam_PostCommit_Go_GradleBuild/ws/src/sdks/go/.gogradle/reports/test>
Invalidating in-memory cache of <https://builds.apache.org/job/beam_PostCommit_Go_GradleBuild/ws/src/.gradle/buildOutputCleanup/outputFiles.bin>
:beam-sdks-go:test (Thread[Task worker for ':' Thread 4,5,main]) completed. Took 25.639 secs.
:beam-sdks-go-container:prepare (Thread[Task worker for ':' Thread 4,5,main]) started.

> Task :beam-sdks-go-container:prepare
Caching disabled for task ':beam-sdks-go-container:prepare': Caching has not been enabled for the task
Task ':beam-sdks-go-container:prepare' is not up-to-date because:
  Task has not declared any outputs despite executing actions.
Use project GOPATH: <https://builds.apache.org/job/beam_PostCommit_Go_GradleBuild/ws/src/sdks/go/container/.gogradle/project_gopath>
:beam-sdks-go-container:prepare (Thread[Task worker for ':' Thread 4,5,main]) completed. Took 0.002 secs.
:beam-sdks-go-container:resolveBuildDependencies (Thread[Task worker for ':' Thread 4,5,main]) started.

> Task :beam-sdks-go-container:resolveBuildDependencies UP-TO-DATE
Build cache key for task ':beam-sdks-go-container:resolveBuildDependencies' is da6f3e3cd2223eac5fa818573ed4ab59
Caching disabled for task ':beam-sdks-go-container:resolveBuildDependencies': Caching has not been enabled for the task
Skipping task ':beam-sdks-go-container:resolveBuildDependencies' as it is up-to-date.
:beam-sdks-go-container:resolveBuildDependencies (Thread[Task worker for ':' Thread 4,5,main]) completed. Took 0.055 secs.
:beam-sdks-go-container:installDependencies (Thread[Task worker for ':' Thread 4,5,main]) started.

> Task :beam-sdks-go-container:installDependencies
Caching disabled for task ':beam-sdks-go-container:installDependencies': Caching has not been enabled for the task
Task ':beam-sdks-go-container:installDependencies' is not up-to-date because:
  Task has not declared any outputs despite executing actions.
:beam-sdks-go-container:installDependencies (Thread[Task worker for ':' Thread 4,5,main]) completed. Took 1.09 secs.
:beam-sdks-go-container:buildLinuxAmd64 (Thread[Task worker for ':' Thread 4,5,main]) started.

> Task :beam-sdks-go-container:buildLinuxAmd64 UP-TO-DATE
Build cache key for task ':beam-sdks-go-container:buildLinuxAmd64' is 419b061b8a8873e13e02b15a7647a27d
Caching disabled for task ':beam-sdks-go-container:buildLinuxAmd64': Caching has not been enabled for the task
Skipping task ':beam-sdks-go-container:buildLinuxAmd64' as it is up-to-date.
:beam-sdks-go-container:buildLinuxAmd64 (Thread[Task worker for ':' Thread 4,5,main]) completed. Took 0.394 secs.
:beam-sdks-go-container:build (Thread[Task worker for ':' Thread 4,5,main]) started.

> Task :beam-sdks-go-container:build
Caching disabled for task ':beam-sdks-go-container:build': Caching has not been enabled for the task
Task ':beam-sdks-go-container:build' is not up-to-date because:
  Task has not declared any outputs despite executing actions.
:beam-sdks-go-container:build (Thread[Task worker for ':' Thread 4,5,main]) completed. Took 0.002 secs.
:beam-sdks-go-examples:prepare (Thread[Task worker for ':' Thread 4,5,main]) started.

> Task :beam-sdks-go-examples:prepare
Caching disabled for task ':beam-sdks-go-examples:prepare': Caching has not been enabled for the task
Task ':beam-sdks-go-examples:prepare' is not up-to-date because:
  Task has not declared any outputs despite executing actions.
Use project GOPATH: <https://builds.apache.org/job/beam_PostCommit_Go_GradleBuild/ws/src/sdks/go/examples/.gogradle/project_gopath>
:beam-sdks-go-examples:prepare (Thread[Task worker for ':' Thread 4,5,main]) completed. Took 0.002 secs.
:beam-sdks-go-examples:resolveBuildDependencies (Thread[Task worker for ':' Thread 4,5,main]) started.

> Task :beam-sdks-go-examples:resolveBuildDependencies
Build cache key for task ':beam-sdks-go-examples:resolveBuildDependencies' is 18431edf41fa9167e91e333a0426aa04
Caching disabled for task ':beam-sdks-go-examples:resolveBuildDependencies': Caching has not been enabled for the task
Task ':beam-sdks-go-examples:resolveBuildDependencies' is not up-to-date because:
  No history is available.
Cache <https://builds.apache.org/job/beam_PostCommit_Go_GradleBuild/ws/src/sdks/go/examples/.gogradle/cache/PersistenceNotationToResolvedCache-0.10.bin> not found, skip.
Cache <https://builds.apache.org/job/beam_PostCommit_Go_GradleBuild/ws/src/sdks/go/examples/.gogradle/cache/PersistenceResolvedToDependenciesCache-0.10.bin> not found, skip.
Resolving ./github.com/apache/beam/sdks/go@<https://builds.apache.org/job/beam_PostCommit_Go_GradleBuild/ws/src/sdks/go>
:beam-sdks-go-examples:resolveBuildDependencies (Thread[Task worker for ':' Thread 4,5,main]) completed. Took 1.158 secs.
:beam-sdks-go-examples:installDependencies (Thread[Task worker for ':' Thread 4,5,main]) started.

> Task :beam-sdks-go-examples:installDependencies
Caching disabled for task ':beam-sdks-go-examples:installDependencies': Caching has not been enabled for the task
Task ':beam-sdks-go-examples:installDependencies' is not up-to-date because:
  Task has not declared any outputs despite executing actions.
Cache <https://builds.apache.org/job/beam_PostCommit_Go_GradleBuild/ws/src/sdks/go/examples/.gogradle/cache/VendorSnapshot-0.10.bin> not found, skip.
:beam-sdks-go-examples:installDependencies (Thread[Task worker for ':' Thread 4,5,main]) completed. Took 0.698 secs.
:beam-sdks-go-examples:buildLinuxAmd64 (Thread[Task worker for ':' Thread 4,5,main]) started.

> Task :beam-sdks-go-examples:buildLinuxAmd64
Caching disabled for task ':beam-sdks-go-examples:buildLinuxAmd64': Caching has not been enabled for the task
Task ':beam-sdks-go-examples:buildLinuxAmd64' is not up-to-date because:
  Task has not declared any outputs despite executing actions.
:beam-sdks-go-examples:buildLinuxAmd64 (Thread[Task worker for ':' Thread 4,5,main]) completed. Took 36.517 secs.
:beam-sdks-go-examples:build (Thread[Task worker for ':' Thread 4,5,main]) started.

> Task :beam-sdks-go-examples:build
Caching disabled for task ':beam-sdks-go-examples:build': Caching has not been enabled for the task
Task ':beam-sdks-go-examples:build' is not up-to-date because:
  Task has not declared any outputs despite executing actions.
:beam-sdks-go-examples:build (Thread[Task worker for ':' Thread 4,5,main]) completed. Took 0.0 secs.
:beam-sdks-java-container:prepare (Thread[Task worker for ':' Thread 4,5,main]) started.

> Task :beam-sdks-java-container:prepare
Caching disabled for task ':beam-sdks-java-container:prepare': Caching has not been enabled for the task
Task ':beam-sdks-java-container:prepare' is not up-to-date because:
  Task has not declared any outputs despite executing actions.
Use project GOPATH: <https://builds.apache.org/job/beam_PostCommit_Go_GradleBuild/ws/src/sdks/java/container/.gogradle/project_gopath>
:beam-sdks-java-container:prepare (Thread[Task worker for ':' Thread 4,5,main]) completed. Took 0.001 secs.
:beam-sdks-java-container:resolveBuildDependencies (Thread[Task worker for ':' Thread 4,5,main]) started.

> Task :beam-sdks-java-container:resolveBuildDependencies
Build cache key for task ':beam-sdks-java-container:resolveBuildDependencies' is aaac77c7db3a0c15e5aa6203aa5d3a0a
Caching disabled for task ':beam-sdks-java-container:resolveBuildDependencies': Caching has not been enabled for the task
Task ':beam-sdks-java-container:resolveBuildDependencies' is not up-to-date because:
  No history is available.
Cache <https://builds.apache.org/job/beam_PostCommit_Go_GradleBuild/ws/src/sdks/java/container/.gogradle/cache/PersistenceNotationToResolvedCache-0.10.bin> not found, skip.
Cache <https://builds.apache.org/job/beam_PostCommit_Go_GradleBuild/ws/src/sdks/java/container/.gogradle/cache/PersistenceResolvedToDependenciesCache-0.10.bin> not found, skip.
Resolving ./github.com/apache/beam/sdks/go@<https://builds.apache.org/job/beam_PostCommit_Go_GradleBuild/ws/src/sdks/go>
:beam-sdks-java-container:resolveBuildDependencies (Thread[Task worker for ':' Thread 4,5,main]) completed. Took 0.455 secs.
:beam-sdks-java-container:installDependencies (Thread[Task worker for ':' Thread 4,5,main]) started.

> Task :beam-sdks-java-container:installDependencies
Caching disabled for task ':beam-sdks-java-container:installDependencies': Caching has not been enabled for the task
Task ':beam-sdks-java-container:installDependencies' is not up-to-date because:
  Task has not declared any outputs despite executing actions.
Cache <https://builds.apache.org/job/beam_PostCommit_Go_GradleBuild/ws/src/sdks/java/container/.gogradle/cache/VendorSnapshot-0.10.bin> not found, skip.
:beam-sdks-java-container:installDependencies (Thread[Task worker for ':' Thread 4,5,main]) completed. Took 0.627 secs.
:beam-sdks-java-container:buildLinuxAmd64 (Thread[Task worker for ':' Thread 4,5,main]) started.

> Task :beam-sdks-java-container:buildLinuxAmd64
Build cache key for task ':beam-sdks-java-container:buildLinuxAmd64' is 1ce33ab02595491536cc3ad69c5e97f7
Caching disabled for task ':beam-sdks-java-container:buildLinuxAmd64': Caching has not been enabled for the task
Task ':beam-sdks-java-container:buildLinuxAmd64' is not up-to-date because:
  No history is available.
:beam-sdks-java-container:buildLinuxAmd64 (Thread[Task worker for ':' Thread 4,5,main]) completed. Took 2.655 secs.
:beam-sdks-java-container:build (Thread[Task worker for ':' Thread 4,5,main]) started.

> Task :beam-sdks-java-container:build
Caching disabled for task ':beam-sdks-java-container:build': Caching has not been enabled for the task
Task ':beam-sdks-java-container:build' is not up-to-date because:
  Task has not declared any outputs despite executing actions.
:beam-sdks-java-container:build (Thread[Task worker for ':' Thread 4,5,main]) completed. Took 0.001 secs.
:beam-sdks-python-container:prepare (Thread[Task worker for ':' Thread 4,5,main]) started.

> Task :beam-sdks-python-container:prepare
Caching disabled for task ':beam-sdks-python-container:prepare': Caching has not been enabled for the task
Task ':beam-sdks-python-container:prepare' is not up-to-date because:
  Task has not declared any outputs despite executing actions.
Use project GOPATH: <https://builds.apache.org/job/beam_PostCommit_Go_GradleBuild/ws/src/sdks/python/container/.gogradle/project_gopath>
:beam-sdks-python-container:prepare (Thread[Task worker for ':' Thread 4,5,main]) completed. Took 0.002 secs.
:beam-sdks-python-container:resolveBuildDependencies (Thread[Task worker for ':' Thread 4,5,main]) started.

> Task :beam-sdks-python-container:resolveBuildDependencies
Build cache key for task ':beam-sdks-python-container:resolveBuildDependencies' is 8aa33586c6ab5d1624a39fbb9d2e5a5e
Caching disabled for task ':beam-sdks-python-container:resolveBuildDependencies': Caching has not been enabled for the task
Task ':beam-sdks-python-container:resolveBuildDependencies' is not up-to-date because:
  No history is available.
Cache <https://builds.apache.org/job/beam_PostCommit_Go_GradleBuild/ws/src/sdks/python/container/.gogradle/cache/PersistenceNotationToResolvedCache-0.10.bin> not found, skip.
Cache <https://builds.apache.org/job/beam_PostCommit_Go_GradleBuild/ws/src/sdks/python/container/.gogradle/cache/PersistenceResolvedToDependenciesCache-0.10.bin> not found, skip.
Resolving ./github.com/apache/beam/sdks/go@<https://builds.apache.org/job/beam_PostCommit_Go_GradleBuild/ws/src/sdks/go>
:beam-sdks-python-container:resolveBuildDependencies (Thread[Task worker for ':' Thread 4,5,main]) completed. Took 0.29 secs.
:beam-sdks-python-container:installDependencies (Thread[Task worker for ':' Thread 4,5,main]) started.

> Task :beam-sdks-python-container:installDependencies
Caching disabled for task ':beam-sdks-python-container:installDependencies': Caching has not been enabled for the task
Task ':beam-sdks-python-container:installDependencies' is not up-to-date because:
  Task has not declared any outputs despite executing actions.
Cache <https://builds.apache.org/job/beam_PostCommit_Go_GradleBuild/ws/src/sdks/python/container/.gogradle/cache/VendorSnapshot-0.10.bin> not found, skip.
:beam-sdks-python-container:installDependencies (Thread[Task worker for ':' Thread 4,5,main]) completed. Took 0.665 secs.
:beam-sdks-python-container:buildLinuxAmd64 (Thread[Task worker for ':' Thread 4,5,main]) started.

> Task :beam-sdks-python-container:buildLinuxAmd64
Build cache key for task ':beam-sdks-python-container:buildLinuxAmd64' is ce175028a5d7d562ed75aa7b075628ca
Caching disabled for task ':beam-sdks-python-container:buildLinuxAmd64': Caching has not been enabled for the task
Task ':beam-sdks-python-container:buildLinuxAmd64' is not up-to-date because:
  No history is available.
:beam-sdks-python-container:buildLinuxAmd64 (Thread[Task worker for ':' Thread 4,5,main]) completed. Took 2.728 secs.
:beam-sdks-python-container:build (Thread[Task worker for ':' Thread 4,5,main]) started.

> Task :beam-sdks-python-container:build
Caching disabled for task ':beam-sdks-python-container:build': Caching has not been enabled for the task
Task ':beam-sdks-python-container:build' is not up-to-date because:
  Task has not declared any outputs despite executing actions.
:beam-sdks-python-container:build (Thread[Task worker for ':' Thread 4,5,main]) completed. Took 0.0 secs.
:goPreCommit (Thread[Task worker for ':' Thread 4,5,main]) started.

> Task :goPreCommit
Skipping task ':goPreCommit' as it has no actions.
:goPreCommit (Thread[Task worker for ':' Thread 4,5,main]) completed. Took 0.0 secs.

FAILURE: Build failed with an exception.

* Where:
Build file '<https://builds.apache.org/job/beam_PostCommit_Go_GradleBuild/ws/src/build.gradle'> line: 234

* What went wrong:
Execution failed for task ':goIntegrationTests'.
> Process 'command 'sh'' finished with non-zero exit value 1

* Try:
Run with --stacktrace option to get the stack trace. Run with --debug option to get more log output. Run with --scan to get full insights.

* Get more help at https://help.gradle.org

Deprecated Gradle features were used in this build, making it incompatible with Gradle 5.0.
Use '--warning-mode all' to show the individual deprecation warnings.
See https://docs.gradle.org/4.10.2/userguide/command_line_interface.html#sec:command_line_warnings

BUILD FAILED in 12m 38s
89 actionable tasks: 78 executed, 9 from cache, 2 up-to-date

Publishing build scan...
https://gradle.com/s/gh72zxvfttrzq

Build step 'Invoke Gradle script' changed build result to FAILURE
Build step 'Invoke Gradle script' marked build as failure

---------------------------------------------------------------------
To unsubscribe, e-mail: builds-unsubscribe@beam.apache.org
For additional commands, e-mail: builds-help@beam.apache.org


Jenkins build is back to normal : beam_PostCommit_Go_GradleBuild #1665

Posted by Apache Jenkins Server <je...@builds.apache.org>.
See <https://builds.apache.org/job/beam_PostCommit_Go_GradleBuild/1665/display/redirect?page=changes>


---------------------------------------------------------------------
To unsubscribe, e-mail: builds-unsubscribe@beam.apache.org
For additional commands, e-mail: builds-help@beam.apache.org