You are viewing a plain text version of this content. The canonical link for it is here.
Posted to builds@beam.apache.org by Apache Jenkins Server <je...@builds.apache.org> on 2023/10/18 23:25:26 UTC

Build failed in Jenkins: beam_PostCommit_Python38 #4725

See <https://ci-beam.apache.org/job/beam_PostCommit_Python38/4725/display/redirect>

Changes:


------------------------------------------
[...truncated 12.08 MB...]
[gw7] PASSED apache_beam/io/gcp/bigquery_write_it_test.py::BigQueryWriteIntegrationTests::test_big_query_write 
apache_beam/io/gcp/bigquery_write_it_test.py::BigQueryWriteIntegrationTests::test_big_query_write_insert_errors_reporting 
[gw4] PASSED apache_beam/io/gcp/bigquery_io_read_it_test.py::BigqueryIOReadIT::test_bigquery_read_1M_python 
apache_beam/io/gcp/bigquery_io_read_it_test.py::BigqueryIOReadIT::test_bigquery_read_custom_1M_python 
[gw0] PASSED apache_beam/dataframe/io_it_test.py::ReadUsingReadGbqTests::test_ReadGbq_with_computation 
apache_beam/io/gcp/gcsfilesystem_integration_test.py::GcsFileSystemIntegrationTest::test_copy 
[gw0] PASSED apache_beam/io/gcp/gcsfilesystem_integration_test.py::GcsFileSystemIntegrationTest::test_copy 
apache_beam/io/gcp/gcsfilesystem_integration_test.py::GcsFileSystemIntegrationTest::test_rename 
[gw0] PASSED apache_beam/io/gcp/gcsfilesystem_integration_test.py::GcsFileSystemIntegrationTest::test_rename 
apache_beam/io/gcp/gcsfilesystem_integration_test.py::GcsFileSystemIntegrationTest::test_rename_error 
[gw0] PASSED apache_beam/io/gcp/gcsfilesystem_integration_test.py::GcsFileSystemIntegrationTest::test_rename_error 
apache_beam/io/gcp/datastore/v1new/datastore_write_it_test.py::DatastoreWriteIT::test_datastore_write_limit 
[gw6] PASSED apache_beam/io/gcp/big_query_query_to_table_it_test.py::BigQueryQueryToTableIT::test_big_query_new_types 
apache_beam/io/gcp/big_query_query_to_table_it_test.py::BigQueryQueryToTableIT::test_big_query_new_types_avro 
[gw5] PASSED apache_beam/io/gcp/bigquery_file_loads_test.py::BigQueryFileLoadsIT::test_multiple_destinations_transform 
apache_beam/io/gcp/bigquery_file_loads_test.py::BigQueryFileLoadsIT::test_one_job_fails_all_jobs_fail 
[gw1] PASSED apache_beam/io/gcp/bigquery_read_it_test.py::ReadTests::test_iobase_source 
apache_beam/io/gcp/bigquery_read_it_test.py::ReadTests::test_native_source 
[gw7] PASSED apache_beam/io/gcp/bigquery_write_it_test.py::BigQueryWriteIntegrationTests::test_big_query_write_insert_errors_reporting 
apache_beam/io/gcp/bigquery_write_it_test.py::BigQueryWriteIntegrationTests::test_big_query_write_insert_non_transient_api_call_error 
[gw2] PASSED apache_beam/io/gcp/bigquery_test.py::BigQueryStreamingInsertTransformIntegrationTests::test_value_provider_transform 
apache_beam/io/gcp/bigquery_test.py::PubSubBigQueryIT::test_file_loads 
[gw4] PASSED apache_beam/io/gcp/bigquery_io_read_it_test.py::BigqueryIOReadIT::test_bigquery_read_custom_1M_python 
apache_beam/io/gcp/gcsio_integration_test.py::GcsIOIntegrationTest::test_copy 
[gw4] PASSED apache_beam/io/gcp/gcsio_integration_test.py::GcsIOIntegrationTest::test_copy 
apache_beam/io/gcp/gcsio_integration_test.py::GcsIOIntegrationTest::test_copy_batch 
[gw4] PASSED apache_beam/io/gcp/gcsio_integration_test.py::GcsIOIntegrationTest::test_copy_batch 
apache_beam/io/gcp/gcsio_integration_test.py::GcsIOIntegrationTest::test_copy_batch_kms 
[gw4] PASSED apache_beam/io/gcp/gcsio_integration_test.py::GcsIOIntegrationTest::test_copy_batch_kms 
apache_beam/io/gcp/gcsio_integration_test.py::GcsIOIntegrationTest::test_copy_batch_rewrite_token 
[gw4] PASSED apache_beam/io/gcp/gcsio_integration_test.py::GcsIOIntegrationTest::test_copy_batch_rewrite_token 
apache_beam/io/gcp/gcsio_integration_test.py::GcsIOIntegrationTest::test_copy_kms 
[gw4] PASSED apache_beam/io/gcp/gcsio_integration_test.py::GcsIOIntegrationTest::test_copy_kms 
apache_beam/io/gcp/gcsio_integration_test.py::GcsIOIntegrationTest::test_copy_rewrite_token 
[gw4] PASSED apache_beam/io/gcp/gcsio_integration_test.py::GcsIOIntegrationTest::test_copy_rewrite_token 
apache_beam/ml/gcp/naturallanguageml_test_it.py::NaturalLanguageMlTestIT::test_analyzing_syntax 
[gw4] SKIPPED apache_beam/ml/gcp/naturallanguageml_test_it.py::NaturalLanguageMlTestIT::test_analyzing_syntax 
apache_beam/ml/gcp/recommendations_ai_test_it.py::RecommendationAIIT::test_create_catalog_item 
[gw5] PASSED apache_beam/io/gcp/bigquery_file_loads_test.py::BigQueryFileLoadsIT::test_one_job_fails_all_jobs_fail 
apache_beam/io/gcp/pubsub_integration_test.py::PubSubIntegrationTest::test_streaming_data_only 
[gw1] PASSED apache_beam/io/gcp/bigquery_read_it_test.py::ReadTests::test_native_source 
apache_beam/io/gcp/bigquery_read_it_test.py::ReadTests::test_table_schema_retrieve 
[gw6] PASSED apache_beam/io/gcp/big_query_query_to_table_it_test.py::BigQueryQueryToTableIT::test_big_query_new_types_avro 
apache_beam/io/gcp/big_query_query_to_table_it_test.py::BigQueryQueryToTableIT::test_big_query_standard_sql 
[gw7] PASSED apache_beam/io/gcp/bigquery_write_it_test.py::BigQueryWriteIntegrationTests::test_big_query_write_insert_non_transient_api_call_error 
apache_beam/io/gcp/bigquery_write_it_test.py::BigQueryWriteIntegrationTests::test_big_query_write_new_types 
[gw4] PASSED apache_beam/ml/gcp/recommendations_ai_test_it.py::RecommendationAIIT::test_create_catalog_item 
apache_beam/ml/gcp/recommendations_ai_test_it.py::RecommendationAIIT::test_create_user_event 
[gw3] PASSED apache_beam/examples/dataframe/taxiride_it_test.py::TaxirideIT::test_enrich 
apache_beam/io/gcp/bigquery_json_it_test.py::BigQueryJsonIT::test_direct_read 
[gw1] PASSED apache_beam/io/gcp/bigquery_read_it_test.py::ReadTests::test_table_schema_retrieve 
apache_beam/io/gcp/bigquery_read_it_test.py::ReadTests::test_table_schema_retrieve_specifying_only_table 
[gw7] PASSED apache_beam/io/gcp/bigquery_write_it_test.py::BigQueryWriteIntegrationTests::test_big_query_write_new_types 
apache_beam/io/gcp/bigquery_write_it_test.py::BigQueryWriteIntegrationTests::test_big_query_write_schema_autodetect 
[gw7] SKIPPED apache_beam/io/gcp/bigquery_write_it_test.py::BigQueryWriteIntegrationTests::test_big_query_write_schema_autodetect 
apache_beam/io/gcp/bigquery_write_it_test.py::BigQueryWriteIntegrationTests::test_big_query_write_without_schema 
[gw6] PASSED apache_beam/io/gcp/big_query_query_to_table_it_test.py::BigQueryQueryToTableIT::test_big_query_standard_sql 
apache_beam/ml/gcp/cloud_dlp_it_test.py::CloudDLPIT::test_deidentification 
[gw3] PASSED apache_beam/io/gcp/bigquery_json_it_test.py::BigQueryJsonIT::test_direct_read 
apache_beam/io/gcp/bigquery_json_it_test.py::BigQueryJsonIT::test_export_read 
[gw4] PASSED apache_beam/ml/gcp/recommendations_ai_test_it.py::RecommendationAIIT::test_create_user_event 
apache_beam/ml/gcp/recommendations_ai_test_it.py::RecommendationAIIT::test_predict 
[gw5] PASSED apache_beam/io/gcp/pubsub_integration_test.py::PubSubIntegrationTest::test_streaming_data_only 
apache_beam/io/gcp/pubsub_integration_test.py::PubSubIntegrationTest::test_streaming_with_attributes 
[gw2] PASSED apache_beam/io/gcp/bigquery_test.py::PubSubBigQueryIT::test_file_loads 
apache_beam/io/gcp/bigquery_test.py::PubSubBigQueryIT::test_streaming_inserts 
[gw7] PASSED apache_beam/io/gcp/bigquery_write_it_test.py::BigQueryWriteIntegrationTests::test_big_query_write_without_schema 
apache_beam/ml/inference/base_test.py::RunInferenceBaseTest::test_run_inference_with_side_inputin_streaming 
[gw7] SKIPPED apache_beam/ml/inference/base_test.py::RunInferenceBaseTest::test_run_inference_with_side_inputin_streaming 
apache_beam/ml/inference/onnx_inference_it_test.py::OnnxInference::test_onnx_run_inference_roberta_sentiment_classification 
[gw7] SKIPPED apache_beam/ml/inference/onnx_inference_it_test.py::OnnxInference::test_onnx_run_inference_roberta_sentiment_classification 
apache_beam/ml/inference/xgboost_inference_it_test.py::XGBoostInference::test_iris_classification_datatable_multi_batch 
[gw7] SKIPPED apache_beam/ml/inference/xgboost_inference_it_test.py::XGBoostInference::test_iris_classification_datatable_multi_batch 
apache_beam/ml/inference/xgboost_inference_it_test.py::XGBoostInference::test_iris_classification_datatable_single_batch 
[gw7] SKIPPED apache_beam/ml/inference/xgboost_inference_it_test.py::XGBoostInference::test_iris_classification_datatable_single_batch 
apache_beam/ml/inference/xgboost_inference_it_test.py::XGBoostInference::test_iris_classification_numpy_multi_batch 
[gw7] SKIPPED apache_beam/ml/inference/xgboost_inference_it_test.py::XGBoostInference::test_iris_classification_numpy_multi_batch 
apache_beam/ml/inference/xgboost_inference_it_test.py::XGBoostInference::test_iris_classification_numpy_single_batch 
[gw7] SKIPPED apache_beam/ml/inference/xgboost_inference_it_test.py::XGBoostInference::test_iris_classification_numpy_single_batch 
apache_beam/ml/inference/xgboost_inference_it_test.py::XGBoostInference::test_iris_classification_numpy_single_batch_large_model 
[gw7] SKIPPED apache_beam/ml/inference/xgboost_inference_it_test.py::XGBoostInference::test_iris_classification_numpy_single_batch_large_model 
apache_beam/ml/inference/xgboost_inference_it_test.py::XGBoostInference::test_iris_classification_pandas_multi_batch 
[gw7] SKIPPED apache_beam/ml/inference/xgboost_inference_it_test.py::XGBoostInference::test_iris_classification_pandas_multi_batch 
apache_beam/ml/inference/xgboost_inference_it_test.py::XGBoostInference::test_iris_classification_pandas_single_batch 
[gw7] SKIPPED apache_beam/ml/inference/xgboost_inference_it_test.py::XGBoostInference::test_iris_classification_pandas_single_batch 
apache_beam/ml/inference/xgboost_inference_it_test.py::XGBoostInference::test_iris_classification_scipy_multi_batch 
[gw7] SKIPPED apache_beam/ml/inference/xgboost_inference_it_test.py::XGBoostInference::test_iris_classification_scipy_multi_batch 
apache_beam/ml/inference/xgboost_inference_it_test.py::XGBoostInference::test_iris_classification_scipy_single_batch 
[gw7] SKIPPED apache_beam/ml/inference/xgboost_inference_it_test.py::XGBoostInference::test_iris_classification_scipy_single_batch 
apache_beam/runners/dataflow/dataflow_exercise_metrics_pipeline_test.py::ExerciseMetricsPipelineTest::test_metrics_it 
[gw7] SKIPPED apache_beam/runners/dataflow/dataflow_exercise_metrics_pipeline_test.py::ExerciseMetricsPipelineTest::test_metrics_it 
apache_beam/testing/test_stream_it_test.py::TestStreamIntegrationTests::test_basic_execution 
[gw7] SKIPPED apache_beam/testing/test_stream_it_test.py::TestStreamIntegrationTests::test_basic_execution 
apache_beam/testing/test_stream_it_test.py::TestStreamIntegrationTests::test_multiple_outputs 
[gw7] SKIPPED apache_beam/testing/test_stream_it_test.py::TestStreamIntegrationTests::test_multiple_outputs 
apache_beam/testing/test_stream_it_test.py::TestStreamIntegrationTests::test_multiple_outputs_with_watermark_advancement 
[gw7] SKIPPED apache_beam/testing/test_stream_it_test.py::TestStreamIntegrationTests::test_multiple_outputs_with_watermark_advancement 
apache_beam/transforms/external_it_test.py::ExternalTransformIT::test_job_python_from_python_it 
[gw1] PASSED apache_beam/io/gcp/bigquery_read_it_test.py::ReadTests::test_table_schema_retrieve_specifying_only_table 
apache_beam/io/gcp/bigquery_read_it_test.py::ReadTests::test_table_schema_retrieve_with_direct_read 
[gw6] PASSED apache_beam/ml/gcp/cloud_dlp_it_test.py::CloudDLPIT::test_deidentification 
apache_beam/ml/gcp/cloud_dlp_it_test.py::CloudDLPIT::test_inspection 
[gw4] PASSED apache_beam/ml/gcp/recommendations_ai_test_it.py::RecommendationAIIT::test_predict 
apache_beam/ml/gcp/visionml_test_it.py::VisionMlTestIT::test_text_detection_with_language_hint 
[gw3] PASSED apache_beam/io/gcp/bigquery_json_it_test.py::BigQueryJsonIT::test_export_read 
apache_beam/io/gcp/bigquery_json_it_test.py::BigQueryJsonIT::test_file_loads_write 
[gw3] PASSED apache_beam/io/gcp/bigquery_json_it_test.py::BigQueryJsonIT::test_file_loads_write 
apache_beam/io/gcp/bigquery_json_it_test.py::BigQueryJsonIT::test_query_read 
[gw7] PASSED apache_beam/transforms/external_it_test.py::ExternalTransformIT::test_job_python_from_python_it 
apache_beam/transforms/periodicsequence_it_test.py::PeriodicSequenceIT::test_periodicsequence_outputs_valid_watermarks_it 
[gw7] SKIPPED apache_beam/transforms/periodicsequence_it_test.py::PeriodicSequenceIT::test_periodicsequence_outputs_valid_watermarks_it 
[gw6] PASSED apache_beam/ml/gcp/cloud_dlp_it_test.py::CloudDLPIT::test_inspection 
apache_beam/ml/inference/pytorch_inference_it_test.py::PyTorchInference::test_torch_run_inference_bert_for_masked_lm 
[gw6] SKIPPED apache_beam/ml/inference/pytorch_inference_it_test.py::PyTorchInference::test_torch_run_inference_bert_for_masked_lm 
apache_beam/ml/inference/pytorch_inference_it_test.py::PyTorchInference::test_torch_run_inference_bert_for_masked_lm_large_model 
[gw6] SKIPPED apache_beam/ml/inference/pytorch_inference_it_test.py::PyTorchInference::test_torch_run_inference_bert_for_masked_lm_large_model 
apache_beam/ml/inference/pytorch_inference_it_test.py::PyTorchInference::test_torch_run_inference_coco_maskrcnn_resnet50_fpn 
[gw6] SKIPPED apache_beam/ml/inference/pytorch_inference_it_test.py::PyTorchInference::test_torch_run_inference_coco_maskrcnn_resnet50_fpn 
apache_beam/ml/inference/pytorch_inference_it_test.py::PyTorchInference::test_torch_run_inference_coco_maskrcnn_resnet50_fpn_v1_and_v2 
[gw6] SKIPPED apache_beam/ml/inference/pytorch_inference_it_test.py::PyTorchInference::test_torch_run_inference_coco_maskrcnn_resnet50_fpn_v1_and_v2 
apache_beam/ml/inference/pytorch_inference_it_test.py::PyTorchInference::test_torch_run_inference_imagenet_mobilenetv2 
[gw6] SKIPPED apache_beam/ml/inference/pytorch_inference_it_test.py::PyTorchInference::test_torch_run_inference_imagenet_mobilenetv2 
[gw3] PASSED apache_beam/io/gcp/bigquery_json_it_test.py::BigQueryJsonIT::test_query_read 
apache_beam/io/gcp/bigquery_json_it_test.py::BigQueryJsonIT::test_streaming_inserts 
[gw5] PASSED apache_beam/io/gcp/pubsub_integration_test.py::PubSubIntegrationTest::test_streaming_with_attributes 
apache_beam/ml/gcp/videointelligenceml_test_it.py::VideoIntelligenceMlTestIT::test_label_detection_with_video_context 
[gw5] SKIPPED apache_beam/ml/gcp/videointelligenceml_test_it.py::VideoIntelligenceMlTestIT::test_label_detection_with_video_context 
apache_beam/ml/inference/tensorflow_inference_it_test.py::TensorflowInference::test_tf_imagenet_image_segmentation 
[gw5] SKIPPED apache_beam/ml/inference/tensorflow_inference_it_test.py::TensorflowInference::test_tf_imagenet_image_segmentation 
apache_beam/ml/inference/tensorflow_inference_it_test.py::TensorflowInference::test_tf_mnist_classification 
[gw5] SKIPPED apache_beam/ml/inference/tensorflow_inference_it_test.py::TensorflowInference::test_tf_mnist_classification 
apache_beam/ml/inference/tensorflow_inference_it_test.py::TensorflowInference::test_tf_mnist_classification_large_model 
[gw5] SKIPPED apache_beam/ml/inference/tensorflow_inference_it_test.py::TensorflowInference::test_tf_mnist_classification_large_model 
apache_beam/ml/inference/tensorflow_inference_it_test.py::TensorflowInference::test_tf_mnist_with_weights_classification 
[gw5] SKIPPED apache_beam/ml/inference/tensorflow_inference_it_test.py::TensorflowInference::test_tf_mnist_with_weights_classification 
[gw1] PASSED apache_beam/io/gcp/bigquery_read_it_test.py::ReadTests::test_table_schema_retrieve_with_direct_read 
apache_beam/io/gcp/bigquery_read_it_test.py::ReadUsingStorageApiTests::test_iobase_source 
[gw4] PASSED apache_beam/ml/gcp/visionml_test_it.py::VisionMlTestIT::test_text_detection_with_language_hint 
apache_beam/ml/inference/sklearn_inference_it_test.py::SklearnInference::test_sklearn_mnist_classification 
[gw0] PASSED apache_beam/io/gcp/datastore/v1new/datastore_write_it_test.py::DatastoreWriteIT::test_datastore_write_limit 
apache_beam/io/gcp/healthcare/dicomio_integration_test.py::DICOMIoIntegrationTest::test_dicom_search_instances 
[gw2] PASSED apache_beam/io/gcp/bigquery_test.py::PubSubBigQueryIT::test_streaming_inserts 
apache_beam/io/gcp/bigquery_test.py::BigQueryFileLoadsIntegrationTests::test_avro_file_load 
[gw1] PASSED apache_beam/io/gcp/bigquery_read_it_test.py::ReadUsingStorageApiTests::test_iobase_source 
apache_beam/io/gcp/bigquery_read_it_test.py::ReadUsingStorageApiTests::test_iobase_source_with_column_selection 
[gw4] PASSED apache_beam/ml/inference/sklearn_inference_it_test.py::SklearnInference::test_sklearn_mnist_classification 
apache_beam/ml/inference/sklearn_inference_it_test.py::SklearnInference::test_sklearn_mnist_classification_large_model 
[gw0] PASSED apache_beam/io/gcp/healthcare/dicomio_integration_test.py::DICOMIoIntegrationTest::test_dicom_search_instances 
apache_beam/io/gcp/healthcare/dicomio_integration_test.py::DICOMIoIntegrationTest::test_dicom_store_instance_from_gcs 
[gw3] PASSED apache_beam/io/gcp/bigquery_json_it_test.py::BigQueryJsonIT::test_streaming_inserts 
[gw1] PASSED apache_beam/io/gcp/bigquery_read_it_test.py::ReadUsingStorageApiTests::test_iobase_source_with_column_selection 
apache_beam/io/gcp/bigquery_read_it_test.py::ReadUsingStorageApiTests::test_iobase_source_with_column_selection_and_row_restriction 
[gw2] PASSED apache_beam/io/gcp/bigquery_test.py::BigQueryFileLoadsIntegrationTests::test_avro_file_load 
apache_beam/ml/inference/vertex_ai_inference_it_test.py::VertexAIInference::test_vertex_ai_run_llm_text_classification 
[gw4] PASSED apache_beam/ml/inference/sklearn_inference_it_test.py::SklearnInference::test_sklearn_mnist_classification_large_model 
apache_beam/ml/inference/sklearn_inference_it_test.py::SklearnInference::test_sklearn_regression 
[gw0] PASSED apache_beam/io/gcp/healthcare/dicomio_integration_test.py::DICOMIoIntegrationTest::test_dicom_store_instance_from_gcs 
[gw1] PASSED apache_beam/io/gcp/bigquery_read_it_test.py::ReadUsingStorageApiTests::test_iobase_source_with_column_selection_and_row_restriction 
apache_beam/io/gcp/bigquery_read_it_test.py::ReadUsingStorageApiTests::test_iobase_source_with_column_selection_and_row_restriction_rows 
[gw2] PASSED apache_beam/ml/inference/vertex_ai_inference_it_test.py::VertexAIInference::test_vertex_ai_run_llm_text_classification 
[gw4] PASSED apache_beam/ml/inference/sklearn_inference_it_test.py::SklearnInference::test_sklearn_regression 
[gw1] PASSED apache_beam/io/gcp/bigquery_read_it_test.py::ReadUsingStorageApiTests::test_iobase_source_with_column_selection_and_row_restriction_rows 
apache_beam/io/gcp/bigquery_read_it_test.py::ReadUsingStorageApiTests::test_iobase_source_with_native_datetime 
[gw1] PASSED apache_beam/io/gcp/bigquery_read_it_test.py::ReadUsingStorageApiTests::test_iobase_source_with_native_datetime 
apache_beam/io/gcp/bigquery_read_it_test.py::ReadUsingStorageApiTests::test_iobase_source_with_query 
[gw1] PASSED apache_beam/io/gcp/bigquery_read_it_test.py::ReadUsingStorageApiTests::test_iobase_source_with_query 
apache_beam/io/gcp/bigquery_read_it_test.py::ReadUsingStorageApiTests::test_iobase_source_with_query_and_filters 
[gw1] PASSED apache_beam/io/gcp/bigquery_read_it_test.py::ReadUsingStorageApiTests::test_iobase_source_with_query_and_filters 
apache_beam/io/gcp/bigquery_read_it_test.py::ReadUsingStorageApiTests::test_iobase_source_with_row_restriction 
[gw1] PASSED apache_beam/io/gcp/bigquery_read_it_test.py::ReadUsingStorageApiTests::test_iobase_source_with_row_restriction 
apache_beam/io/gcp/bigquery_read_it_test.py::ReadUsingStorageApiTests::test_iobase_source_with_very_selective_filters 
[gw1] PASSED apache_beam/io/gcp/bigquery_read_it_test.py::ReadUsingStorageApiTests::test_iobase_source_with_very_selective_filters 
apache_beam/io/gcp/bigquery_read_it_test.py::ReadNewTypesTests::test_iobase_source 
[gw1] PASSED apache_beam/io/gcp/bigquery_read_it_test.py::ReadNewTypesTests::test_iobase_source 
apache_beam/io/gcp/bigquery_read_it_test.py::ReadNewTypesTests::test_native_source 
[gw1] PASSED apache_beam/io/gcp/bigquery_read_it_test.py::ReadNewTypesTests::test_native_source 
apache_beam/io/gcp/bigquery_read_it_test.py::ReadAllBQTests::test_read_queries 
[gw1] PASSED apache_beam/io/gcp/bigquery_read_it_test.py::ReadAllBQTests::test_read_queries 
apache_beam/io/gcp/bigquery_read_it_test.py::ReadInteractiveRunnerTests::test_read_in_interactive_runner 
[gw1] PASSED apache_beam/io/gcp/bigquery_read_it_test.py::ReadInteractiveRunnerTests::test_read_in_interactive_runner 

=============================== warnings summary ===============================
apache_beam/ml/inference/vertex_ai_inference_it_test.py:68
apache_beam/ml/inference/vertex_ai_inference_it_test.py:68
apache_beam/ml/inference/vertex_ai_inference_it_test.py:68
apache_beam/ml/inference/vertex_ai_inference_it_test.py:68
apache_beam/ml/inference/vertex_ai_inference_it_test.py:68
apache_beam/ml/inference/vertex_ai_inference_it_test.py:68
apache_beam/ml/inference/vertex_ai_inference_it_test.py:68
apache_beam/ml/inference/vertex_ai_inference_it_test.py:68
  <https://ci-beam.apache.org/job/beam_PostCommit_Python38/ws/src/sdks/python/apache_beam/ml/inference/vertex_ai_inference_it_test.py>:68: PytestUnknownMarkWarning: Unknown pytest.mark.uses_vertex_ai - is this a typo?  You can register custom marks to avoid this warning - for details, see https://docs.pytest.org/en/stable/how-to/mark.html
    @pytest.mark.uses_vertex_ai

apache_beam/examples/complete/game/game_stats_it_test.py::GameStatsIT::test_game_stats_it
apache_beam/examples/complete/game/hourly_team_score_it_test.py::HourlyTeamScoreIT::test_hourly_team_score_it
apache_beam/examples/complete/game/leader_board_it_test.py::LeaderBoardIT::test_leader_board_it
apache_beam/io/gcp/bigquery_test.py::PubSubBigQueryIT::test_file_loads
apache_beam/io/gcp/bigquery_test.py::PubSubBigQueryIT::test_streaming_inserts
  <https://ci-beam.apache.org/job/beam_PostCommit_Python38/ws/src/sdks/python/apache_beam/io/gcp/tests/utils.py>:63: PendingDeprecationWarning: Client.dataset is deprecated and will be removed in a future version. Use a string like 'my_project.my_dataset' or a cloud.google.bigquery.DatasetReference object, instead.
    dataset_ref = client.dataset(unique_dataset_name, project=project)

apache_beam/examples/cookbook/bigquery_tornadoes_it_test.py::BigqueryTornadoesIT::test_bigquery_tornadoes_it
  <https://ci-beam.apache.org/job/beam_PostCommit_Python38/ws/src/sdks/python/apache_beam/io/gcp/tests/utils.py>:100: PendingDeprecationWarning: Client.dataset is deprecated and will be removed in a future version. Use a string like 'my_project.my_dataset' or a cloud.google.bigquery.DatasetReference object, instead.
    table_ref = client.dataset(dataset_id).table(table_id)

apache_beam/examples/dataframe/flight_delays_it_test.py::FlightDelaysTest::test_flight_delays
  <https://ci-beam.apache.org/job/beam_PostCommit_Python38/ws/src/sdks/python/apache_beam/examples/dataframe/flight_delays.py>:47: FutureWarning: The default value of numeric_only in DataFrame.mean is deprecated. In a future version, it will default to False. In addition, specifying 'numeric_only=None' is deprecated. Select only valid columns or specify the value of numeric_only to silence this warning.
    return airline_df[at_top_airports].mean()

apache_beam/io/gcp/bigquery_read_it_test.py::ReadTests::test_native_source
  <https://ci-beam.apache.org/job/beam_PostCommit_Python38/ws/src/sdks/python/apache_beam/io/gcp/bigquery_read_it_test.py>:170: BeamDeprecationWarning: BigQuerySource is deprecated since 2.25.0. Use ReadFromBigQuery instead.
    beam.io.BigQuerySource(query=self.query, use_standard_sql=True)))

apache_beam/io/gcp/bigquery_read_it_test.py::ReadNewTypesTests::test_native_source
  <https://ci-beam.apache.org/job/beam_PostCommit_Python38/ws/src/sdks/python/apache_beam/io/gcp/bigquery_read_it_test.py>:706: BeamDeprecationWarning: BigQuerySource is deprecated since 2.25.0. Use ReadFromBigQuery instead.
    beam.io.BigQuerySource(query=self.query, use_standard_sql=True)))

-- Docs: https://docs.pytest.org/en/stable/how-to/capture-warnings.html
- generated xml file: <https://ci-beam.apache.org/job/beam_PostCommit_Python38/ws/src/sdks/python/pytest_postCommitIT-df-py38.xml> -
=========== 89 passed, 49 skipped, 17 warnings in 9449.08s (2:37:29) ===========

FAILURE: Build failed with an exception.

* Where:
Script '<https://ci-beam.apache.org/job/beam_PostCommit_Python38/ws/src/sdks/python/test-suites/dataflow/common.gradle'> line: 420

* What went wrong:
Execution failed for task ':sdks:python:test-suites:dataflow:py38:tensorRTtests'.
> Process 'command 'sh'' finished with non-zero exit value 1

* Try:
> Run with --stacktrace option to get the stack trace.
> Run with --info or --debug option to get more log output.
> Get more help at https://help.gradle.org.

Deprecated Gradle features were used in this build, making it incompatible with Gradle 9.0.

You can use '--warning-mode all' to show the individual deprecation warnings and determine if they come from your own scripts or plugins.

For more on this, please refer to https://docs.gradle.org/8.3/userguide/command_line_interface.html#sec:command_line_warnings in the Gradle documentation.

BUILD FAILED in 3h 9m 58s
221 actionable tasks: 169 executed, 48 from cache, 4 up-to-date

Publishing build scan...
https://ge.apache.org/s/nugyy45emcui2

Build step 'Invoke Gradle script' changed build result to FAILURE
Build step 'Invoke Gradle script' marked build as failure

---------------------------------------------------------------------
To unsubscribe, e-mail: builds-unsubscribe@beam.apache.org
For additional commands, e-mail: builds-help@beam.apache.org


Jenkins build is back to normal : beam_PostCommit_Python38 #4726

Posted by Apache Jenkins Server <je...@builds.apache.org>.
See <https://ci-beam.apache.org/job/beam_PostCommit_Python38/4726/display/redirect>


---------------------------------------------------------------------
To unsubscribe, e-mail: builds-unsubscribe@beam.apache.org
For additional commands, e-mail: builds-help@beam.apache.org