You are viewing a plain text version of this content. The canonical link for it is here.
Posted to commits@myfaces.apache.org by "Continuum@myfaces.zones.apache.org" <mr...@myfaces.zones.apache.org> on 2006/09/20 20:58:13 UTC

[continuum] BUILD FAILURE: Maven Apt Plugin

Online report : http://myfaces.zones.apache.org:8080/continuum/servlet/continuum/target/ProjectBuild.vm/view/ProjectBuild/id/31/buildId/4300
Build statistics:
  State: Failed
  Previous State: Ok
  Started at: Wed, 20 Sep 2006 18:57:31 +0000
  Finished at: Wed, 20 Sep 2006 18:58:13 +0000
  Total time: 41s
  Build Trigger: Forced
  Exit code: 1
  Building machine hostname: myfaces.zones.apache.org
  Operating system : SunOS(unknown)
  Java version : 1.5.0_07(Sun Microsystems Inc.)

Changes
      No files changed
  
****************************************************************************
Output:
****************************************************************************
[INFO] Scanning for projects...
[INFO] ----------------------------------------------------------------------------
[INFO] Building Maven Apt Plugin
[INFO]    task-segment: [clean, install, deploy, site-deploy]
[INFO] ----------------------------------------------------------------------------
[INFO] [clean:clean]
[INFO] Deleting directory /local/continuum-1.0.3-SNAPSHOT/apps/continuum/working-directory/31/target
[INFO] Deleting directory /local/continuum-1.0.3-SNAPSHOT/apps/continuum/working-directory/31/target/classes
[INFO] Deleting directory /local/continuum-1.0.3-SNAPSHOT/apps/continuum/working-directory/31/target/test-classes
[INFO] [cobertura:clean {execution: clean}]
[INFO] [plugin:descriptor]
[INFO] Using 2 extractors.
[INFO] Applying extractor for language: java
[INFO] Extractor for language: java found 2 mojo descriptors.
[INFO] Applying extractor for language: bsh
[INFO] Extractor for language: bsh found 0 mojo descriptors.
[INFO] [resources:resources]
[INFO] Using default encoding to copy filtered resources.
[WARNING] 
	Artifact junit:junit:jar:3.8.1:test retains local scope 'test' overriding broader scope 'compile'
	given by a dependency. If this is not intended, modify or remove the local scope.

[INFO] [compiler:compile]
Compiling 4 source files to /local/continuum-1.0.3-SNAPSHOT/apps/continuum/working-directory/31/target/classes
[INFO] [resources:testResources]
[INFO] Using default encoding to copy filtered resources.
[INFO] [compiler:testCompile]
[INFO] No sources to compile
[INFO] [surefire:test]
[INFO] No tests to run.
[INFO] [jar:jar]
[INFO] Building jar: /local/continuum-1.0.3-SNAPSHOT/apps/continuum/working-directory/31/target/maven-apt-plugin-1.0.9-SNAPSHOT.jar
[INFO] [plugin:addPluginArtifactMetadata]
[INFO] [install:install]
[INFO] Installing /local/continuum-1.0.3-SNAPSHOT/apps/continuum/working-directory/31/target/maven-apt-plugin-1.0.9-SNAPSHOT.jar to /export/home/mrmaven/.m2/repository/org/apache/myfaces/tobago/maven-apt-plugin/1.0.9-SNAPSHOT/maven-apt-plugin-1.0.9-SNAPSHOT.jar
[INFO] [plugin:updateRegistry]
[INFO] [plugin:descriptor]
[INFO] Using 2 extractors.
[INFO] Applying extractor for language: java
[INFO] Extractor for language: java found 2 mojo descriptors.
[INFO] Applying extractor for language: bsh
[INFO] Extractor for language: bsh found 0 mojo descriptors.
[INFO] [resources:resources]
[INFO] Using default encoding to copy filtered resources.
[INFO] [compiler:compile]
[INFO] Nothing to compile - all classes are up to date
[INFO] [resources:testResources]
[INFO] Using default encoding to copy filtered resources.
[INFO] [compiler:testCompile]
[INFO] No sources to compile
[INFO] [surefire:test]
[INFO] No tests to run.
[INFO] [jar:jar]
[INFO] [plugin:addPluginArtifactMetadata]
[INFO] [install:install]
[INFO] Installing /local/continuum-1.0.3-SNAPSHOT/apps/continuum/working-directory/31/target/maven-apt-plugin-1.0.9-SNAPSHOT.jar to /export/home/mrmaven/.m2/repository/org/apache/myfaces/tobago/maven-apt-plugin/1.0.9-SNAPSHOT/maven-apt-plugin-1.0.9-SNAPSHOT.jar
[INFO] [plugin:updateRegistry]
[INFO] [deploy:deploy]
[INFO] Retrieving previous build number from apache-maven-snapshots
Uploading: scpexe://minotaur.apache.org/www/people.apache.org/repo/m2-snapshot-repository/org/apache/myfaces/tobago/maven-apt-plugin/1.0.9-SNAPSHOT/maven-apt-plugin-1.0.9-SNAPSHOT.jar
[INFO] Retrieving previous metadata from apache-maven-snapshots
[INFO] Uploading repository metadata for: 'snapshot org.apache.myfaces.tobago:maven-apt-plugin:1.0.9-SNAPSHOT'
[INFO] Retrieving previous metadata from apache-maven-snapshots
[INFO] Uploading repository metadata for: 'artifact org.apache.myfaces.tobago:maven-apt-plugin'
[INFO] Retrieving previous metadata from apache-maven-snapshots
[INFO] Uploading project information for maven-apt-plugin 1.0.9-SNAPSHOT
[INFO] Retrieving previous metadata from apache-maven-snapshots
[INFO] Uploading repository metadata for: 'org.apache.myfaces.tobago'
[INFO] Setting property: classpath.resource.loader.class => 'org.codehaus.plexus.velocity.ContextClassLoaderResourceLoader'.
[INFO] Setting property: velocimacro.messages.on => 'false'.
[INFO] Setting property: resource.loader => 'classpath'.
[INFO] Setting property: resource.manager.logwhenfound => 'false'.
[INFO] ************************************************************** 
[INFO] Starting Jakarta Velocity v1.4
[INFO] RuntimeInstance initializing.
[INFO] Default Properties File: org/apache/velocity/runtime/defaults/velocity.properties
[INFO] Default ResourceManager initializing. (class org.apache.velocity.runtime.resource.ResourceManagerImpl)
[INFO] Resource Loader Instantiated: org.codehaus.plexus.velocity.ContextClassLoaderResourceLoader
[INFO] ClasspathResourceLoader : initialization starting.
[INFO] ClasspathResourceLoader : initialization complete.
[INFO] ResourceCache : initialized. (class org.apache.velocity.runtime.resource.ResourceCacheImpl)
[INFO] Default ResourceManager initialization complete.
[INFO] Loaded System Directive: org.apache.velocity.runtime.directive.Literal
[INFO] Loaded System Directive: org.apache.velocity.runtime.directive.Macro
[INFO] Loaded System Directive: org.apache.velocity.runtime.directive.Parse
[INFO] Loaded System Directive: org.apache.velocity.runtime.directive.Include
[INFO] Loaded System Directive: org.apache.velocity.runtime.directive.Foreach
[INFO] Created: 20 parsers.
[INFO] Velocimacro : initialization starting.
[INFO] Velocimacro : adding VMs from VM library template : VM_global_library.vm
[ERROR] ResourceManager : unable to find resource 'VM_global_library.vm' in any resource loader.
[INFO] Velocimacro : error using  VM library template VM_global_library.vm : org.apache.velocity.exception.ResourceNotFoundException: Unable to find resource 'VM_global_library.vm'
[INFO] Velocimacro :  VM library template macro registration complete.
[INFO] Velocimacro : allowInline = true : VMs can be defined inline in templates
[INFO] Velocimacro : allowInlineToOverride = false : VMs defined inline may NOT replace previous VM definitions
[INFO] Velocimacro : allowInlineLocal = false : VMs defined inline will be  global in scope if allowed.
[INFO] Velocimacro : initialization complete.
[INFO] Velocity successfully started.
[INFO] Setting property: classpath.resource.loader.class => 'org.codehaus.plexus.velocity.ContextClassLoaderResourceLoader'.
[INFO] Setting property: velocimacro.messages.on => 'false'.
[INFO] Setting property: resource.loader => 'classpath'.
[INFO] Setting property: resource.manager.logwhenfound => 'false'.
[INFO] ************************************************************** 
[INFO] Starting Jakarta Velocity v1.4
[INFO] RuntimeInstance initializing.
[INFO] Default Properties File: org/apache/velocity/runtime/defaults/velocity.properties
[INFO] Default ResourceManager initializing. (class org.apache.velocity.runtime.resource.ResourceManagerImpl)
[INFO] Resource Loader Instantiated: org.codehaus.plexus.velocity.ContextClassLoaderResourceLoader
[INFO] ClasspathResourceLoader : initialization starting.
[INFO] ClasspathResourceLoader : initialization complete.
[INFO] ResourceCache : initialized. (class org.apache.velocity.runtime.resource.ResourceCacheImpl)
[INFO] Default ResourceManager initialization complete.
[INFO] Loaded System Directive: org.apache.velocity.runtime.directive.Literal
[INFO] Loaded System Directive: org.apache.velocity.runtime.directive.Macro
[INFO] Loaded System Directive: org.apache.velocity.runtime.directive.Parse
[INFO] Loaded System Directive: org.apache.velocity.runtime.directive.Include
[INFO] Loaded System Directive: org.apache.velocity.runtime.directive.Foreach
[INFO] Created: 20 parsers.
[INFO] Velocimacro : initialization starting.
[INFO] Velocimacro : adding VMs from VM library template : VM_global_library.vm
[ERROR] ResourceManager : unable to find resource 'VM_global_library.vm' in any resource loader.
[INFO] Velocimacro : error using  VM library template VM_global_library.vm : org.apache.velocity.exception.ResourceNotFoundException: Unable to find resource 'VM_global_library.vm'
[INFO] Velocimacro :  VM library template macro registration complete.
[INFO] Velocimacro : allowInline = true : VMs can be defined inline in templates
[INFO] Velocimacro : allowInlineToOverride = false : VMs defined inline may NOT replace previous VM definitions
[INFO] Velocimacro : allowInlineLocal = false : VMs defined inline will be  global in scope if allowed.
[INFO] Velocimacro : initialization complete.
[INFO] Velocity successfully started.
[INFO] Setting property: classpath.resource.loader.class => 'org.codehaus.plexus.velocity.ContextClassLoaderResourceLoader'.
[INFO] Setting property: velocimacro.messages.on => 'false'.
[INFO] Setting property: resource.loader => 'classpath'.
[INFO] Setting property: resource.manager.logwhenfound => 'false'.
[INFO] ************************************************************** 
[INFO] Starting Jakarta Velocity v1.4
[INFO] RuntimeInstance initializing.
[INFO] Default Properties File: org/apache/velocity/runtime/defaults/velocity.properties
[INFO] Default ResourceManager initializing. (class org.apache.velocity.runtime.resource.ResourceManagerImpl)
[INFO] Resource Loader Instantiated: org.codehaus.plexus.velocity.ContextClassLoaderResourceLoader
[INFO] ClasspathResourceLoader : initialization starting.
[INFO] ClasspathResourceLoader : initialization complete.
[INFO] ResourceCache : initialized. (class org.apache.velocity.runtime.resource.ResourceCacheImpl)
[INFO] Default ResourceManager initialization complete.
[INFO] Loaded System Directive: org.apache.velocity.runtime.directive.Literal
[INFO] Loaded System Directive: org.apache.velocity.runtime.directive.Macro
[INFO] Loaded System Directive: org.apache.velocity.runtime.directive.Parse
[INFO] Loaded System Directive: org.apache.velocity.runtime.directive.Include
[INFO] Loaded System Directive: org.apache.velocity.runtime.directive.Foreach
[INFO] Created: 20 parsers.
[INFO] Velocimacro : initialization starting.
[INFO] Velocimacro : adding VMs from VM library template : VM_global_library.vm
[ERROR] ResourceManager : unable to find resource 'VM_global_library.vm' in any resource loader.
[INFO] Velocimacro : error using  VM library template VM_global_library.vm : org.apache.velocity.exception.ResourceNotFoundException: Unable to find resource 'VM_global_library.vm'
[INFO] Velocimacro :  VM library template macro registration complete.
[INFO] Velocimacro : allowInline = true : VMs can be defined inline in templates
[INFO] Velocimacro : allowInlineToOverride = false : VMs defined inline may NOT replace previous VM definitions
[INFO] Velocimacro : allowInlineLocal = false : VMs defined inline will be  global in scope if allowed.
[INFO] Velocimacro : initialization complete.
[INFO] Velocity successfully started.
[INFO] Setting property: classpath.resource.loader.class => 'org.codehaus.plexus.velocity.ContextClassLoaderResourceLoader'.
[INFO] Setting property: velocimacro.messages.on => 'false'.
[INFO] Setting property: resource.loader => 'classpath'.
[INFO] Setting property: resource.manager.logwhenfound => 'false'.
[INFO] Preparing javadoc:javadoc
[INFO] No goals needed for project - skipping
[INFO] Preparing surefire-report:report
[INFO] [plugin:descriptor]
[INFO] Using 2 extractors.
[INFO] Applying extractor for language: java
[INFO] Extractor for language: java found 2 mojo descriptors.
[INFO] Applying extractor for language: bsh
[INFO] Extractor for language: bsh found 0 mojo descriptors.
[INFO] [resources:resources]
[INFO] Using default encoding to copy filtered resources.
[INFO] [compiler:compile]
[INFO] Nothing to compile - all classes are up to date
[INFO] [resources:testResources]
[INFO] Using default encoding to copy filtered resources.
[INFO] [compiler:testCompile]
[INFO] No sources to compile
[INFO] [surefire:test]
[INFO] No tests to run.
[INFO] Preparing cobertura:cobertura
[INFO] [plugin:descriptor]
[INFO] Using 2 extractors.
[INFO] Applying extractor for language: java
[INFO] Extractor for language: java found 2 mojo descriptors.
[INFO] Applying extractor for language: bsh
[INFO] Extractor for language: bsh found 0 mojo descriptors.
[INFO] [resources:resources]
[INFO] Using default encoding to copy filtered resources.
[INFO] [compiler:compile]
[INFO] Nothing to compile - all classes are up to date
[INFO] [cobertura:instrument]
[INFO] Cobertura 1.7 - GNU GPL License (NO WARRANTY) - See COPYRIGHT file
Instrumenting 6 classes to /local/continuum-1.0.3-SNAPSHOT/apps/continuum/working-directory/31/target/generated-classes/cobertura
Cobertura: Saved information on 4 classes.
Instrument time: 365ms

[INFO] Instrumentation was successful.
[INFO] [resources:testResources]
[INFO] Using default encoding to copy filtered resources.
[INFO] [compiler:testCompile]
[INFO] No sources to compile
[INFO] [surefire:test]
[INFO] No tests to run.
[INFO] Preparing findbugs:findbugs
[INFO] [plugin:descriptor]
[INFO] Using 2 extractors.
[INFO] Applying extractor for language: java
[INFO] Extractor for language: java found 2 mojo descriptors.
[INFO] Applying extractor for language: bsh
[INFO] Extractor for language: bsh found 0 mojo descriptors.
[INFO] [resources:resources]
[INFO] Using default encoding to copy filtered resources.
[INFO] [compiler:compile]
[INFO] Nothing to compile - all classes are up to date
[INFO] Preparing jdepend:generate
[INFO] [plugin:descriptor]
[INFO] Using 2 extractors.
[INFO] Applying extractor for language: java
[INFO] Extractor for language: java found 2 mojo descriptors.
[INFO] Applying extractor for language: bsh
[INFO] Extractor for language: bsh found 0 mojo descriptors.
[INFO] [resources:resources]
[INFO] Using default encoding to copy filtered resources.
[INFO] [compiler:compile]
[INFO] Nothing to compile - all classes are up to date
[INFO] Setting property: classpath.resource.loader.class => 'org.codehaus.plexus.velocity.ContextClassLoaderResourceLoader'.
[INFO] Setting property: velocimacro.messages.on => 'false'.
[INFO] Setting property: resource.loader => 'classpath'.
[INFO] Setting property: resource.manager.logwhenfound => 'false'.
[INFO] [site:site]
[WARNING] Unable to load parent project from repository: Could not find the model file '/local/continuum-1.0.3-SNAPSHOT/apps/continuum/working-directory/31/../pom.xml'.
Downloading: http://people.apache.org/repo/m2-snapshot-repository/org/apache/myfaces/tobago/tobago-tool/1.0.9-SNAPSHOT/tobago-tool-1.0.9-SNAPSHOT-site_en.xml
[WARNING] Unable to get resource from repository apache.snapshots (http://people.apache.org/repo/m2-snapshot-repository)
Downloading: http://people.apache.org/repo/m2-snapshot-repository/org/apache/myfaces/tobago/tobago-tool/1.0.9-SNAPSHOT/tobago-tool-1.0.9-SNAPSHOT-site.xml
[WARNING] Unable to get resource from repository apache.snapshots (http://people.apache.org/repo/m2-snapshot-repository)
Downloading: http://people.apache.org/repo/m2-snapshot-repository/org/apache/myfaces/tobago/tobago/1.0.9-SNAPSHOT/tobago-1.0.9-SNAPSHOT-site_en.xml
[WARNING] Unable to get resource from repository apache.snapshots (http://people.apache.org/repo/m2-snapshot-repository)
Downloading: http://people.apache.org/repo/m2-snapshot-repository/org/apache/myfaces/maven/tobago-site-skin/1.0.5-SNAPSHOT/tobago-site-skin-1.0.5-SNAPSHOT.jar
[WARNING] Unable to get resource from repository apache.snapshots (http://people.apache.org/repo/m2-snapshot-repository)
[INFO] ------------------------------------------------------------------------
[ERROR] BUILD FAILURE
[INFO] ------------------------------------------------------------------------
[INFO] The skin does not exist: Unable to download the artifact from any repository

Try downloading the file manually from the project website.

Then, install it using the command: 
    mvn install:install-file -DgroupId=org.apache.myfaces.maven -DartifactId=tobago-site-skin \
        -Dversion=1.0.5-SNAPSHOT -Dpackaging=jar -Dfile=/path/to/file


  org.apache.myfaces.maven:tobago-site-skin:jar:1.0.5-SNAPSHOT

from the specified remote repositories:
  central (http://repo1.maven.org/maven2),
  apache.snapshots (http://people.apache.org/repo/m2-snapshot-repository)

[INFO] ------------------------------------------------------------------------
[INFO] For more information, run Maven with the -e switch
[INFO] ------------------------------------------------------------------------
[INFO] Total time: 40 seconds
[INFO] Finished at: Wed Sep 20 18:58:12 GMT+00:00 2006
[INFO] Final Memory: 29M/336M
[INFO] ------------------------------------------------------------------------

****************************************************************************