You are viewing a plain text version of this content. The canonical link for it is here.
Posted to dev@kafka.apache.org by Apache Jenkins Server <je...@builds.apache.org> on 2017/08/21 17:45:17 UTC
Build failed in Jenkins: kafka-trunk-jdk7 #2657
See <https://builds.apache.org/job/kafka-trunk-jdk7/2657/display/redirect?page=changes>
Changes:
[ismael] KAFKA-5753; ShellTest.testRunProgramWithErrorReturn fails on macOS
------------------------------------------
[...truncated 919.67 KB...]
kafka.server.ControlledShutdownLeaderSelectorTest > testSelectLeader STARTED
kafka.server.ControlledShutdownLeaderSelectorTest > testSelectLeader PASSED
kafka.server.MetadataCacheTest > getTopicMetadataWithNonSupportedSecurityProtocol STARTED
kafka.server.MetadataCacheTest > getTopicMetadataWithNonSupportedSecurityProtocol PASSED
kafka.server.MetadataCacheTest > getTopicMetadataIsrNotAvailable STARTED
kafka.server.MetadataCacheTest > getTopicMetadataIsrNotAvailable PASSED
kafka.server.MetadataCacheTest > getTopicMetadata STARTED
kafka.server.MetadataCacheTest > getTopicMetadata PASSED
kafka.server.MetadataCacheTest > getTopicMetadataReplicaNotAvailable STARTED
kafka.server.MetadataCacheTest > getTopicMetadataReplicaNotAvailable PASSED
kafka.server.MetadataCacheTest > getTopicMetadataPartitionLeaderNotAvailable STARTED
kafka.server.MetadataCacheTest > getTopicMetadataPartitionLeaderNotAvailable PASSED
kafka.server.MetadataCacheTest > getAliveBrokersShouldNotBeMutatedByUpdateCache STARTED
kafka.server.MetadataCacheTest > getAliveBrokersShouldNotBeMutatedByUpdateCache PASSED
kafka.server.MetadataCacheTest > getTopicMetadataNonExistingTopics STARTED
kafka.server.MetadataCacheTest > getTopicMetadataNonExistingTopics PASSED
kafka.server.FetchRequestTest > testBrokerRespectsPartitionsOrderAndSizeLimits STARTED
kafka.server.FetchRequestTest > testBrokerRespectsPartitionsOrderAndSizeLimits PASSED
kafka.server.FetchRequestTest > testDownConversionFromBatchedToUnbatchedRespectsOffset STARTED
kafka.server.FetchRequestTest > testDownConversionFromBatchedToUnbatchedRespectsOffset PASSED
kafka.server.FetchRequestTest > testFetchRequestV2WithOversizedMessage STARTED
kafka.server.FetchRequestTest > testFetchRequestV2WithOversizedMessage PASSED
kafka.server.checkpoints.OffsetCheckpointFileTest > shouldReturnEmptyMapForEmptyFile STARTED
kafka.server.checkpoints.OffsetCheckpointFileTest > shouldReturnEmptyMapForEmptyFile PASSED
kafka.server.checkpoints.OffsetCheckpointFileTest > shouldThrowIfVersionIsNotRecognised STARTED
kafka.server.checkpoints.OffsetCheckpointFileTest > shouldThrowIfVersionIsNotRecognised PASSED
kafka.server.checkpoints.OffsetCheckpointFileTest > shouldPersistAndOverwriteAndReloadFile STARTED
kafka.server.checkpoints.OffsetCheckpointFileTest > shouldPersistAndOverwriteAndReloadFile PASSED
kafka.server.checkpoints.OffsetCheckpointFileTest > shouldHandleMultipleLines STARTED
kafka.server.checkpoints.OffsetCheckpointFileTest > shouldHandleMultipleLines PASSED
kafka.server.checkpoints.LeaderEpochCheckpointFileTest > shouldPersistAndOverwriteAndReloadFile STARTED
kafka.server.checkpoints.LeaderEpochCheckpointFileTest > shouldPersistAndOverwriteAndReloadFile PASSED
kafka.server.checkpoints.LeaderEpochCheckpointFileTest > shouldRetainValuesEvenIfCheckpointIsRecreated STARTED
kafka.server.checkpoints.LeaderEpochCheckpointFileTest > shouldRetainValuesEvenIfCheckpointIsRecreated PASSED
kafka.server.ReplicaFetchTest > testReplicaFetcherThread STARTED
kafka.server.ReplicaFetchTest > testReplicaFetcherThread PASSED
kafka.server.KafkaMetricReporterClusterIdTest > testClusterIdPresent STARTED
kafka.server.KafkaMetricReporterClusterIdTest > testClusterIdPresent PASSED
unit.kafka.admin.ResetConsumerGroupOffsetTest > testResetOffsetsShiftByHigherThanLatest STARTED
unit.kafka.admin.ResetConsumerGroupOffsetTest > testResetOffsetsShiftByHigherThanLatest PASSED
unit.kafka.admin.ResetConsumerGroupOffsetTest > testResetOffsetsShiftMinus STARTED
unit.kafka.admin.ResetConsumerGroupOffsetTest > testResetOffsetsShiftMinus PASSED
unit.kafka.admin.ResetConsumerGroupOffsetTest > testResetOffsetsToCurrentOffset STARTED
unit.kafka.admin.ResetConsumerGroupOffsetTest > testResetOffsetsToCurrentOffset PASSED
unit.kafka.admin.ResetConsumerGroupOffsetTest > testResetOffsetsToEarliestOnOneTopicAndPartition STARTED
unit.kafka.admin.ResetConsumerGroupOffsetTest > testResetOffsetsToEarliestOnOneTopicAndPartition PASSED
unit.kafka.admin.ResetConsumerGroupOffsetTest > testResetOffsetsByDurationToEarliest STARTED
unit.kafka.admin.ResetConsumerGroupOffsetTest > testResetOffsetsByDurationToEarliest PASSED
unit.kafka.admin.ResetConsumerGroupOffsetTest > testResetOffsetsToEarliestOnOneTopic STARTED
unit.kafka.admin.ResetConsumerGroupOffsetTest > testResetOffsetsToEarliestOnOneTopic PASSED
unit.kafka.admin.ResetConsumerGroupOffsetTest > testResetOffsetsNotExistingGroup STARTED
unit.kafka.admin.ResetConsumerGroupOffsetTest > testResetOffsetsNotExistingGroup PASSED
unit.kafka.admin.ResetConsumerGroupOffsetTest > testResetOffsetsToZonedDateTime STARTED
unit.kafka.admin.ResetConsumerGroupOffsetTest > testResetOffsetsToZonedDateTime PASSED
unit.kafka.admin.ResetConsumerGroupOffsetTest > testResetOffsetsToEarliest STARTED
unit.kafka.admin.ResetConsumerGroupOffsetTest > testResetOffsetsToEarliest PASSED
unit.kafka.admin.ResetConsumerGroupOffsetTest > testResetOffsetsExportImportPlan STARTED
unit.kafka.admin.ResetConsumerGroupOffsetTest > testResetOffsetsExportImportPlan PASSED
unit.kafka.admin.ResetConsumerGroupOffsetTest > testResetOffsetsToSpecificOffset STARTED
unit.kafka.admin.ResetConsumerGroupOffsetTest > testResetOffsetsToSpecificOffset PASSED
unit.kafka.admin.ResetConsumerGroupOffsetTest > testResetOffsetsShiftPlus STARTED
unit.kafka.admin.ResetConsumerGroupOffsetTest > testResetOffsetsShiftPlus PASSED
unit.kafka.admin.ResetConsumerGroupOffsetTest > testResetOffsetsToLatest STARTED
unit.kafka.admin.ResetConsumerGroupOffsetTest > testResetOffsetsToLatest PASSED
unit.kafka.admin.ResetConsumerGroupOffsetTest > testResetOffsetsNewConsumerExistingTopic STARTED
unit.kafka.admin.ResetConsumerGroupOffsetTest > testResetOffsetsNewConsumerExistingTopic PASSED
unit.kafka.admin.ResetConsumerGroupOffsetTest > testResetOffsetsShiftByLowerThanEarliest STARTED
unit.kafka.admin.ResetConsumerGroupOffsetTest > testResetOffsetsShiftByLowerThanEarliest PASSED
unit.kafka.admin.ResetConsumerGroupOffsetTest > testResetOffsetsByDuration STARTED
unit.kafka.admin.ResetConsumerGroupOffsetTest > testResetOffsetsByDuration PASSED
unit.kafka.admin.ResetConsumerGroupOffsetTest > testResetOffsetsToLocalDateTime STARTED
unit.kafka.admin.ResetConsumerGroupOffsetTest > testResetOffsetsToLocalDateTime PASSED
unit.kafka.admin.ResetConsumerGroupOffsetTest > testResetOffsetsToEarliestOnTopicsAndPartitions STARTED
unit.kafka.admin.ResetConsumerGroupOffsetTest > testResetOffsetsToEarliestOnTopicsAndPartitions PASSED
unit.kafka.admin.ResetConsumerGroupOffsetTest > testResetOffsetsToEarliestOnTopics STARTED
unit.kafka.admin.ResetConsumerGroupOffsetTest > testResetOffsetsToEarliestOnTopics PASSED
unit.kafka.server.KafkaApisTest > shouldRespondWithUnsupportedForMessageFormatOnHandleWriteTxnMarkersWhenMagicLowerThanRequired STARTED
unit.kafka.server.KafkaApisTest > shouldRespondWithUnsupportedForMessageFormatOnHandleWriteTxnMarkersWhenMagicLowerThanRequired PASSED
unit.kafka.server.KafkaApisTest > shouldThrowUnsupportedVersionExceptionOnHandleTxnOffsetCommitRequestWhenInterBrokerProtocolNotSupported STARTED
unit.kafka.server.KafkaApisTest > shouldThrowUnsupportedVersionExceptionOnHandleTxnOffsetCommitRequestWhenInterBrokerProtocolNotSupported PASSED
unit.kafka.server.KafkaApisTest > shouldThrowUnsupportedVersionExceptionOnHandleAddPartitionsToTxnRequestWhenInterBrokerProtocolNotSupported STARTED
unit.kafka.server.KafkaApisTest > shouldThrowUnsupportedVersionExceptionOnHandleAddPartitionsToTxnRequestWhenInterBrokerProtocolNotSupported PASSED
unit.kafka.server.KafkaApisTest > testReadUncommittedConsumerListOffsetLatest STARTED
unit.kafka.server.KafkaApisTest > testReadUncommittedConsumerListOffsetLatest PASSED
unit.kafka.server.KafkaApisTest > shouldAppendToLogOnWriteTxnMarkersWhenCorrectMagicVersion STARTED
unit.kafka.server.KafkaApisTest > shouldAppendToLogOnWriteTxnMarkersWhenCorrectMagicVersion PASSED
unit.kafka.server.KafkaApisTest > shouldThrowUnsupportedVersionExceptionOnHandleWriteTxnMarkersRequestWhenInterBrokerProtocolNotSupported STARTED
unit.kafka.server.KafkaApisTest > shouldThrowUnsupportedVersionExceptionOnHandleWriteTxnMarkersRequestWhenInterBrokerProtocolNotSupported PASSED
unit.kafka.server.KafkaApisTest > shouldRespondWithUnknownTopicWhenPartitionIsNotHosted STARTED
unit.kafka.server.KafkaApisTest > shouldRespondWithUnknownTopicWhenPartitionIsNotHosted PASSED
unit.kafka.server.KafkaApisTest > testReadCommittedConsumerListOffsetEarliestOffsetEqualsLastStableOffset STARTED
unit.kafka.server.KafkaApisTest > testReadCommittedConsumerListOffsetEarliestOffsetEqualsLastStableOffset PASSED
unit.kafka.server.KafkaApisTest > testReadCommittedConsumerListOffsetLatest STARTED
unit.kafka.server.KafkaApisTest > testReadCommittedConsumerListOffsetLatest PASSED
unit.kafka.server.KafkaApisTest > testReadCommittedConsumerListOffsetLimitedAtLastStableOffset STARTED
unit.kafka.server.KafkaApisTest > testReadCommittedConsumerListOffsetLimitedAtLastStableOffset PASSED
unit.kafka.server.KafkaApisTest > testReadUncommittedConsumerListOffsetEarliestOffsetEqualsHighWatermark STARTED
unit.kafka.server.KafkaApisTest > testReadUncommittedConsumerListOffsetEarliestOffsetEqualsHighWatermark PASSED
unit.kafka.server.KafkaApisTest > testReadUncommittedConsumerListOffsetLimitedAtHighWatermark STARTED
unit.kafka.server.KafkaApisTest > testReadUncommittedConsumerListOffsetLimitedAtHighWatermark PASSED
unit.kafka.server.KafkaApisTest > shouldThrowUnsupportedVersionExceptionOnHandleAddOffsetToTxnRequestWhenInterBrokerProtocolNotSupported STARTED
unit.kafka.server.KafkaApisTest > shouldThrowUnsupportedVersionExceptionOnHandleAddOffsetToTxnRequestWhenInterBrokerProtocolNotSupported PASSED
unit.kafka.server.KafkaApisTest > shouldRespondWithUnsupportedMessageFormatForBadPartitionAndNoErrorsForGoodPartition STARTED
unit.kafka.server.KafkaApisTest > shouldRespondWithUnsupportedMessageFormatForBadPartitionAndNoErrorsForGoodPartition PASSED
unit.kafka.server.KafkaApisTest > shouldThrowUnsupportedVersionExceptionOnHandleEndTxnRequestWhenInterBrokerProtocolNotSupported STARTED
unit.kafka.server.KafkaApisTest > shouldThrowUnsupportedVersionExceptionOnHandleEndTxnRequestWhenInterBrokerProtocolNotSupported PASSED
unit.kafka.server.KafkaApisTest > shouldRespondWithUnknownTopicOrPartitionForBadPartitionAndNoErrorsForGoodPartition STARTED
unit.kafka.server.KafkaApisTest > shouldRespondWithUnknownTopicOrPartitionForBadPartitionAndNoErrorsForGoodPartition PASSED
1546 tests completed, 2 failed, 4 skipped
:kafka-trunk-jdk7:core:test FAILED
:test_core_2_11 FAILED
FAILURE: Build failed with an exception.
* What went wrong:
Execution failed for task ':kafka-trunk-jdk7:core:test'.
> There were failing tests. See the report at: file://<https://builds.apache.org/job/kafka-trunk-jdk7/ws/core/build/reports/tests/test/index.html>
* Try:
Run with --stacktrace option to get the stack trace. Run with --info or --debug option to get more log output.
* Get more help at https://help.gradle.org
BUILD FAILED in 55m 0s
16 actionable tasks: 3 executed, 13 up-to-date
Build step 'Execute shell' marked build as failure
[FINDBUGS] Collecting findbugs analysis files...
Setting GRADLE_3_4_RC_2_HOME=/home/jenkins/jenkins-slave/tools/hudson.plugins.gradle.GradleInstallation/Gradle_3.4-rc-2
[FINDBUGS] Searching for all files in <https://builds.apache.org/job/kafka-trunk-jdk7/ws/> that match the pattern **/build/reports/findbugs/*.xml
[FINDBUGS] Parsing 1 file in <https://builds.apache.org/job/kafka-trunk-jdk7/ws/>
[FINDBUGS] Successfully parsed file <https://builds.apache.org/job/kafka-trunk-jdk7/ws/core/build/reports/findbugs/main.xml> with 0 unique warnings and 0 duplicates.
Setting GRADLE_3_4_RC_2_HOME=/home/jenkins/jenkins-slave/tools/hudson.plugins.gradle.GradleInstallation/Gradle_3.4-rc-2
Setting GRADLE_3_4_RC_2_HOME=/home/jenkins/jenkins-slave/tools/hudson.plugins.gradle.GradleInstallation/Gradle_3.4-rc-2
<Git Blamer> Using GitBlamer to create author and commit information for all warnings.
<Git Blamer> GIT_COMMIT=8a5a84dc67e16f6ff77cc30454682b0ad6e5a878, workspace=<https://builds.apache.org/job/kafka-trunk-jdk7/ws/>
[FINDBUGS] Computing warning deltas based on reference build #2656
Recording test results
Setting GRADLE_3_4_RC_2_HOME=/home/jenkins/jenkins-slave/tools/hudson.plugins.gradle.GradleInstallation/Gradle_3.4-rc-2
Setting GRADLE_3_4_RC_2_HOME=/home/jenkins/jenkins-slave/tools/hudson.plugins.gradle.GradleInstallation/Gradle_3.4-rc-2
Not sending mail to unregistered user ismael@juma.me.uk
Jenkins build is back to normal : kafka-trunk-jdk7 #2659
Posted by Apache Jenkins Server <je...@builds.apache.org>.
See <https://builds.apache.org/job/kafka-trunk-jdk7/2659/display/redirect?page=changes>
Build failed in Jenkins: kafka-trunk-jdk7 #2658
Posted by Apache Jenkins Server <je...@builds.apache.org>.
See <https://builds.apache.org/job/kafka-trunk-jdk7/2658/display/redirect?page=changes>
Changes:
[jason] KAFKA-5747; Producer snapshot loading should cover schema errors
[ismael] KAFKA-5743; Ducktape services should use subdirs of /mnt
------------------------------------------
[...truncated 901.22 KB...]
kafka.server.epoch.LeaderEpochFileCacheTest > shouldReturnUnsupportedIfRequestedEpochLessThanFirstEpoch PASSED
kafka.server.epoch.LeaderEpochFileCacheTest > shouldReturnNextAvailableEpochIfThereIsNoExactEpochForTheOneRequested STARTED
kafka.server.epoch.LeaderEpochFileCacheTest > shouldReturnNextAvailableEpochIfThereIsNoExactEpochForTheOneRequested PASSED
kafka.server.epoch.LeaderEpochFileCacheTest > shouldAddEpochAndMessageOffsetToCache STARTED
kafka.server.epoch.LeaderEpochFileCacheTest > shouldAddEpochAndMessageOffsetToCache PASSED
kafka.server.epoch.LeaderEpochFileCacheTest > shouldDropEntriesOnEpochBoundaryWhenRemovingLatestEntries STARTED
kafka.server.epoch.LeaderEpochFileCacheTest > shouldDropEntriesOnEpochBoundaryWhenRemovingLatestEntries PASSED
kafka.server.epoch.LeaderEpochFileCacheTest > shouldUpdateSavedOffsetWhenOffsetToClearToIsBetweenEpochs STARTED
kafka.server.epoch.LeaderEpochFileCacheTest > shouldUpdateSavedOffsetWhenOffsetToClearToIsBetweenEpochs PASSED
kafka.server.epoch.LeaderEpochFileCacheTest > shouldNotResetEpochHistoryTailIfUndefinedPassed STARTED
kafka.server.epoch.LeaderEpochFileCacheTest > shouldNotResetEpochHistoryTailIfUndefinedPassed PASSED
kafka.server.epoch.LeaderEpochFileCacheTest > shouldReturnUnsupportedIfNoEpochRecorded STARTED
kafka.server.epoch.LeaderEpochFileCacheTest > shouldReturnUnsupportedIfNoEpochRecorded PASSED
kafka.server.epoch.LeaderEpochFileCacheTest > shouldRetainLatestEpochOnClearAllEarliest STARTED
kafka.server.epoch.LeaderEpochFileCacheTest > shouldRetainLatestEpochOnClearAllEarliest PASSED
kafka.server.epoch.LeaderEpochFileCacheTest > shouldPersistEpochsBetweenInstances STARTED
kafka.server.epoch.LeaderEpochFileCacheTest > shouldPersistEpochsBetweenInstances PASSED
kafka.server.epoch.LeaderEpochFileCacheTest > shouldNotClearAnythingIfOffsetToFirstOffset STARTED
kafka.server.epoch.LeaderEpochFileCacheTest > shouldNotClearAnythingIfOffsetToFirstOffset PASSED
kafka.server.epoch.LeaderEpochFileCacheTest > shouldNotLetOffsetsGoBackwardsEvenIfEpochsProgress STARTED
kafka.server.epoch.LeaderEpochFileCacheTest > shouldNotLetOffsetsGoBackwardsEvenIfEpochsProgress PASSED
kafka.server.epoch.LeaderEpochFileCacheTest > shouldGetFirstOffsetOfSubsequentEpochWhenOffsetRequestedForPreviousEpoch STARTED
kafka.server.epoch.LeaderEpochFileCacheTest > shouldGetFirstOffsetOfSubsequentEpochWhenOffsetRequestedForPreviousEpoch PASSED
kafka.server.epoch.LeaderEpochFileCacheTest > shouldUpdateOffsetBetweenEpochBoundariesOnClearEarliest2 STARTED
kafka.server.epoch.LeaderEpochFileCacheTest > shouldUpdateOffsetBetweenEpochBoundariesOnClearEarliest2 PASSED
kafka.server.epoch.LeaderEpochFileCacheTest > shouldClearEarliestOnEmptyCache STARTED
kafka.server.epoch.LeaderEpochFileCacheTest > shouldClearEarliestOnEmptyCache PASSED
kafka.server.epoch.LeaderEpochFileCacheTest > shouldPreserveResetOffsetOnClearEarliestIfOneExists STARTED
kafka.server.epoch.LeaderEpochFileCacheTest > shouldPreserveResetOffsetOnClearEarliestIfOneExists PASSED
kafka.server.epoch.LeaderEpochFileCacheTest > shouldUpdateOffsetBetweenEpochBoundariesOnClearEarliest STARTED
kafka.server.epoch.LeaderEpochFileCacheTest > shouldUpdateOffsetBetweenEpochBoundariesOnClearEarliest PASSED
kafka.server.epoch.LeaderEpochFileCacheTest > shouldReturnInvalidOffsetIfEpochIsRequestedWhichIsNotCurrentlyTracked STARTED
kafka.server.epoch.LeaderEpochFileCacheTest > shouldReturnInvalidOffsetIfEpochIsRequestedWhichIsNotCurrentlyTracked PASSED
kafka.server.epoch.LeaderEpochFileCacheTest > shouldFetchEndOffsetOfEmptyCache STARTED
kafka.server.epoch.LeaderEpochFileCacheTest > shouldFetchEndOffsetOfEmptyCache PASSED
kafka.server.epoch.LeaderEpochFileCacheTest > shouldRetainLatestEpochOnClearAllEarliestAndUpdateItsOffset STARTED
kafka.server.epoch.LeaderEpochFileCacheTest > shouldRetainLatestEpochOnClearAllEarliestAndUpdateItsOffset PASSED
kafka.server.epoch.LeaderEpochFileCacheTest > shouldClearAllEntries STARTED
kafka.server.epoch.LeaderEpochFileCacheTest > shouldClearAllEntries PASSED
kafka.server.epoch.LeaderEpochFileCacheTest > shouldClearLatestOnEmptyCache STARTED
kafka.server.epoch.LeaderEpochFileCacheTest > shouldClearLatestOnEmptyCache PASSED
kafka.server.epoch.LeaderEpochFileCacheTest > shouldNotResetEpochHistoryHeadIfUndefinedPassed STARTED
kafka.server.epoch.LeaderEpochFileCacheTest > shouldNotResetEpochHistoryHeadIfUndefinedPassed PASSED
kafka.server.epoch.LeaderEpochIntegrationTest > shouldIncreaseLeaderEpochBetweenLeaderRestarts STARTED
kafka.server.epoch.LeaderEpochIntegrationTest > shouldIncreaseLeaderEpochBetweenLeaderRestarts PASSED
kafka.server.epoch.LeaderEpochIntegrationTest > shouldAddCurrentLeaderEpochToMessagesAsTheyAreWrittenToLeader STARTED
ERROR: Could not install GRADLE_3_4_RC_2_HOME
java.lang.NullPointerException
at hudson.plugins.toolenv.ToolEnvBuildWrapper$1.buildEnvVars(ToolEnvBuildWrapper.java:46)
at hudson.model.AbstractBuild.getEnvironment(AbstractBuild.java:886)
at hudson.plugins.git.GitSCM.getParamExpandedRepos(GitSCM.java:419)
at hudson.plugins.git.GitSCM.compareRemoteRevisionWithImpl(GitSCM.java:627)
at hudson.plugins.git.GitSCM.compareRemoteRevisionWith(GitSCM.java:592)
at hudson.scm.SCM.compareRemoteRevisionWith(SCM.java:391)
at hudson.scm.SCM.poll(SCM.java:408)
at hudson.model.AbstractProject._poll(AbstractProject.java:1458)
at hudson.model.AbstractProject.poll(AbstractProject.java:1361)
at hudson.triggers.SCMTrigger$Runner.runPolling(SCMTrigger.java:594)
at hudson.triggers.SCMTrigger$Runner.run(SCMTrigger.java:640)
at hudson.util.SequentialExecutionQueue$QueueEntry.run(SequentialExecutionQueue.java:119)
at java.util.concurrent.Executors$RunnableAdapter.call(Executors.java:511)
at java.util.concurrent.FutureTask.run(FutureTask.java:266)
at java.util.concurrent.ThreadPoolExecutor.runWorker(ThreadPoolExecutor.java:1142)
at java.util.concurrent.ThreadPoolExecutor$Worker.run(ThreadPoolExecutor.java:617)
at java.lang.Thread.run(Thread.java:748)
kafka.server.epoch.LeaderEpochIntegrationTest > shouldAddCurrentLeaderEpochToMessagesAsTheyAreWrittenToLeader PASSED
kafka.server.epoch.LeaderEpochIntegrationTest > shouldSendLeaderEpochRequestAndGetAResponse STARTED
kafka.server.epoch.LeaderEpochIntegrationTest > shouldSendLeaderEpochRequestAndGetAResponse PASSED
kafka.server.epoch.EpochDrivenReplicationProtocolAcceptanceTest > shouldSurviveFastLeaderChange STARTED
kafka.server.epoch.EpochDrivenReplicationProtocolAcceptanceTest > shouldSurviveFastLeaderChange PASSED
kafka.server.epoch.EpochDrivenReplicationProtocolAcceptanceTest > offsetsShouldNotGoBackwards STARTED
kafka.server.epoch.EpochDrivenReplicationProtocolAcceptanceTest > offsetsShouldNotGoBackwards PASSED
kafka.server.epoch.EpochDrivenReplicationProtocolAcceptanceTest > shouldFollowLeaderEpochBasicWorkflow STARTED
kafka.server.epoch.EpochDrivenReplicationProtocolAcceptanceTest > shouldFollowLeaderEpochBasicWorkflow PASSED
kafka.server.epoch.EpochDrivenReplicationProtocolAcceptanceTest > shouldNotAllowDivergentLogs STARTED
kafka.server.epoch.EpochDrivenReplicationProtocolAcceptanceTest > shouldNotAllowDivergentLogs PASSED
kafka.server.epoch.OffsetsForLeaderEpochTest > shouldGetEpochsFromReplica STARTED
kafka.server.epoch.OffsetsForLeaderEpochTest > shouldGetEpochsFromReplica PASSED
kafka.server.epoch.OffsetsForLeaderEpochTest > shouldReturnUnknownTopicOrPartitionIfThrown STARTED
kafka.server.epoch.OffsetsForLeaderEpochTest > shouldReturnUnknownTopicOrPartitionIfThrown PASSED
kafka.server.epoch.OffsetsForLeaderEpochTest > shouldReturnNoLeaderForPartitionIfThrown STARTED
kafka.server.epoch.OffsetsForLeaderEpochTest > shouldReturnNoLeaderForPartitionIfThrown PASSED
kafka.server.AbstractFetcherThreadTest > testConsumerLagRemovedWithPartition STARTED
kafka.server.AbstractFetcherThreadTest > testConsumerLagRemovedWithPartition PASSED
kafka.server.AbstractFetcherThreadTest > testFetchRequestCorruptedMessageException STARTED
kafka.server.AbstractFetcherThreadTest > testFetchRequestCorruptedMessageException PASSED
kafka.server.AbstractFetcherThreadTest > testMetricsRemovedOnShutdown STARTED
kafka.server.AbstractFetcherThreadTest > testMetricsRemovedOnShutdown PASSED
kafka.server.CreateTopicsRequestTest > testValidCreateTopicsRequests STARTED
kafka.server.CreateTopicsRequestTest > testValidCreateTopicsRequests PASSED
kafka.server.CreateTopicsRequestTest > testErrorCreateTopicsRequests STARTED
kafka.server.CreateTopicsRequestTest > testErrorCreateTopicsRequests PASSED
kafka.server.CreateTopicsRequestTest > testInvalidCreateTopicsRequests STARTED
kafka.server.CreateTopicsRequestTest > testInvalidCreateTopicsRequests PASSED
kafka.server.CreateTopicsRequestTest > testNotController STARTED
kafka.server.CreateTopicsRequestTest > testNotController PASSED
kafka.server.LogOffsetTest > testFetchOffsetsBeforeWithChangingSegmentSize STARTED
ERROR: Could not install GRADLE_3_4_RC_2_HOME
java.lang.NullPointerException
at hudson.plugins.toolenv.ToolEnvBuildWrapper$1.buildEnvVars(ToolEnvBuildWrapper.java:46)
at hudson.model.AbstractBuild.getEnvironment(AbstractBuild.java:886)
at hudson.plugins.git.GitSCM.getParamExpandedRepos(GitSCM.java:419)
at hudson.plugins.git.GitSCM.compareRemoteRevisionWithImpl(GitSCM.java:627)
at hudson.plugins.git.GitSCM.compareRemoteRevisionWith(GitSCM.java:592)
at hudson.scm.SCM.compareRemoteRevisionWith(SCM.java:391)
at hudson.scm.SCM.poll(SCM.java:408)
at hudson.model.AbstractProject._poll(AbstractProject.java:1458)
at hudson.model.AbstractProject.poll(AbstractProject.java:1361)
at hudson.triggers.SCMTrigger$Runner.runPolling(SCMTrigger.java:594)
at hudson.triggers.SCMTrigger$Runner.run(SCMTrigger.java:640)
at hudson.util.SequentialExecutionQueue$QueueEntry.run(SequentialExecutionQueue.java:119)
at java.util.concurrent.Executors$RunnableAdapter.call(Executors.java:511)
at java.util.concurrent.FutureTask.run(FutureTask.java:266)
at java.util.concurrent.ThreadPoolExecutor.runWorker(ThreadPoolExecutor.java:1142)
at java.util.concurrent.ThreadPoolExecutor$Worker.run(ThreadPoolExecutor.java:617)
at java.lang.Thread.run(Thread.java:748)
ERROR: Could not install GRADLE_3_4_RC_2_HOME
java.lang.NullPointerException
at hudson.plugins.toolenv.ToolEnvBuildWrapper$1.buildEnvVars(ToolEnvBuildWrapper.java:46)
at hudson.model.AbstractBuild.getEnvironment(AbstractBuild.java:886)
at hudson.plugins.git.GitSCM.getParamExpandedRepos(GitSCM.java:419)
at hudson.plugins.git.GitSCM.compareRemoteRevisionWithImpl(GitSCM.java:627)
at hudson.plugins.git.GitSCM.compareRemoteRevisionWith(GitSCM.java:592)
at hudson.scm.SCM.compareRemoteRevisionWith(SCM.java:391)
at hudson.scm.SCM.poll(SCM.java:408)
at hudson.model.AbstractProject._poll(AbstractProject.java:1458)
at hudson.model.AbstractProject.poll(AbstractProject.java:1361)
at hudson.triggers.SCMTrigger$Runner.runPolling(SCMTrigger.java:594)
at hudson.triggers.SCMTrigger$Runner.run(SCMTrigger.java:640)
at hudson.util.SequentialExecutionQueue$QueueEntry.run(SequentialExecutionQueue.java:119)
at java.util.concurrent.Executors$RunnableAdapter.call(Executors.java:511)
at java.util.concurrent.FutureTask.run(FutureTask.java:266)
at java.util.concurrent.ThreadPoolExecutor.runWorker(ThreadPoolExecutor.java:1142)
at java.util.concurrent.ThreadPoolExecutor$Worker.run(ThreadPoolExecutor.java:617)
at java.lang.Thread.run(Thread.java:748)
ERROR: Could not install GRADLE_3_4_RC_2_HOME
java.lang.NullPointerException
at hudson.plugins.toolenv.ToolEnvBuildWrapper$1.buildEnvVars(ToolEnvBuildWrapper.java:46)
at hudson.model.AbstractBuild.getEnvironment(AbstractBuild.java:886)
at hudson.plugins.git.GitSCM.getParamExpandedRepos(GitSCM.java:419)
at hudson.plugins.git.GitSCM.compareRemoteRevisionWithImpl(GitSCM.java:627)
at hudson.plugins.git.GitSCM.compareRemoteRevisionWith(GitSCM.java:592)
at hudson.scm.SCM.compareRemoteRevisionWith(SCM.java:391)
at hudson.scm.SCM.poll(SCM.java:408)
at hudson.model.AbstractProject._poll(AbstractProject.java:1458)
at hudson.model.AbstractProject.poll(AbstractProject.java:1361)
at hudson.triggers.SCMTrigger$Runner.runPolling(SCMTrigger.java:594)
at hudson.triggers.SCMTrigger$Runner.run(SCMTrigger.java:640)
at hudson.util.SequentialExecutionQueue$QueueEntry.run(SequentialExecutionQueue.java:119)
at java.util.concurrent.Executors$RunnableAdapter.call(Executors.java:511)
at java.util.concurrent.FutureTask.run(FutureTask.java:266)
at java.util.concurrent.ThreadPoolExecutor.runWorker(ThreadPoolExecutor.java:1142)
at java.util.concurrent.ThreadPoolExecutor$Worker.run(ThreadPoolExecutor.java:617)
at java.lang.Thread.run(Thread.java:748)
Build timed out (after 240 minutes). Marking the build as failed.
Build was aborted
[FINDBUGS] Collecting findbugs analysis files...
Setting GRADLE_3_4_RC_2_HOME=/home/jenkins/jenkins-slave/tools/hudson.plugins.gradle.GradleInstallation/Gradle_3.4-rc-2
[FINDBUGS] Searching for all files in <https://builds.apache.org/job/kafka-trunk-jdk7/ws/> that match the pattern **/build/reports/findbugs/*.xml
[FINDBUGS] Parsing 1 file in <https://builds.apache.org/job/kafka-trunk-jdk7/ws/>
[FINDBUGS] Successfully parsed file <https://builds.apache.org/job/kafka-trunk-jdk7/ws/core/build/reports/findbugs/main.xml> with 0 unique warnings and 0 duplicates.
Setting GRADLE_3_4_RC_2_HOME=/home/jenkins/jenkins-slave/tools/hudson.plugins.gradle.GradleInstallation/Gradle_3.4-rc-2
Setting GRADLE_3_4_RC_2_HOME=/home/jenkins/jenkins-slave/tools/hudson.plugins.gradle.GradleInstallation/Gradle_3.4-rc-2
<Git Blamer> Using GitBlamer to create author and commit information for all warnings.
<Git Blamer> GIT_COMMIT=57dbe39ae1e8312c5e0e6603061d2816a8c05198, workspace=<https://builds.apache.org/job/kafka-trunk-jdk7/ws/>
[FINDBUGS] Computing warning deltas based on reference build #2656
Recording test results
Setting GRADLE_3_4_RC_2_HOME=/home/jenkins/jenkins-slave/tools/hudson.plugins.gradle.GradleInstallation/Gradle_3.4-rc-2
ERROR: Step ‘Publish JUnit test result report’ failed: No test report files were found. Configuration error?
Setting GRADLE_3_4_RC_2_HOME=/home/jenkins/jenkins-slave/tools/hudson.plugins.gradle.GradleInstallation/Gradle_3.4-rc-2
Not sending mail to unregistered user ismael@juma.me.uk