You are viewing a plain text version of this content. The canonical link for it is here.
Posted to notifications@jclouds.apache.org by BuildHive <bu...@cloudbees.com> on 2014/08/05 13:05:12 UTC

Build failed in Jenkins: jclouds » jclouds-karaf #1169

See <https://buildhive.cloudbees.com/job/jclouds/job/jclouds-karaf/1169/changes>

Changes:

[Andrew Phillips] Updating project and jclouds.version to 2.0.0-SNAPSHOT

------------------------------------------
[...truncated 331 lines...]
[INFO] Exclude: **/target/**
[INFO] Exclude: .repository/**
[INFO] Exclude: **/src/main/resources/**/*.txt
[INFO] 7 resources included (use -debug for more details)
Warning:  org.apache.xerces.jaxp.SAXParserImpl$JAXPSAXParser: Property 'http://www.oracle.com/xml/jaxp/properties/entityExpansionLimit' is not recognized.
Compiler warnings:
  WARNING:  'org.apache.xerces.jaxp.SAXParserImpl: Property 'http://javax.xml.XMLConstants/property/accessExternalDTD' is not recognized.'
Warning:  org.apache.xerces.parsers.SAXParser: Feature 'http://javax.xml.XMLConstants/feature/secure-processing' is not recognized.
Warning:  org.apache.xerces.parsers.SAXParser: Property 'http://javax.xml.XMLConstants/property/accessExternalDTD' is not recognized.
Warning:  org.apache.xerces.parsers.SAXParser: Property 'http://www.oracle.com/xml/jaxp/properties/entityExpansionLimit' is not recognized.
[INFO] Rat check: Summary of files. Unapproved: 0 unknown: 0 generated: 0 approved: 7 licence.
[INFO] 
[INFO] --- maven-install-plugin:2.5.1:install (default-install) @ recipe ---
[INFO] Installing <https://buildhive.cloudbees.com/job/jclouds/job/jclouds-karaf/ws/recipe/target/recipe-2.0.0-SNAPSHOT.jar> to /home/jenkins/.m2/repository/org/apache/jclouds/karaf/recipe/2.0.0-SNAPSHOT/recipe-2.0.0-SNAPSHOT.jar
[INFO] Installing <https://buildhive.cloudbees.com/job/jclouds/job/jclouds-karaf/ws/recipe/pom.xml> to /home/jenkins/.m2/repository/org/apache/jclouds/karaf/recipe/2.0.0-SNAPSHOT/recipe-2.0.0-SNAPSHOT.pom
[INFO] 
[INFO] --- maven-bundle-plugin:2.1.0:install (default-install) @ recipe ---
[INFO] Installing org/apache/jclouds/karaf/recipe/2.0.0-SNAPSHOT/recipe-2.0.0-SNAPSHOT.jar
[INFO] Writing OBR metadata
[INFO]                                                                         
[INFO] ------------------------------------------------------------------------
[INFO] Building jclouds :: Karaf :: Cache 2.0.0-SNAPSHOT
[INFO] ------------------------------------------------------------------------
[INFO] 
[INFO] --- maven-clean-plugin:2.5:clean (default-clean) @ cache ---
[INFO] 
[INFO] --- maven-remote-resources-plugin:1.5:process (default) @ cache ---
[INFO] 
[INFO] --- maven-resources-plugin:2.6:resources (default-resources) @ cache ---
[INFO] Using 'UTF-8' encoding to copy filtered resources.
[INFO] skip non existing resourceDirectory <https://buildhive.cloudbees.com/job/jclouds/job/jclouds-karaf/ws/cache/src/main/resources>
[INFO] Copying 3 resources
[INFO] 
[INFO] --- maven-compiler-plugin:2.0.2:compile (default-compile) @ cache ---
[INFO] Compiling 7 source files to <https://buildhive.cloudbees.com/job/jclouds/job/jclouds-karaf/ws/cache/target/classes>
[INFO] 
[INFO] --- maven-bundle-plugin:2.1.0:manifest (bundle-manifest) @ cache ---
[INFO] 
[INFO] --- maven-resources-plugin:2.6:testResources (default-testResources) @ cache ---
[INFO] Using 'UTF-8' encoding to copy filtered resources.
[INFO] skip non existing resourceDirectory <https://buildhive.cloudbees.com/job/jclouds/job/jclouds-karaf/ws/cache/src/test/resources>
[INFO] Copying 3 resources
[INFO] 
[INFO] --- maven-compiler-plugin:2.0.2:testCompile (default-testCompile) @ cache ---
[INFO] No sources to compile
[INFO] 
[INFO] --- maven-surefire-plugin:2.16:test (default-test) @ cache ---
[JENKINS] Recording test results[INFO] 
[INFO] --- maven-bundle-plugin:2.1.0:bundle (default-bundle) @ cache ---

[INFO] Expanding: <https://buildhive.cloudbees.com/job/jclouds/job/jclouds-karaf/ws/cache/target/cache-2.0.0-SNAPSHOT.jar> into <https://buildhive.cloudbees.com/job/jclouds/job/jclouds-karaf/ws/cache/target/classes>
[INFO] 
[INFO] --- maven-site-plugin:3.3:attach-descriptor (attach-descriptor) @ cache ---
[INFO] 
[INFO] --- apache-rat-plugin:0.10:check (default) @ cache ---
[INFO] 51 implicit excludes (use -debug for more details).
[INFO] Exclude: **/LICENSE.txt
[INFO] Exclude: **/header.txt
[INFO] Exclude: **/NOTICE.txt
[INFO] Exclude: **/DISCLAIMER
[INFO] Exclude: **/BUILD.txt
[INFO] Exclude: **/CHANGES.txt
[INFO] Exclude: **/README.md
[INFO] Exclude: **/README.txt
[INFO] Exclude: **/DEPENDENCIES
[INFO] Exclude: **/CONTRIBUTING.md
[INFO] Exclude: .git/**
[INFO] Exclude: **/.gitignore
[INFO] Exclude: **/*.json
[INFO] Exclude: **/*.log*
[INFO] Exclude: **/TODO
[INFO] Exclude: .mailmap
[INFO] Exclude: .idea/**
[INFO] Exclude: **/*.iml
[INFO] Exclude: **/.project
[INFO] Exclude: **/.classpath
[INFO] Exclude: **/.settings/**
[INFO] Exclude: **/.checkstyle
[INFO] Exclude: **/target/**
[INFO] Exclude: .repository/**
[INFO] Exclude: **/src/main/resources/**/*.txt
[INFO] 8 resources included (use -debug for more details)
Warning:  org.apache.xerces.jaxp.SAXParserImpl$JAXPSAXParser: Property 'http://www.oracle.com/xml/jaxp/properties/entityExpansionLimit' is not recognized.
Compiler warnings:
  WARNING:  'org.apache.xerces.jaxp.SAXParserImpl: Property 'http://javax.xml.XMLConstants/property/accessExternalDTD' is not recognized.'
Warning:  org.apache.xerces.parsers.SAXParser: Feature 'http://javax.xml.XMLConstants/feature/secure-processing' is not recognized.
Warning:  org.apache.xerces.parsers.SAXParser: Property 'http://javax.xml.XMLConstants/property/accessExternalDTD' is not recognized.
Warning:  org.apache.xerces.parsers.SAXParser: Property 'http://www.oracle.com/xml/jaxp/properties/entityExpansionLimit' is not recognized.
[INFO] Rat check: Summary of files. Unapproved: 0 unknown: 0 generated: 0 approved: 8 licence.
[INFO] 
[INFO] --- maven-install-plugin:2.5.1:install (default-install) @ cache ---
[INFO] Installing <https://buildhive.cloudbees.com/job/jclouds/job/jclouds-karaf/ws/cache/target/cache-2.0.0-SNAPSHOT.jar> to /home/jenkins/.m2/repository/org/apache/jclouds/karaf/cache/2.0.0-SNAPSHOT/cache-2.0.0-SNAPSHOT.jar
[INFO] Installing <https://buildhive.cloudbees.com/job/jclouds/job/jclouds-karaf/ws/cache/pom.xml> to /home/jenkins/.m2/repository/org/apache/jclouds/karaf/cache/2.0.0-SNAPSHOT/cache-2.0.0-SNAPSHOT.pom
[INFO] 
[INFO] --- maven-bundle-plugin:2.1.0:install (default-install) @ cache ---
[INFO] Installing org/apache/jclouds/karaf/cache/2.0.0-SNAPSHOT/cache-2.0.0-SNAPSHOT.jar
[INFO] Writing OBR metadata
[INFO]                                                                         
[INFO] ------------------------------------------------------------------------
[INFO] Building jclouds :: Karaf :: Services 2.0.0-SNAPSHOT
[INFO] ------------------------------------------------------------------------
[INFO] Downloading: https://repository.apache.org/content/repositories/snapshots/org/apache/jclouds/labs/management/management-core/2.0.0-SNAPSHOT/maven-metadata.xml
[INFO] Downloading: http://download.java.net/maven/2/org/apache/jclouds/labs/management/management-core/2.0.0-SNAPSHOT/maven-metadata.xml
[INFO] Downloading: https://oss.sonatype.org/content/repositories/releases/org/apache/jclouds/labs/management/management-core/2.0.0-SNAPSHOT/maven-metadata.xml
[INFO] Downloading: http://repository.apache.org/snapshots/org/apache/jclouds/labs/management/management-core/2.0.0-SNAPSHOT/maven-metadata.xml
[INFO] Downloading: https://repository.apache.org/content/repositories/snapshots/org/apache/jclouds/labs/management/management-core/2.0.0-SNAPSHOT/management-core-2.0.0-SNAPSHOT.pom
[INFO] Downloading: https://oss.sonatype.org/content/repositories/releases/org/apache/jclouds/labs/management/management-core/2.0.0-SNAPSHOT/management-core-2.0.0-SNAPSHOT.pom
[INFO] Downloading: http://download.java.net/maven/2/org/apache/jclouds/labs/management/management-core/2.0.0-SNAPSHOT/management-core-2.0.0-SNAPSHOT.pom
[INFO] Downloading: http://repository.apache.org/snapshots/org/apache/jclouds/labs/management/management-core/2.0.0-SNAPSHOT/management-core-2.0.0-SNAPSHOT.pom
[WARNING] The POM for org.apache.jclouds.labs.management:management-core:jar:2.0.0-SNAPSHOT is missing, no dependency information available
[INFO] Downloading: https://oss.sonatype.org/content/repositories/releases/org/apache/jclouds/driver/jclouds-log4j/2.0.0-SNAPSHOT/maven-metadata.xml
[INFO] Downloading: https://repository.apache.org/content/repositories/snapshots/org/apache/jclouds/driver/jclouds-log4j/2.0.0-SNAPSHOT/maven-metadata.xml
[INFO] Downloading: http://download.java.net/maven/2/org/apache/jclouds/driver/jclouds-log4j/2.0.0-SNAPSHOT/maven-metadata.xml
[INFO] Downloading: http://repository.apache.org/snapshots/org/apache/jclouds/driver/jclouds-log4j/2.0.0-SNAPSHOT/maven-metadata.xml
[INFO] Downloaded: https://repository.apache.org/content/repositories/snapshots/org/apache/jclouds/driver/jclouds-log4j/2.0.0-SNAPSHOT/maven-metadata.xml (2 KB at 2.5 KB/sec)
[INFO] Downloaded: http://repository.apache.org/snapshots/org/apache/jclouds/driver/jclouds-log4j/2.0.0-SNAPSHOT/maven-metadata.xml (2 KB at 1.4 KB/sec)
[INFO] Downloading: https://repository.apache.org/content/repositories/snapshots/org/apache/jclouds/driver/jclouds-sshj/2.0.0-SNAPSHOT/maven-metadata.xml
[INFO] Downloading: http://repository.apache.org/snapshots/org/apache/jclouds/driver/jclouds-sshj/2.0.0-SNAPSHOT/maven-metadata.xml
[INFO] Downloading: https://oss.sonatype.org/content/repositories/releases/org/apache/jclouds/driver/jclouds-sshj/2.0.0-SNAPSHOT/maven-metadata.xml
[INFO] Downloading: http://download.java.net/maven/2/org/apache/jclouds/driver/jclouds-sshj/2.0.0-SNAPSHOT/maven-metadata.xml
[INFO] Downloaded: https://repository.apache.org/content/repositories/snapshots/org/apache/jclouds/driver/jclouds-sshj/2.0.0-SNAPSHOT/maven-metadata.xml (2 KB at 1.9 KB/sec)
[INFO] Downloaded: http://repository.apache.org/snapshots/org/apache/jclouds/driver/jclouds-sshj/2.0.0-SNAPSHOT/maven-metadata.xml (2 KB at 1.6 KB/sec)
[INFO] Downloading: https://repository.apache.org/content/repositories/snapshots/org/apache/jclouds/driver/jclouds-slf4j/2.0.0-SNAPSHOT/maven-metadata.xml
[INFO] Downloading: https://oss.sonatype.org/content/repositories/releases/org/apache/jclouds/driver/jclouds-slf4j/2.0.0-SNAPSHOT/maven-metadata.xml
[INFO] Downloading: http://download.java.net/maven/2/org/apache/jclouds/driver/jclouds-slf4j/2.0.0-SNAPSHOT/maven-metadata.xml
[INFO] Downloading: http://repository.apache.org/snapshots/org/apache/jclouds/driver/jclouds-slf4j/2.0.0-SNAPSHOT/maven-metadata.xml
[INFO] Downloading: https://oss.sonatype.org/content/repositories/snapshots/org/apache/jclouds/driver/jclouds-slf4j/2.0.0-SNAPSHOT/maven-metadata.xml
[INFO] Downloaded: https://repository.apache.org/content/repositories/snapshots/org/apache/jclouds/driver/jclouds-slf4j/2.0.0-SNAPSHOT/maven-metadata.xml (2 KB at 1.9 KB/sec)
[INFO] Downloaded: http://repository.apache.org/snapshots/org/apache/jclouds/driver/jclouds-slf4j/2.0.0-SNAPSHOT/maven-metadata.xml (2 KB at 1.9 KB/sec)
[INFO] Downloading: https://repository.apache.org/content/repositories/snapshots/org/apache/jclouds/driver/jclouds-bouncycastle/2.0.0-SNAPSHOT/maven-metadata.xml
[INFO] Downloading: http://download.java.net/maven/2/org/apache/jclouds/driver/jclouds-bouncycastle/2.0.0-SNAPSHOT/maven-metadata.xml
[INFO] Downloading: https://oss.sonatype.org/content/repositories/releases/org/apache/jclouds/driver/jclouds-bouncycastle/2.0.0-SNAPSHOT/maven-metadata.xml
[INFO] Downloading: http://repository.apache.org/snapshots/org/apache/jclouds/driver/jclouds-bouncycastle/2.0.0-SNAPSHOT/maven-metadata.xml
[INFO] Downloading: https://oss.sonatype.org/content/repositories/snapshots/org/apache/jclouds/driver/jclouds-bouncycastle/2.0.0-SNAPSHOT/maven-metadata.xml
[INFO] Downloaded: https://repository.apache.org/content/repositories/snapshots/org/apache/jclouds/driver/jclouds-bouncycastle/2.0.0-SNAPSHOT/maven-metadata.xml (2 KB at 5.0 KB/sec)
[INFO] Downloaded: http://repository.apache.org/snapshots/org/apache/jclouds/driver/jclouds-bouncycastle/2.0.0-SNAPSHOT/maven-metadata.xml (2 KB at 2.9 KB/sec)
[INFO] Downloading: https://repository.apache.org/content/repositories/snapshots/org/apache/jclouds/labs/management/management-core/2.0.0-SNAPSHOT/management-core-2.0.0-SNAPSHOT.jar
[INFO] Downloading: https://oss.sonatype.org/content/repositories/releases/org/apache/jclouds/labs/management/management-core/2.0.0-SNAPSHOT/management-core-2.0.0-SNAPSHOT.jar
[INFO] Downloading: http://download.java.net/maven/2/org/apache/jclouds/labs/management/management-core/2.0.0-SNAPSHOT/management-core-2.0.0-SNAPSHOT.jar
[INFO] Downloading: http://repository.apache.org/snapshots/org/apache/jclouds/labs/management/management-core/2.0.0-SNAPSHOT/management-core-2.0.0-SNAPSHOT.jar
[INFO] ------------------------------------------------------------------------
[INFO] Reactor Summary:
[INFO] 
[INFO] Apache jclouds :: Karaf ........................... SUCCESS [26.884s]
[INFO] jclouds :: Karaf :: Core .......................... SUCCESS [21.388s]
[INFO] jclouds :: Karaf :: Utils ......................... SUCCESS [9.987s]
[INFO] jclouds :: Karaf :: Recipe ........................ SUCCESS [6.337s]
[INFO] jclouds :: Karaf :: Cache ......................... SUCCESS [6.688s]
[INFO] jclouds :: Karaf :: Services ...................... FAILURE [6.772s]
[INFO] jclouds :: Karaf :: Commands ...................... SKIPPED
[INFO] jclouds :: Karaf :: URL Handler ................... SKIPPED
[INFO] jclouds :: Karaf :: Chef .......................... SKIPPED
[INFO] jclouds :: Karaf :: Chef :: Core .................. SKIPPED
[INFO] jclouds :: Karaf :: Chef :: Services .............. SKIPPED
[INFO] jclouds :: Karaf :: Chef :: Commands .............. SKIPPED
[INFO] jclouds :: Karaf :: Chef :: Cache ................. SKIPPED
[INFO] jclouds :: Karaf :: Feature ....................... SKIPPED
[INFO] jclouds :: Karaf :: Integration Tests ............. SKIPPED
[INFO] ------------------------------------------------------------------------
[INFO] BUILD FAILURE
[INFO] ------------------------------------------------------------------------
[INFO] Total time: 1:27.497s
[INFO] Finished at: Tue Aug 05 11:05:10 UTC 2014
[INFO] Final Memory: 43M/103M
[INFO] ------------------------------------------------------------------------
Waiting for Jenkins to finish collecting data[ERROR] Failed to execute goal on project services: Could not resolve dependencies for project org.apache.jclouds.karaf:services:bundle:2.0.0-SNAPSHOT: Could not find artifact org.apache.jclouds.labs.management:management-core:jar:2.0.0-SNAPSHOT in apache-snapshots (https://repository.apache.org/content/repositories/snapshots) -> [Help 1]
org.apache.maven.lifecycle.LifecycleExecutionException: Failed to execute goal on project services: Could not resolve dependencies for project org.apache.jclouds.karaf:services:bundle:2.0.0-SNAPSHOT: Could not find artifact org.apache.jclouds.labs.management:management-core:jar:2.0.0-SNAPSHOT in apache-snapshots (https://repository.apache.org/content/repositories/snapshots)
	at org.apache.maven.lifecycle.internal.LifecycleDependencyResolver.getDependencies(LifecycleDependencyResolver.java:220)
	at org.apache.maven.lifecycle.internal.LifecycleDependencyResolver.resolveProjectDependencies(LifecycleDependencyResolver.java:127)
	at org.apache.maven.lifecycle.internal.MojoExecutor.ensureDependenciesAreResolved(MojoExecutor.java:257)
	at org.apache.maven.lifecycle.internal.MojoExecutor.execute(MojoExecutor.java:200)
	at org.apache.maven.lifecycle.internal.MojoExecutor.execute(MojoExecutor.java:153)
	at org.apache.maven.lifecycle.internal.MojoExecutor.execute(MojoExecutor.java:145)
	at org.apache.maven.lifecycle.internal.LifecycleModuleBuilder.buildProject(LifecycleModuleBuilder.java:84)
	at org.apache.maven.lifecycle.internal.LifecycleModuleBuilder.buildProject(LifecycleModuleBuilder.java:59)
	at org.apache.maven.lifecycle.internal.LifecycleStarter.singleThreadedBuild(LifecycleStarter.java:183)
	at org.apache.maven.lifecycle.internal.LifecycleStarter.execute(LifecycleStarter.java:161)
	at org.apache.maven.DefaultMaven.doExecute(DefaultMaven.java:317)
	at org.apache.maven.DefaultMaven.execute(DefaultMaven.java:152)
	at org.jvnet.hudson.maven3.launcher.Maven31Launcher.main(Maven31Launcher.java:132)
	at sun.reflect.NativeMethodAccessorImpl.invoke0(Native Method)
	at sun.reflect.NativeMethodAccessorImpl.invoke(NativeMethodAccessorImpl.java:57)
	at sun.reflect.DelegatingMethodAccessorImpl.invoke(DelegatingMethodAccessorImpl.java:43)
	at java.lang.reflect.Method.invoke(Method.java:606)
	at org.codehaus.plexus.classworlds.launcher.Launcher.launchStandard(Launcher.java:330)
	at org.codehaus.plexus.classworlds.launcher.Launcher.launch(Launcher.java:238)
	at jenkins.maven3.agent.Maven31Main.launch(Maven31Main.java:181)
	at sun.reflect.NativeMethodAccessorImpl.invoke0(Native Method)
	at sun.reflect.NativeMethodAccessorImpl.invoke(NativeMethodAccessorImpl.java:57)
	at sun.reflect.DelegatingMethodAccessorImpl.invoke(DelegatingMethodAccessorImpl.java:43)
	at java.lang.reflect.Method.invoke(Method.java:606)
	at hudson.maven.Maven3Builder.call(Maven3Builder.java:134)
	at hudson.maven.Maven3Builder.call(Maven3Builder.java:69)
	at hudson.remoting.UserRequest.perform(UserRequest.java:118)
	at hudson.remoting.UserRequest.perform(UserRequest.java:48)
	at hudson.remoting.Request$2.run(Request.java:328)
	at hudson.remoting.InterceptingExecutorService$1.call(InterceptingExecutorService.java:72)
	at java.util.concurrent.FutureTask.run(FutureTask.java:262)
	at java.util.concurrent.ThreadPoolExecutor.runWorker(ThreadPoolExecutor.java:1145)
	at java.util.concurrent.ThreadPoolExecutor$Worker.run(ThreadPoolExecutor.java:615)
	at java.lang.Thread.run(Thread.java:744)
Caused by: org.apache.maven.project.DependencyResolutionException: Could not resolve dependencies for project org.apache.jclouds.karaf:services:bundle:2.0.0-SNAPSHOT: Could not find artifact org.apache.jclouds.labs.management:management-core:jar:2.0.0-SNAPSHOT in apache-snapshots (https://repository.apache.org/content/repositories/snapshots)
	at org.apache.maven.project.DefaultProjectDependenciesResolver.resolve(DefaultProjectDependenciesResolver.java:198)
	at org.apache.maven.lifecycle.internal.LifecycleDependencyResolver.getDependencies(LifecycleDependencyResolver.java:195)

	... 33 more
[JENKINS] Archiving <https://buildhive.cloudbees.com/job/jclouds/job/jclouds-karaf/ws/chef/cache/pom.xml> to org.apache.jclouds.karaf.chef/cache/2.0.0-SNAPSHOT/cache-2.0.0-SNAPSHOT.pom
Caused by: org.eclipse.aether.resolution.DependencyResolutionException: Could not find artifact org.apache.jclouds.labs.management:management-core:jar:2.0.0-SNAPSHOT in apache-snapshots (https://repository.apache.org/content/repositories/snapshots)
	at org.eclipse.aether.internal.impl.DefaultRepositorySystem.resolveDependencies(DefaultRepositorySystem.java:384)
	at org.apache.maven.project.DefaultProjectDependenciesResolver.resolve(DefaultProjectDependenciesResolver.java:192)
	... 34 more
Caused by: org.eclipse.aether.resolution.ArtifactResolutionException: Could not find artifact org.apache.jclouds.labs.management:management-core:jar:2.0.0-SNAPSHOT in apache-snapshots (https://repository.apache.org/content/repositories/snapshots)
	at org.eclipse.aether.internal.impl.DefaultArtifactResolver.resolve(DefaultArtifactResolver.java:459)
	at org.eclipse.aether.internal.impl.DefaultArtifactResolver.resolveArtifacts(DefaultArtifactResolver.java:262)
	at org.eclipse.aether.internal.impl.DefaultRepositorySystem.resolveDependencies(DefaultRepositorySystem.java:367)
	... 35 more
Caused by: org.eclipse.aether.transfer.ArtifactNotFoundException: Could not find artifact org.apache.jclouds.labs.management:management-core:jar:2.0.0-SNAPSHOT in apache-snapshots (https://repository.apache.org/content/repositories/snapshots)
	at org.eclipse.aether.connector.wagon.WagonRepositoryConnector$6.wrap(WagonRepositoryConnector.java:1012)
	at org.eclipse.aether.connector.wagon.WagonRepositoryConnector$6.wrap(WagonRepositoryConnector.java:1004)
	at org.eclipse.aether.connector.wagon.WagonRepositoryConnector$GetTask.run(WagonRepositoryConnector.java:725)
	at org.eclipse.aether.util.concurrency.RunnableErrorForwarder$1.run(RunnableErrorForwarder.java:67)
	... 3 more
[ERROR] 
[ERROR] Re-run Maven using the -X switch to enable full debug logging.
[ERROR] 
[ERROR] For more information about the errors and possible solutions, please read the following articles:
[ERROR] [Help 1] http://cwiki.apache.org/confluence/display/MAVEN/DependencyResolutionException
[ERROR] 
[ERROR] After correcting the problems, you can resume the build with the command
[ERROR]   mvn <goals> -rf :services
[JENKINS] Archiving <https://buildhive.cloudbees.com/job/jclouds/job/jclouds-karaf/ws/core/pom.xml> to org.apache.jclouds.karaf/core/2.0.0-SNAPSHOT/core-2.0.0-SNAPSHOT.pom
[JENKINS] Archiving <https://buildhive.cloudbees.com/job/jclouds/job/jclouds-karaf/ws/core/target/core-2.0.0-SNAPSHOT.jar> to org.apache.jclouds.karaf/core/2.0.0-SNAPSHOT/core-2.0.0-SNAPSHOT.jar
[JENKINS] Archiving <https://buildhive.cloudbees.com/job/jclouds/job/jclouds-karaf/ws/urlhandler/pom.xml> to org.apache.jclouds.karaf/urlhandler/2.0.0-SNAPSHOT/urlhandler-2.0.0-SNAPSHOT.pom
[JENKINS] Archiving <https://buildhive.cloudbees.com/job/jclouds/job/jclouds-karaf/ws/chef/core/pom.xml> to org.apache.jclouds.karaf.chef/core/2.0.0-SNAPSHOT/core-2.0.0-SNAPSHOT.pom
[JENKINS] Archiving <https://buildhive.cloudbees.com/job/jclouds/job/jclouds-karaf/ws/pom.xml> to org.apache.jclouds/jclouds-karaf/2.0.0-SNAPSHOT/jclouds-karaf-2.0.0-SNAPSHOT.pom
[JENKINS] Archiving <https://buildhive.cloudbees.com/job/jclouds/job/jclouds-karaf/ws/chef/commands/pom.xml> to org.apache.jclouds.karaf.chef/commands/2.0.0-SNAPSHOT/commands-2.0.0-SNAPSHOT.pom
[JENKINS] Archiving <https://buildhive.cloudbees.com/job/jclouds/job/jclouds-karaf/ws/utils/pom.xml> to org.apache.jclouds.karaf/utils/2.0.0-SNAPSHOT/utils-2.0.0-SNAPSHOT.pom
[JENKINS] Archiving <https://buildhive.cloudbees.com/job/jclouds/job/jclouds-karaf/ws/utils/target/utils-2.0.0-SNAPSHOT.jar> to org.apache.jclouds.karaf/utils/2.0.0-SNAPSHOT/utils-2.0.0-SNAPSHOT.jar
[JENKINS] Archiving <https://buildhive.cloudbees.com/job/jclouds/job/jclouds-karaf/ws/commands/pom.xml> to org.apache.jclouds.karaf/commands/2.0.0-SNAPSHOT/commands-2.0.0-SNAPSHOT.pom
[JENKINS] Archiving <https://buildhive.cloudbees.com/job/jclouds/job/jclouds-karaf/ws/feature/pom.xml> to org.apache.jclouds.karaf/jclouds-karaf/2.0.0-SNAPSHOT/jclouds-karaf-2.0.0-SNAPSHOT.pom
[JENKINS] Archiving <https://buildhive.cloudbees.com/job/jclouds/job/jclouds-karaf/ws/itests/pom.xml> to org.apache.jclouds.karaf/itests/2.0.0-SNAPSHOT/itests-2.0.0-SNAPSHOT.pom
[JENKINS] Archiving <https://buildhive.cloudbees.com/job/jclouds/job/jclouds-karaf/ws/services/pom.xml> to org.apache.jclouds.karaf/services/2.0.0-SNAPSHOT/services-2.0.0-SNAPSHOT.pom
[JENKINS] Archiving <https://buildhive.cloudbees.com/job/jclouds/job/jclouds-karaf/ws/recipe/pom.xml> to org.apache.jclouds.karaf/recipe/2.0.0-SNAPSHOT/recipe-2.0.0-SNAPSHOT.pom
[JENKINS] Archiving <https://buildhive.cloudbees.com/job/jclouds/job/jclouds-karaf/ws/recipe/target/recipe-2.0.0-SNAPSHOT.jar> to org.apache.jclouds.karaf/recipe/2.0.0-SNAPSHOT/recipe-2.0.0-SNAPSHOT.jar
[JENKINS] Archiving <https://buildhive.cloudbees.com/job/jclouds/job/jclouds-karaf/ws/cache/pom.xml> to org.apache.jclouds.karaf/cache/2.0.0-SNAPSHOT/cache-2.0.0-SNAPSHOT.pom
[JENKINS] Archiving <https://buildhive.cloudbees.com/job/jclouds/job/jclouds-karaf/ws/cache/target/cache-2.0.0-SNAPSHOT.jar> to org.apache.jclouds.karaf/cache/2.0.0-SNAPSHOT/cache-2.0.0-SNAPSHOT.jar
[JENKINS] Archiving <https://buildhive.cloudbees.com/job/jclouds/job/jclouds-karaf/ws/chef/pom.xml> to org.apache.jclouds.karaf/chef/2.0.0-SNAPSHOT/chef-2.0.0-SNAPSHOT.pom
[JENKINS] Archiving <https://buildhive.cloudbees.com/job/jclouds/job/jclouds-karaf/ws/chef/services/pom.xml> to org.apache.jclouds.karaf.chef/services/2.0.0-SNAPSHOT/services-2.0.0-SNAPSHOT.pom
channel stopped