You are viewing a plain text version of this content. The canonical link for it is here.
Posted to dev@zookeeper.apache.org by Apache Jenkins Server <je...@builds.apache.org> on 2016/08/24 19:27:20 UTC

ZooKeeper-trunk - Build # 3049 - Failure

See https://builds.apache.org/job/ZooKeeper-trunk/3049/

###################################################################################
########################## LAST 60 LINES OF THE CONSOLE ###########################
[...truncated 450313 lines...]
    [junit] java.net.ConnectException: Connection refused
    [junit] 	at sun.nio.ch.SocketChannelImpl.checkConnect(Native Method)
    [junit] 	at sun.nio.ch.SocketChannelImpl.finishConnect(SocketChannelImpl.java:744)
    [junit] 	at org.apache.zookeeper.ClientCnxnSocketNIO.doTransport(ClientCnxnSocketNIO.java:357)
    [junit] 	at org.apache.zookeeper.ClientCnxn$SendThread.run(ClientCnxn.java:1214)
    [junit] 2016-08-24 19:27:04,450 [myid:127.0.0.1:16729] - INFO  [main-SendThread(127.0.0.1:16729):ClientCnxn$SendThread@1113] - Opening socket connection to server 127.0.0.1/127.0.0.1:16729. Will not attempt to authenticate using SASL (unknown error)
    [junit] 2016-08-24 19:27:04,450 [myid:127.0.0.1:16729] - WARN  [main-SendThread(127.0.0.1:16729):ClientCnxn$SendThread@1235] - Session 0x102162e092d0000 for server 127.0.0.1/127.0.0.1:16729, unexpected error, closing socket connection and attempting reconnect
    [junit] java.net.ConnectException: Connection refused
    [junit] 	at sun.nio.ch.SocketChannelImpl.checkConnect(Native Method)
    [junit] 	at sun.nio.ch.SocketChannelImpl.finishConnect(SocketChannelImpl.java:744)
    [junit] 	at org.apache.zookeeper.ClientCnxnSocketNIO.doTransport(ClientCnxnSocketNIO.java:357)
    [junit] 	at org.apache.zookeeper.ClientCnxn$SendThread.run(ClientCnxn.java:1214)
    [junit] 2016-08-24 19:27:04,506 [myid:] - INFO  [main:ZooKeeper@1313] - Session: 0x1021630d8630000 closed
    [junit] 2016-08-24 19:27:04,507 [myid:] - INFO  [main-EventThread:ClientCnxn$EventThread@513] - EventThread shut down for session: 0x1021630d8630000
    [junit] 2016-08-24 19:27:04,507 [myid:] - INFO  [main:JUnit4ZKTestRunner$LoggedInvokeMethod@82] - Memory used 153829
    [junit] 2016-08-24 19:27:04,507 [myid:] - INFO  [main:JUnit4ZKTestRunner$LoggedInvokeMethod@87] - Number of threads 1643
    [junit] 2016-08-24 19:27:04,507 [myid:] - INFO  [main:JUnit4ZKTestRunner$LoggedInvokeMethod@102] - FINISHED TEST METHOD testWatcherAutoResetWithLocal
    [junit] 2016-08-24 19:27:04,507 [myid:] - INFO  [main:ClientBase@543] - tearDown starting
    [junit] 2016-08-24 19:27:04,507 [myid:] - INFO  [main:ClientBase@513] - STOPPING server
    [junit] 2016-08-24 19:27:04,507 [myid:] - INFO  [main:NettyServerCnxnFactory@464] - shutdown called 0.0.0.0/0.0.0.0:16852
    [junit] 2016-08-24 19:27:04,511 [myid:] - INFO  [main:ZooKeeperServer@529] - shutting down
    [junit] 2016-08-24 19:27:04,511 [myid:] - ERROR [main:ZooKeeperServer@501] - ZKShutdownHandler is not registered, so ZooKeeper server won't take any action on ERROR or SHUTDOWN server state changes
    [junit] 2016-08-24 19:27:04,511 [myid:] - INFO  [main:SessionTrackerImpl@232] - Shutting down
    [junit] 2016-08-24 19:27:04,512 [myid:] - INFO  [main:PrepRequestProcessor@965] - Shutting down
    [junit] 2016-08-24 19:27:04,512 [myid:] - INFO  [main:SyncRequestProcessor@191] - Shutting down
    [junit] 2016-08-24 19:27:04,512 [myid:] - INFO  [ProcessThread(sid:0 cport:16852)::PrepRequestProcessor@154] - PrepRequestProcessor exited loop!
    [junit] 2016-08-24 19:27:04,512 [myid:] - INFO  [SyncThread:0:SyncRequestProcessor@169] - SyncRequestProcessor exited!
    [junit] 2016-08-24 19:27:04,512 [myid:] - INFO  [main:FinalRequestProcessor@479] - shutdown of request processor complete
    [junit] 2016-08-24 19:27:04,512 [myid:] - INFO  [main:MBeanRegistry@128] - Unregister MBean [org.apache.ZooKeeperService:name0=StandaloneServer_port16852,name1=InMemoryDataTree]
    [junit] 2016-08-24 19:27:04,513 [myid:] - INFO  [main:MBeanRegistry@128] - Unregister MBean [org.apache.ZooKeeperService:name0=StandaloneServer_port16852]
    [junit] 2016-08-24 19:27:04,513 [myid:] - INFO  [main:FourLetterWordMain@85] - connecting to 127.0.0.1 16852
    [junit] 2016-08-24 19:27:04,513 [myid:] - INFO  [main:JMXEnv@146] - ensureOnly:[]
    [junit] 2016-08-24 19:27:04,519 [myid:] - INFO  [main:ClientBase@568] - fdcount after test is: 4822 at start it was 4822
    [junit] 2016-08-24 19:27:04,519 [myid:] - INFO  [main:ZKTestCase$1@65] - SUCCEEDED testWatcherAutoResetWithLocal
    [junit] 2016-08-24 19:27:04,519 [myid:] - INFO  [main:ZKTestCase$1@60] - FINISHED testWatcherAutoResetWithLocal
    [junit] Tests run: 101, Failures: 0, Errors: 0, Skipped: 0, Time elapsed: 409.859 sec, Thread: 3, Class: org.apache.zookeeper.test.NioNettySuiteTest

BUILD FAILED
/home/jenkins/jenkins-slave/workspace/ZooKeeper-trunk/trunk/build.xml:1322: The following error occurred while executing this line:
/home/jenkins/jenkins-slave/workspace/ZooKeeper-trunk/trunk/build.xml:1207: Tests failed!

Total time: 9 minutes 54 seconds
Build step 'Execute shell' marked build as failure
[FINDBUGS] Skipping publisher since build result is FAILURE
[WARNINGS] Skipping publisher since build result is FAILURE
Archiving artifacts
Setting JDK_1_7_LATEST__HOME=/home/jenkins/tools/java/latest1.7
Recording fingerprints
Setting JDK_1_7_LATEST__HOME=/home/jenkins/tools/java/latest1.7
Updating ZOOKEEPER-2152
Recording test results
Setting JDK_1_7_LATEST__HOME=/home/jenkins/tools/java/latest1.7
Publishing Javadoc
Setting JDK_1_7_LATEST__HOME=/home/jenkins/tools/java/latest1.7
Setting JDK_1_7_LATEST__HOME=/home/jenkins/tools/java/latest1.7
Email was triggered for: Failure - Any
Sending email for trigger: Failure - Any
Setting JDK_1_7_LATEST__HOME=/home/jenkins/tools/java/latest1.7
Setting JDK_1_7_LATEST__HOME=/home/jenkins/tools/java/latest1.7



###################################################################################
############################## FAILED TESTS (if any) ##############################
1 tests failed.
FAILED:  org.apache.zookeeper.test.NonRecoverableErrorTest.testZooKeeperServiceAvailableOnLeader

Error Message:
IOException is expected due to error injected to transaction log commit

Stack Trace:
junit.framework.AssertionFailedError: IOException is expected due to error injected to transaction log commit
	at org.apache.zookeeper.test.NonRecoverableErrorTest.testZooKeeperServiceAvailableOnLeader(NonRecoverableErrorTest.java:115)
	at org.apache.zookeeper.JUnit4ZKTestRunner$LoggedInvokeMethod.evaluate(JUnit4ZKTestRunner.java:79)
	at java.util.concurrent.FutureTask.run(FutureTask.java:262)
	at java.lang.Thread.run(Thread.java:745)