You are viewing a plain text version of this content. The canonical link for it is here.
Posted to dev@kafka.apache.org by Apache Jenkins Server <je...@builds.apache.org> on 2024/06/05 01:57:36 UTC

Build failed in Jenkins: Kafka » Kafka Branch Builder » 3.7 #169

See <https://ci-builds.apache.org/job/Kafka/job/kafka/job/3.7/169/display/redirect>

Changes:


------------------------------------------
[...truncated 460623 lines...]
[2024-06-05T01:53:15.987Z] Gradle Test Run :core:test > Gradle Test Executor 96 > ZkMigrationIntegrationTest > testMigrateTopicDeletions(ClusterInstance) > testMigrateTopicDeletions [8] Type=ZK, MetadataVersion=3.8-IV0, Security=PLAINTEXT SKIPPED
[2024-06-05T01:53:15.987Z] 
[2024-06-05T01:53:15.987Z] Gradle Test Run :core:test > Gradle Test Executor 96 > ZkMigrationIntegrationTest > testDeleteLogOnStartup(ClusterInstance) > testDeleteLogOnStartup [1] Type=ZK, MetadataVersion=3.8-IV0, Security=PLAINTEXT STARTED
[2024-06-05T01:53:36.189Z] 
[2024-06-05T01:53:36.189Z] Gradle Test Run :core:test > Gradle Test Executor 96 > ZkMigrationIntegrationTest > testDeleteLogOnStartup(ClusterInstance) > testDeleteLogOnStartup [1] Type=ZK, MetadataVersion=3.8-IV0, Security=PLAINTEXT PASSED
[2024-06-05T01:53:36.189Z] 
[2024-06-05T01:53:36.189Z] Gradle Test Run :core:test > Gradle Test Executor 96 > ZkMigrationIntegrationTest > testPartitionReassignmentInHybridMode(ClusterInstance) > testPartitionReassignmentInHybridMode [1] Type=ZK, MetadataVersion=3.7-IV0, Security=PLAINTEXT STARTED
[2024-06-05T01:53:54.100Z] 
[2024-06-05T01:53:54.100Z] Gradle Test Run :core:test > Gradle Test Executor 96 > ZkMigrationIntegrationTest > testPartitionReassignmentInHybridMode(ClusterInstance) > testPartitionReassignmentInHybridMode [1] Type=ZK, MetadataVersion=3.7-IV0, Security=PLAINTEXT PASSED
[2024-06-05T01:53:54.100Z] 
[2024-06-05T01:53:54.100Z] Gradle Test Run :core:test > Gradle Test Executor 96 > ZkMigrationIntegrationTest > testIncrementalAlterConfigsPreMigration(ClusterInstance) > testIncrementalAlterConfigsPreMigration [1] Type=ZK, MetadataVersion=3.4-IV0, Security=PLAINTEXT STARTED
[2024-06-05T01:53:57.725Z] 
[2024-06-05T01:53:57.725Z] Gradle Test Run :core:test > Gradle Test Executor 96 > ZkMigrationIntegrationTest > testIncrementalAlterConfigsPreMigration(ClusterInstance) > testIncrementalAlterConfigsPreMigration [1] Type=ZK, MetadataVersion=3.4-IV0, Security=PLAINTEXT PASSED
[2024-06-05T01:53:57.725Z] 
[2024-06-05T01:53:57.725Z] Gradle Test Run :core:test > Gradle Test Executor 96 > ZkMigrationIntegrationTest > testDualWriteScram(ClusterInstance) > testDualWriteScram [1] Type=ZK, MetadataVersion=3.5-IV2, Security=PLAINTEXT STARTED
[2024-06-05T01:54:07.611Z] 
[2024-06-05T01:54:07.611Z] Gradle Test Run :core:test > Gradle Test Executor 96 > ZkMigrationIntegrationTest > testDualWriteScram(ClusterInstance) > testDualWriteScram [1] Type=ZK, MetadataVersion=3.5-IV2, Security=PLAINTEXT PASSED
[2024-06-05T01:54:07.611Z] 
[2024-06-05T01:54:07.611Z] Gradle Test Run :core:test > Gradle Test Executor 96 > ZkMigrationIntegrationTest > testNewAndChangedTopicsInDualWrite(ClusterInstance) > testNewAndChangedTopicsInDualWrite [1] Type=ZK, MetadataVersion=3.4-IV0, Security=PLAINTEXT STARTED
[2024-06-05T01:54:19.434Z] 
[2024-06-05T01:54:19.434Z] Gradle Test Run :core:test > Gradle Test Executor 96 > ZkMigrationIntegrationTest > testNewAndChangedTopicsInDualWrite(ClusterInstance) > testNewAndChangedTopicsInDualWrite [1] Type=ZK, MetadataVersion=3.4-IV0, Security=PLAINTEXT PASSED
[2024-06-05T01:54:19.434Z] 
[2024-06-05T01:54:19.434Z] Gradle Test Run :core:test > Gradle Test Executor 96 > ZkMigrationIntegrationTest > testDualWriteQuotaAndScram(ClusterInstance) > testDualWriteQuotaAndScram [1] Type=ZK, MetadataVersion=3.5-IV2, Security=PLAINTEXT STARTED
[2024-06-05T01:54:31.086Z] 
[2024-06-05T01:54:31.086Z] Gradle Test Run :core:test > Gradle Test Executor 96 > ZkMigrationIntegrationTest > testDualWriteQuotaAndScram(ClusterInstance) > testDualWriteQuotaAndScram [1] Type=ZK, MetadataVersion=3.5-IV2, Security=PLAINTEXT PASSED
[2024-06-05T01:54:31.086Z] 
[2024-06-05T01:54:31.086Z] Gradle Test Run :core:test > Gradle Test Executor 96 > ZkMigrationIntegrationTest > testMigrate(ClusterInstance) > testMigrate [1] Type=ZK, MetadataVersion=3.4-IV0, Security=PLAINTEXT STARTED
[2024-06-05T01:54:33.206Z] 
[2024-06-05T01:54:33.206Z] Gradle Test Run :core:test > Gradle Test Executor 96 > ZkMigrationIntegrationTest > testMigrate(ClusterInstance) > testMigrate [1] Type=ZK, MetadataVersion=3.4-IV0, Security=PLAINTEXT PASSED
[2024-06-05T01:54:33.206Z] 
[2024-06-05T01:54:33.206Z] Gradle Test Run :core:test > Gradle Test Executor 96 > ZkMigrationIntegrationTest > testMigrateAcls(ClusterInstance) > testMigrateAcls [1] Type=ZK, MetadataVersion=3.4-IV0, Security=PLAINTEXT STARTED
[2024-06-05T01:54:35.496Z] 
[2024-06-05T01:54:35.496Z] Gradle Test Run :core:test > Gradle Test Executor 96 > ZkMigrationIntegrationTest > testMigrateAcls(ClusterInstance) > testMigrateAcls [1] Type=ZK, MetadataVersion=3.4-IV0, Security=PLAINTEXT PASSED
[2024-06-05T01:54:35.496Z] 
[2024-06-05T01:54:35.496Z] Gradle Test Run :core:test > Gradle Test Executor 96 > ZkMigrationIntegrationTest > testStartZkBrokerWithAuthorizer(ClusterInstance) > testStartZkBrokerWithAuthorizer [1] Type=ZK, MetadataVersion=3.4-IV0, Security=PLAINTEXT STARTED
[2024-06-05T01:54:51.345Z] 
[2024-06-05T01:54:51.345Z] Gradle Test Run :core:test > Gradle Test Executor 96 > ZkMigrationIntegrationTest > testStartZkBrokerWithAuthorizer(ClusterInstance) > testStartZkBrokerWithAuthorizer [1] Type=ZK, MetadataVersion=3.4-IV0, Security=PLAINTEXT PASSED
[2024-06-05T01:54:51.345Z] 
[2024-06-05T01:54:51.345Z] Gradle Test Run :core:test > Gradle Test Executor 96 > ZkMigrationIntegrationTest > testDualWrite(ClusterInstance) > testDualWrite [1] Type=ZK, MetadataVersion=3.4-IV0, Security=PLAINTEXT STARTED
[2024-06-05T01:55:03.146Z] 
[2024-06-05T01:55:03.146Z] Gradle Test Run :core:test > Gradle Test Executor 96 > ZkMigrationIntegrationTest > testDualWrite(ClusterInstance) > testDualWrite [1] Type=ZK, MetadataVersion=3.4-IV0, Security=PLAINTEXT PASSED
[2024-06-05T01:55:03.146Z] 
[2024-06-05T01:55:03.146Z] Gradle Test Run :core:test > Gradle Test Executor 96 > ZkMigrationIntegrationTest > testDualWrite(ClusterInstance) > testDualWrite [2] Type=ZK, MetadataVersion=3.5-IV2, Security=PLAINTEXT STARTED
[2024-06-05T01:55:16.933Z] 
[2024-06-05T01:55:16.933Z] Gradle Test Run :core:test > Gradle Test Executor 96 > ZkMigrationIntegrationTest > testDualWrite(ClusterInstance) > testDualWrite [2] Type=ZK, MetadataVersion=3.5-IV2, Security=PLAINTEXT PASSED
[2024-06-05T01:55:16.933Z] 
[2024-06-05T01:55:16.933Z] Gradle Test Run :core:test > Gradle Test Executor 96 > ZkMigrationIntegrationTest > testDualWrite(ClusterInstance) > testDualWrite [3] Type=ZK, MetadataVersion=3.6-IV2, Security=PLAINTEXT STARTED
[2024-06-05T01:55:28.560Z] 
[2024-06-05T01:55:28.560Z] Gradle Test Run :core:test > Gradle Test Executor 96 > ZkMigrationIntegrationTest > testDualWrite(ClusterInstance) > testDualWrite [3] Type=ZK, MetadataVersion=3.6-IV2, Security=PLAINTEXT PASSED
[2024-06-05T01:55:28.560Z] 
[2024-06-05T01:55:28.560Z] Gradle Test Run :core:test > Gradle Test Executor 96 > ZkMigrationIntegrationTest > testDualWrite(ClusterInstance) > testDualWrite [4] Type=ZK, MetadataVersion=3.7-IV0, Security=PLAINTEXT STARTED
[2024-06-05T01:55:40.264Z] 
[2024-06-05T01:55:40.264Z] Gradle Test Run :core:test > Gradle Test Executor 96 > ZkMigrationIntegrationTest > testDualWrite(ClusterInstance) > testDualWrite [4] Type=ZK, MetadataVersion=3.7-IV0, Security=PLAINTEXT PASSED
[2024-06-05T01:55:40.264Z] 
[2024-06-05T01:55:40.264Z] Gradle Test Run :core:test > Gradle Test Executor 96 > ZkMigrationIntegrationTest > testDualWrite(ClusterInstance) > testDualWrite [5] Type=ZK, MetadataVersion=3.7-IV1, Security=PLAINTEXT STARTED
[2024-06-05T01:55:51.724Z] 
[2024-06-05T01:55:51.724Z] Gradle Test Run :core:test > Gradle Test Executor 96 > ZkMigrationIntegrationTest > testDualWrite(ClusterInstance) > testDualWrite [5] Type=ZK, MetadataVersion=3.7-IV1, Security=PLAINTEXT PASSED
[2024-06-05T01:55:51.724Z] 
[2024-06-05T01:55:51.724Z] Gradle Test Run :core:test > Gradle Test Executor 96 > ZkMigrationIntegrationTest > testDualWrite(ClusterInstance) > testDualWrite [6] Type=ZK, MetadataVersion=3.7-IV2, Security=PLAINTEXT STARTED
[2024-06-05T01:56:03.743Z] 
[2024-06-05T01:56:03.743Z] Gradle Test Run :core:test > Gradle Test Executor 96 > ZkMigrationIntegrationTest > testDualWrite(ClusterInstance) > testDualWrite [6] Type=ZK, MetadataVersion=3.7-IV2, Security=PLAINTEXT PASSED
[2024-06-05T01:56:03.743Z] 
[2024-06-05T01:56:03.743Z] Gradle Test Run :core:test > Gradle Test Executor 96 > ZkMigrationIntegrationTest > testDualWrite(ClusterInstance) > testDualWrite [7] Type=ZK, MetadataVersion=3.7-IV4, Security=PLAINTEXT STARTED
[2024-06-05T01:56:15.568Z] 
[2024-06-05T01:56:15.568Z] Gradle Test Run :core:test > Gradle Test Executor 96 > ZkMigrationIntegrationTest > testDualWrite(ClusterInstance) > testDualWrite [7] Type=ZK, MetadataVersion=3.7-IV4, Security=PLAINTEXT PASSED
[2024-06-05T01:56:15.568Z] 
[2024-06-05T01:56:15.568Z] Gradle Test Run :core:test > Gradle Test Executor 96 > ZkMigrationIntegrationTest > testDualWrite(ClusterInstance) > testDualWrite [8] Type=ZK, MetadataVersion=3.8-IV0, Security=PLAINTEXT STARTED
[2024-06-05T01:56:29.205Z] 
[2024-06-05T01:56:29.205Z] Gradle Test Run :core:test > Gradle Test Executor 96 > ZkMigrationIntegrationTest > testDualWrite(ClusterInstance) > testDualWrite [8] Type=ZK, MetadataVersion=3.8-IV0, Security=PLAINTEXT PASSED
[2024-06-05T01:56:29.205Z] 
[2024-06-05T01:56:29.205Z] Gradle Test Run :core:test > Gradle Test Executor 96 > ZkConfigMigrationClientTest > testScram() STARTED
[2024-06-05T01:56:29.205Z] 
[2024-06-05T01:56:29.205Z] Gradle Test Run :core:test > Gradle Test Executor 96 > ZkConfigMigrationClientTest > testScram() PASSED
[2024-06-05T01:56:29.205Z] 
[2024-06-05T01:56:29.205Z] Gradle Test Run :core:test > Gradle Test Executor 96 > ZkConfigMigrationClientTest > testMigrationBrokerConfigs() STARTED
[2024-06-05T01:56:29.205Z] 
[2024-06-05T01:56:29.205Z] Gradle Test Run :core:test > Gradle Test Executor 96 > ZkConfigMigrationClientTest > testMigrationBrokerConfigs() PASSED
[2024-06-05T01:56:29.205Z] 
[2024-06-05T01:56:29.205Z] Gradle Test Run :core:test > Gradle Test Executor 96 > ZkConfigMigrationClientTest > testMigrateClientQuotas() STARTED
[2024-06-05T01:56:29.205Z] 
[2024-06-05T01:56:29.205Z] Gradle Test Run :core:test > Gradle Test Executor 96 > ZkConfigMigrationClientTest > testMigrateClientQuotas() PASSED
[2024-06-05T01:56:29.205Z] 
[2024-06-05T01:56:29.205Z] Gradle Test Run :core:test > Gradle Test Executor 96 > ZkConfigMigrationClientTest > testWriteNewTopicConfigs() STARTED
[2024-06-05T01:56:29.205Z] 
[2024-06-05T01:56:29.205Z] Gradle Test Run :core:test > Gradle Test Executor 96 > ZkConfigMigrationClientTest > testWriteNewTopicConfigs() PASSED
[2024-06-05T01:56:29.205Z] 
[2024-06-05T01:56:29.205Z] Gradle Test Run :core:test > Gradle Test Executor 96 > ZkConfigMigrationClientTest > testDelegationTokens() STARTED
[2024-06-05T01:56:29.205Z] 
[2024-06-05T01:56:29.205Z] Gradle Test Run :core:test > Gradle Test Executor 96 > ZkConfigMigrationClientTest > testDelegationTokens() PASSED
[2024-06-05T01:56:29.205Z] 
[2024-06-05T01:56:29.205Z] Gradle Test Run :core:test > Gradle Test Executor 96 > ZkConfigMigrationClientTest > testWriteNewClientQuotas() STARTED
[2024-06-05T01:56:29.205Z] 
[2024-06-05T01:56:29.205Z] Gradle Test Run :core:test > Gradle Test Executor 96 > ZkConfigMigrationClientTest > testWriteNewClientQuotas() PASSED
[2024-06-05T01:56:29.205Z] 
[2024-06-05T01:56:29.205Z] Gradle Test Run :core:test > Gradle Test Executor 96 > ZkConfigMigrationClientTest > testWriteExistingTopicConfigs() STARTED
[2024-06-05T01:56:29.205Z] 
[2024-06-05T01:56:29.205Z] Gradle Test Run :core:test > Gradle Test Executor 96 > ZkConfigMigrationClientTest > testWriteExistingTopicConfigs() PASSED
[2024-06-05T01:56:29.205Z] 
[2024-06-05T01:56:29.205Z] Gradle Test Run :core:test > Gradle Test Executor 96 > ZkConfigMigrationClientTest > testWriteExistingClientQuotas() STARTED
[2024-06-05T01:56:29.205Z] 
[2024-06-05T01:56:29.205Z] Gradle Test Run :core:test > Gradle Test Executor 96 > ZkConfigMigrationClientTest > testWriteExistingClientQuotas() PASSED
[2024-06-05T01:56:29.205Z] 
[2024-06-05T01:56:29.205Z] Gradle Test Run :core:test > Gradle Test Executor 96 > ZkConfigMigrationClientTest > testScramAndQuotaChangesInSnapshot() STARTED
[2024-06-05T01:56:29.205Z] 
[2024-06-05T01:56:29.205Z] Gradle Test Run :core:test > Gradle Test Executor 96 > ZkConfigMigrationClientTest > testScramAndQuotaChangesInSnapshot() PASSED
[2024-06-05T01:56:29.205Z] 
[2024-06-05T01:56:29.205Z] Gradle Test Run :core:test > Gradle Test Executor 96 > VerificationGuardTest > testEqualsAndHashCode() STARTED
[2024-06-05T01:56:29.205Z] 
[2024-06-05T01:56:29.205Z] Gradle Test Run :core:test > Gradle Test Executor 96 > VerificationGuardTest > testEqualsAndHashCode() PASSED
[2024-06-05T01:56:29.205Z] 
[2024-06-05T01:56:29.205Z] Gradle Test Run :core:test > Gradle Test Executor 96 > VerificationGuardTest > testVerify() STARTED
[2024-06-05T01:56:29.205Z] 
[2024-06-05T01:56:29.205Z] Gradle Test Run :core:test > Gradle Test Executor 96 > VerificationGuardTest > testVerify() PASSED
[2024-06-05T01:56:37.659Z] 
[2024-06-05T01:56:37.659Z] Gradle Test Run :core:test > Gradle Test Executor 113 > BrokerApiVersionsCommandTest > checkBrokerApiVersionCommandOutput(String) > checkBrokerApiVersionCommandOutput(String).quorum=zk STARTED
[2024-06-05T01:56:37.659Z] 
[2024-06-05T01:56:37.659Z] Gradle Test Run :core:test > Gradle Test Executor 112 > FetchFromFollowerIntegrationTest > testFetchFromLeaderWhilePreferredReadReplicaIsUnavailable(String) > testFetchFromLeaderWhilePreferredReadReplicaIsUnavailable(String).quorum=zk STARTED
[2024-06-05T01:56:40.837Z] 
[2024-06-05T01:56:40.837Z] Gradle Test Run :core:test > Gradle Test Executor 113 > BrokerApiVersionsCommandTest > checkBrokerApiVersionCommandOutput(String) > checkBrokerApiVersionCommandOutput(String).quorum=zk PASSED
[2024-06-05T01:56:40.837Z] 
[2024-06-05T01:56:40.837Z] Gradle Test Run :core:test > Gradle Test Executor 113 > BrokerApiVersionsCommandTest > checkBrokerApiVersionCommandOutput(String) > checkBrokerApiVersionCommandOutput(String).quorum=kraft STARTED
[2024-06-05T01:56:42.958Z] 
[2024-06-05T01:56:42.958Z] Gradle Test Run :core:test > Gradle Test Executor 113 > BrokerApiVersionsCommandTest > checkBrokerApiVersionCommandOutput(String) > checkBrokerApiVersionCommandOutput(String).quorum=kraft PASSED
[2024-06-05T01:56:42.958Z] 
[2024-06-05T01:56:42.958Z] Gradle Test Run :core:test > Gradle Test Executor 113 > LogDirFailureTest > testIOExceptionDuringLogRoll(String) > testIOExceptionDuringLogRoll(String).quorum=zk STARTED
[2024-06-05T01:56:44.080Z] 
[2024-06-05T01:56:44.080Z] Gradle Test Run :core:test > Gradle Test Executor 112 > FetchFromFollowerIntegrationTest > testFetchFromLeaderWhilePreferredReadReplicaIsUnavailable(String) > testFetchFromLeaderWhilePreferredReadReplicaIsUnavailable(String).quorum=zk PASSED
[2024-06-05T01:56:44.080Z] 
[2024-06-05T01:56:44.080Z] Gradle Test Run :core:test > Gradle Test Executor 112 > FetchFromFollowerIntegrationTest > testFetchFromLeaderWhilePreferredReadReplicaIsUnavailable(String) > testFetchFromLeaderWhilePreferredReadReplicaIsUnavailable(String).quorum=kraft STARTED
[2024-06-05T01:56:50.929Z] 
[2024-06-05T01:56:50.929Z] Gradle Test Run :core:test > Gradle Test Executor 113 > LogDirFailureTest > testIOExceptionDuringLogRoll(String) > testIOExceptionDuringLogRoll(String).quorum=zk PASSED
[2024-06-05T01:56:50.929Z] 
[2024-06-05T01:56:50.929Z] Gradle Test Run :core:test > Gradle Test Executor 113 > LogDirFailureTest > testIOExceptionDuringLogRoll(String) > testIOExceptionDuringLogRoll(String).quorum=kraft STARTED
[2024-06-05T01:56:55.242Z] kafka.server.LogDirFailureTest.testIOExceptionDuringLogRoll(String)[2] failed, log available in /home/jenkins/jenkins-agent/workspace/Kafka_kafka_3.7/core/build/reports/testOutput/kafka.server.LogDirFailureTest.testIOExceptionDuringLogRoll(String)[2].test.stdout
[2024-06-05T01:56:55.242Z] 
[2024-06-05T01:56:55.242Z] Gradle Test Run :core:test > Gradle Test Executor 113 > LogDirFailureTest > testIOExceptionDuringLogRoll(String) > testIOExceptionDuringLogRoll(String).quorum=kraft FAILED
[2024-06-05T01:56:55.242Z]     java.lang.IllegalStateException: Cannot perform operation after producer has been closed
[2024-06-05T01:56:55.242Z]         at org.apache.kafka.clients.producer.KafkaProducer.throwIfProducerClosed(KafkaProducer.java:971)
[2024-06-05T01:56:55.242Z]         at org.apache.kafka.clients.producer.KafkaProducer.doSend(KafkaProducer.java:993)
[2024-06-05T01:56:55.242Z]         at org.apache.kafka.clients.producer.KafkaProducer.send(KafkaProducer.java:964)
[2024-06-05T01:56:55.242Z]         at org.apache.kafka.clients.producer.KafkaProducer.send(KafkaProducer.java:849)
[2024-06-05T01:56:55.242Z]         at kafka.server.LogDirFailureTest.$anonfun$testProduceAfterLogDirFailureOnLeader$3(LogDirFailureTest.scala:190)
[2024-06-05T01:56:55.242Z]         at kafka.server.LogDirFailureTest.testProduceAfterLogDirFailureOnLeader(LogDirFailureTest.scala:188)
[2024-06-05T01:56:55.242Z]         at kafka.server.LogDirFailureTest.testIOExceptionDuringLogRoll(LogDirFailureTest.scala:70)
[2024-06-05T01:56:55.242Z] 
[2024-06-05T01:56:55.242Z] Gradle Test Run :core:test > Gradle Test Executor 113 > LogDirFailureTest > testProduceErrorFromFailureOnCheckpoint(String) > testProduceErrorFromFailureOnCheckpoint(String).quorum=zk STARTED
[2024-06-05T01:56:57.363Z] 
[2024-06-05T01:56:57.363Z] Gradle Test Run :core:test > Gradle Test Executor 112 > FetchFromFollowerIntegrationTest > testFetchFromLeaderWhilePreferredReadReplicaIsUnavailable(String) > testFetchFromLeaderWhilePreferredReadReplicaIsUnavailable(String).quorum=kraft PASSED
[2024-06-05T01:56:57.363Z] 
[2024-06-05T01:56:57.363Z] Gradle Test Run :core:test > Gradle Test Executor 112 > DeleteOffsetsConsumerGroupCommandIntegrationTest > testDeleteOffsetsNonExistingGroup() STARTED
[2024-06-05T01:57:00.543Z] 
[2024-06-05T01:57:00.543Z] Gradle Test Run :core:test > Gradle Test Executor 112 > DeleteOffsetsConsumerGroupCommandIntegrationTest > testDeleteOffsetsNonExistingGroup() PASSED
[2024-06-05T01:57:00.543Z] 
[2024-06-05T01:57:00.543Z] Gradle Test Run :core:test > Gradle Test Executor 112 > AuthorizerIntegrationTest > testListOffsetsWithTopicDescribe(String) > testListOffsetsWithTopicDescribe(String).quorum=zk STARTED
[2024-06-05T01:57:00.543Z] 
[2024-06-05T01:57:00.543Z] Gradle Test Run :core:test > Gradle Test Executor 113 > LogDirFailureTest > testProduceErrorFromFailureOnCheckpoint(String) > testProduceErrorFromFailureOnCheckpoint(String).quorum=zk PASSED
[2024-06-05T01:57:00.543Z] 
[2024-06-05T01:57:00.543Z] Gradle Test Run :core:test > Gradle Test Executor 113 > LogDirFailureTest > testProduceErrorFromFailureOnCheckpoint(String) > testProduceErrorFromFailureOnCheckpoint(String).quorum=kraft STARTED
[2024-06-05T01:57:02.663Z] 
[2024-06-05T01:57:02.663Z] Gradle Test Run :core:test > Gradle Test Executor 112 > AuthorizerIntegrationTest > testListOffsetsWithTopicDescribe(String) > testListOffsetsWithTopicDescribe(String).quorum=zk PASSED
[2024-06-05T01:57:02.663Z] 
[2024-06-05T01:57:02.663Z] Gradle Test Run :core:test > Gradle Test Executor 112 > AuthorizerIntegrationTest > testListOffsetsWithTopicDescribe(String) > testListOffsetsWithTopicDescribe(String).quorum=kraft STARTED
[2024-06-05T01:57:06.018Z] 
[2024-06-05T01:57:06.018Z] Gradle Test Run :core:test > Gradle Test Executor 112 > AuthorizerIntegrationTest > testListOffsetsWithTopicDescribe(String) > testListOffsetsWithTopicDescribe(String).quorum=kraft PASSED
[2024-06-05T01:57:06.018Z] 
[2024-06-05T01:57:06.018Z] Gradle Test Run :core:test > Gradle Test Executor 112 > PlaintextConsumerTest > testPerPartitionLagMetricsCleanUpWithSubscribe(String, String) > testPerPartitionLagMetricsCleanUpWithSubscribe(String, String).quorum=zk.groupProtocol=classic STARTED
[2024-06-05T01:57:07.140Z] 
[2024-06-05T01:57:07.140Z] Gradle Test Run :core:test > Gradle Test Executor 113 > LogDirFailureTest > testProduceErrorFromFailureOnCheckpoint(String) > testProduceErrorFromFailureOnCheckpoint(String).quorum=kraft PASSED
[2024-06-05T01:57:11.451Z] 
[2024-06-05T01:57:11.451Z] Gradle Test Run :core:test > Gradle Test Executor 112 > PlaintextConsumerTest > testPerPartitionLagMetricsCleanUpWithSubscribe(String, String) > testPerPartitionLagMetricsCleanUpWithSubscribe(String, String).quorum=zk.groupProtocol=classic PASSED
[2024-06-05T01:57:11.451Z] 
[2024-06-05T01:57:11.451Z] Gradle Test Run :core:test > Gradle Test Executor 112 > PlaintextConsumerTest > testPerPartitionLagMetricsCleanUpWithSubscribe(String, String) > testPerPartitionLagMetricsCleanUpWithSubscribe(String, String).quorum=kraft.groupProtocol=classic STARTED
[2024-06-05T01:57:16.981Z] 
[2024-06-05T01:57:16.981Z] Gradle Test Run :core:test > Gradle Test Executor 112 > PlaintextConsumerTest > testPerPartitionLagMetricsCleanUpWithSubscribe(String, String) > testPerPartitionLagMetricsCleanUpWithSubscribe(String, String).quorum=kraft.groupProtocol=classic PASSED
[2024-06-05T01:57:16.981Z] 
[2024-06-05T01:57:16.981Z] Gradle Test Run :core:test > Gradle Test Executor 112 > PlaintextConsumerTest > testPerPartitionLagMetricsCleanUpWithSubscribe(String, String) > testPerPartitionLagMetricsCleanUpWithSubscribe(String, String).quorum=kraft+kip848.groupProtocol=classic STARTED
[2024-06-05T01:57:22.686Z] 
[2024-06-05T01:57:22.686Z] Gradle Test Run :core:test > Gradle Test Executor 112 > PlaintextConsumerTest > testPerPartitionLagMetricsCleanUpWithSubscribe(String, String) > testPerPartitionLagMetricsCleanUpWithSubscribe(String, String).quorum=kraft+kip848.groupProtocol=classic PASSED
[2024-06-05T01:57:22.686Z] 
[2024-06-05T01:57:22.686Z] Gradle Test Run :core:test > Gradle Test Executor 112 > PlaintextConsumerTest > testPerPartitionLagMetricsCleanUpWithSubscribe(String, String) > testPerPartitionLagMetricsCleanUpWithSubscribe(String, String).quorum=kraft+kip848.groupProtocol=consumer STARTED
[2024-06-05T01:57:28.215Z] kafka.api.PlaintextConsumerTest.testPerPartitionLagMetricsCleanUpWithSubscribe(String, String)[4] failed, log available in /home/jenkins/jenkins-agent/workspace/Kafka_kafka_3.7/core/build/reports/testOutput/kafka.api.PlaintextConsumerTest.testPerPartitionLagMetricsCleanUpWithSubscribe(String, String)[4].test.stdout
[2024-06-05T01:57:28.215Z] 
[2024-06-05T01:57:28.215Z] Gradle Test Run :core:test > Gradle Test Executor 112 > PlaintextConsumerTest > testPerPartitionLagMetricsCleanUpWithSubscribe(String, String) > testPerPartitionLagMetricsCleanUpWithSubscribe(String, String).quorum=kraft+kip848.groupProtocol=consumer FAILED
[2024-06-05T01:57:28.215Z]     org.opentest4j.AssertionFailedError: should be assigned once ==> expected: <1> but was: <0>
[2024-06-05T01:57:28.215Z]         at org.junit.jupiter.api.AssertionFailureBuilder.build(AssertionFailureBuilder.java:151)
[2024-06-05T01:57:28.215Z]         at org.junit.jupiter.api.AssertionFailureBuilder.buildAndThrow(AssertionFailureBuilder.java:132)
[2024-06-05T01:57:28.215Z]         at org.junit.jupiter.api.AssertEquals.failNotEqual(AssertEquals.java:197)
[2024-06-05T01:57:28.215Z]         at org.junit.jupiter.api.AssertEquals.assertEquals(AssertEquals.java:150)
[2024-06-05T01:57:28.215Z]         at org.junit.jupiter.api.Assertions.assertEquals(Assertions.java:563)
[2024-06-05T01:57:28.215Z]         at kafka.api.PlaintextConsumerTest.testPerPartitionLagMetricsCleanUpWithSubscribe(PlaintextConsumerTest.scala:1653)
[2024-06-05T01:57:28.215Z] 
[2024-06-05T01:57:28.215Z] 5539 tests completed, 9 failed, 18 skipped
[2024-06-05T01:57:31.424Z] There were failing tests. See the report at: file:///home/jenkins/jenkins-agent/workspace/Kafka_kafka_3.7/core/build/reports/tests/test/index.html
[2024-06-05T01:57:33.545Z] 
[2024-06-05T01:57:33.545Z] FAILURE: Build failed with an exception.
[2024-06-05T01:57:33.545Z] 
[2024-06-05T01:57:33.545Z] * What went wrong:
[2024-06-05T01:57:33.545Z] Execution failed for task ':connect:mirror:test'.
[2024-06-05T01:57:33.545Z] > Process 'Gradle Test Executor 68' finished with non-zero exit value 1
[2024-06-05T01:57:33.545Z]   This problem might be caused by incorrect test process configuration.
[2024-06-05T01:57:33.545Z]   For more on test execution, please refer to https://docs.gradle.org/8.6/userguide/java_testing.html#sec:test_execution in the Gradle documentation.
[2024-06-05T01:57:33.545Z] 
[2024-06-05T01:57:33.545Z] * Try:
[2024-06-05T01:57:33.545Z] > Run with --stacktrace option to get the stack trace.
[2024-06-05T01:57:33.545Z] > Run with --info or --debug option to get more log output.
[2024-06-05T01:57:33.545Z] > Get more help at https://help.gradle.org.
[2024-06-05T01:57:33.545Z] 
[2024-06-05T01:57:33.545Z] Deprecated Gradle features were used in this build, making it incompatible with Gradle 9.0.
[2024-06-05T01:57:33.545Z] 
[2024-06-05T01:57:33.545Z] You can use '--warning-mode all' to show the individual deprecation warnings and determine if they come from your own scripts or plugins.
[2024-06-05T01:57:33.545Z] 
[2024-06-05T01:57:33.545Z] For more on this, please refer to https://docs.gradle.org/8.6/userguide/command_line_interface.html#sec:command_line_warnings in the Gradle documentation.
[2024-06-05T01:57:33.545Z] 
[2024-06-05T01:57:33.545Z] BUILD FAILED in 4h 4m 18s
[2024-06-05T01:57:33.545Z] 314 actionable tasks: 116 executed, 198 up-to-date
[2024-06-05T01:57:33.545Z] 
[2024-06-05T01:57:33.545Z] Publishing build scan...
[2024-06-05T01:57:35.665Z] https://ge.apache.org/s/ve7v6aj2rookk
[2024-06-05T01:57:35.665Z] 
[2024-06-05T01:57:35.665Z] 
[2024-06-05T01:57:35.665Z] See the profiling report at: file:///home/jenkins/jenkins-agent/workspace/Kafka_kafka_3.7/build/reports/profile/profile-2024-06-04-21-53-34.html
[2024-06-05T01:57:35.665Z] A fine-grained performance profile is available: use the --scan option.
[Pipeline] }
[Pipeline] // withEnv
[Pipeline] }
[Pipeline] // withEnv
[Pipeline] }
[Pipeline] // withEnv
[Pipeline] }
[Pipeline] // node
[Pipeline] }
[Pipeline] // timestamps
[Pipeline] }
[Pipeline] // timeout
[Pipeline] }
[Pipeline] // stage
[Pipeline] }
Failed in branch JDK 8 and Scala 2.12
[Pipeline] // parallel
[Pipeline] }
[Pipeline] // stage
[Pipeline] stage
[Pipeline] { (Declarative: Post Actions)
[Pipeline] script
[Pipeline] {
[Pipeline] node
Running on builds36 in /home/jenkins/workspace/Kafka_kafka_3.7
[Pipeline] {
[Pipeline] step

Jenkins build is still unstable: Kafka » Kafka Branch Builder » 3.7 #172

Posted by Apache Jenkins Server <je...@builds.apache.org>.
See <https://ci-builds.apache.org/job/Kafka/job/kafka/job/3.7/172/display/redirect>


Jenkins build is unstable: Kafka » Kafka Branch Builder » 3.7 #171

Posted by Apache Jenkins Server <je...@builds.apache.org>.
See <https://ci-builds.apache.org/job/Kafka/job/kafka/job/3.7/171/display/redirect>


Build failed in Jenkins: Kafka » Kafka Branch Builder » 3.7 #170

Posted by Apache Jenkins Server <je...@builds.apache.org>.
See <https://ci-builds.apache.org/job/Kafka/job/kafka/job/3.7/170/display/redirect>

Changes:


------------------------------------------
[...truncated 2825 lines...]
[2024-06-05T02:03:09.419Z] [Warn] /home/jenkins/jenkins-agent/workspace/Kafka_kafka_3.7/core/src/main/scala/kafka/utils/Implicits.scala:58:4: @nowarn annotation does not suppress any warnings
[2024-06-05T02:03:09.419Z] [Warn] /home/jenkins/jenkins-agent/workspace/Kafka_kafka_3.7/core/src/main/scala/kafka/raft/KafkaMetadataLog.scala:473:4: @nowarn annotation does not suppress any warnings
[2024-06-05T02:03:09.419Z] [Warn] /home/jenkins/jenkins-agent/workspace/Kafka_kafka_3.7/core/src/main/scala/kafka/security/authorizer/AclAuthorizer.scala:535:4: @nowarn annotation does not suppress any warnings
[2024-06-05T02:03:09.419Z] [Warn] /home/jenkins/jenkins-agent/workspace/Kafka_kafka_3.7/core/src/main/scala/kafka/tools/ConsoleProducer.scala:38:2: @nowarn annotation does not suppress any warnings
[2024-06-05T02:03:09.419Z] [Warn] /home/jenkins/jenkins-agent/workspace/Kafka_kafka_3.7/core/src/main/scala/kafka/utils/CoreUtils.scala:290:4: @nowarn annotation does not suppress any warnings
[2024-06-05T02:03:09.419Z] 17 warnings found
[2024-06-05T02:03:09.419Z] 
[2024-06-05T02:03:09.419Z] > Task :core:classes
[2024-06-05T02:03:09.419Z] > Task :core:compileTestJava NO-SOURCE
[2024-06-05T02:03:10.707Z] > Task :core:checkstyleMain
[2024-06-05T02:03:10.707Z] > Task :shell:compileJava
[2024-06-05T02:03:10.707Z] > Task :shell:classes
[2024-06-05T02:03:11.821Z] > Task :shell:checkstyleMain
[2024-06-05T02:03:20.068Z] > Task :shell:spotbugsMain
[2024-06-05T02:03:21.315Z] > Task :group-coordinator:checkstyleTest
[2024-06-05T02:03:21.315Z] > Task :group-coordinator:check
[2024-06-05T02:03:24.116Z] > Task :streams:streams-scala:spotbugsMain
[2024-06-05T02:03:26.569Z] > Task :metadata:checkstyleTest
[2024-06-05T02:03:26.569Z] > Task :metadata:check
[2024-06-05T02:03:28.485Z] > Task :clients:check
[2024-06-05T02:03:40.760Z] > Task :core:compileTestScala
[2024-06-05T02:03:40.760Z] [Warn] /home/jenkins/jenkins-agent/workspace/Kafka_kafka_3.7/core/src/test/scala/unit/kafka/server/AdvertiseBrokerTest.scala:22:21: imported `QuorumTestHarness` is permanently hidden by definition of object QuorumTestHarness in package server
[2024-06-05T02:03:40.760Z] [Warn] /home/jenkins/jenkins-agent/workspace/Kafka_kafka_3.7/core/src/test/scala/unit/kafka/server/BrokerEpochIntegrationTest.scala:27:21: imported `QuorumTestHarness` is permanently hidden by definition of object QuorumTestHarness in package server
[2024-06-05T02:03:43.563Z] [Warn] /home/jenkins/jenkins-agent/workspace/Kafka_kafka_3.7/core/src/test/scala/unit/kafka/server/DynamicConfigTest.scala:20:21: imported `QuorumTestHarness` is permanently hidden by definition of object QuorumTestHarness in package server
[2024-06-05T02:03:43.563Z] [Warn] /home/jenkins/jenkins-agent/workspace/Kafka_kafka_3.7/core/src/test/scala/unit/kafka/server/FetcherThreadTestUtils.scala:21:21: imported `InitialFetchState` is permanently hidden by definition of object InitialFetchState in package server
[2024-06-05T02:03:45.670Z] [Warn] /home/jenkins/jenkins-agent/workspace/Kafka_kafka_3.7/core/src/test/scala/unit/kafka/server/KafkaMetricReporterClusterIdTest.scala:23:21: imported `QuorumTestHarness` is permanently hidden by definition of object QuorumTestHarness in package server
[2024-06-05T02:03:45.670Z] [Warn] /home/jenkins/jenkins-agent/workspace/Kafka_kafka_3.7/core/src/test/scala/unit/kafka/server/LeaderElectionTest.scala:32:21: imported `QuorumTestHarness` is permanently hidden by definition of object QuorumTestHarness in package server
[2024-06-05T02:03:46.784Z] [Warn] /home/jenkins/jenkins-agent/workspace/Kafka_kafka_3.7/core/src/test/scala/unit/kafka/server/LogRecoveryTest.scala:25:21: imported `QuorumTestHarness` is permanently hidden by definition of object QuorumTestHarness in package server
[2024-06-05T02:04:17.765Z] 
[2024-06-05T02:04:17.765Z] > Task :core:compileScala
[2024-06-05T02:04:17.765Z] Unexpected javac output: warning: [options] bootstrap class path not set in conjunction with -source 8
[2024-06-05T02:04:17.765Z] warning: [options] source value 8 is obsolete and will be removed in a future release
[2024-06-05T02:04:17.765Z] warning: [options] target value 8 is obsolete and will be removed in a future release
[2024-06-05T02:04:17.765Z] warning: [options] To suppress warnings about obsolete options, use -Xlint:-options.
[2024-06-05T02:04:17.765Z] /home/jenkins/workspace/Kafka_kafka_3.7/core/src/main/java/kafka/log/remote/RemoteLogManager.java:236: warning: [removal] AccessController in java.security has been deprecated and marked for removal
[2024-06-05T02:04:17.765Z]         return java.security.AccessController.doPrivileged(new PrivilegedAction<RemoteStorageManager>() {
[2024-06-05T02:04:17.765Z]                             ^
[2024-06-05T02:04:17.765Z] /home/jenkins/workspace/Kafka_kafka_3.7/core/src/main/java/kafka/log/remote/RemoteLogManager.java:258: warning: [removal] AccessController in java.security has been deprecated and marked for removal
[2024-06-05T02:04:17.765Z]         return java.security.AccessController.doPrivileged(new PrivilegedAction<RemoteLogMetadataManager>() {
[2024-06-05T02:04:17.765Z]                             ^
[2024-06-05T02:04:17.765Z] Note: Some input files use or override a deprecated API.
[2024-06-05T02:04:17.765Z] Note: Recompile with -Xlint:deprecation for details.
[2024-06-05T02:04:17.765Z] Note: /home/jenkins/workspace/Kafka_kafka_3.7/core/src/main/java/kafka/log/remote/RemoteLogManager.java uses unchecked or unsafe operations.
[2024-06-05T02:04:17.765Z] Note: Recompile with -Xlint:unchecked for details.
[2024-06-05T02:04:17.765Z] 6 warnings.
[2024-06-05T02:04:17.765Z] 
[2024-06-05T02:04:17.765Z] > Task :core:classes
[2024-06-05T02:04:17.765Z] > Task :core:compileTestJava NO-SOURCE
[2024-06-05T02:04:19.171Z] > Task :core:checkstyleMain
[2024-06-05T02:04:19.171Z] > Task :shell:compileJava
[2024-06-05T02:04:19.171Z] > Task :shell:classes
[2024-06-05T02:04:20.631Z] > Task :shell:checkstyleMain
[2024-06-05T02:04:34.053Z] > Task :shell:spotbugsMain
[2024-06-05T02:04:46.714Z] > Task :core:compileTestScala
[2024-06-05T02:04:47.480Z] [Warn] /home/jenkins/jenkins-agent/workspace/Kafka_kafka_3.7/core/src/test/scala/unit/kafka/log/OffsetIndexTest.scala:52:4: @nowarn annotation does not suppress any warnings
[2024-06-05T02:04:47.480Z] 8 warnings found
[2024-06-05T02:04:47.480Z] [Error] /home/jenkins/jenkins-agent/workspace/Kafka_kafka_3.7/core/src/test/java/kafka/server/LogManagerIntegrationTest.java:69:  error: cannot find symbol
[2024-06-05T02:04:47.480Z] [Error] /home/jenkins/jenkins-agent/workspace/Kafka_kafka_3.7/core/src/test/java/kafka/server/LogManagerIntegrationTest.java:69:  error: element value must be a constant expression
[2024-06-05T02:04:47.480Z] [Error] /home/jenkins/jenkins-agent/workspace/Kafka_kafka_3.7/core/src/test/java/kafka/server/LogManagerIntegrationTest.java:69:  error: element value must be a constant expression
[2024-06-05T02:04:47.480Z] [Error] /home/jenkins/jenkins-agent/workspace/Kafka_kafka_3.7/core/src/test/java/kafka/server/LogManagerIntegrationTest.java:77:  error: cannot find symbol
[2024-06-05T02:04:47.480Z] javac exited with exit code 1
[2024-06-05T02:04:47.480Z] 
[2024-06-05T02:04:47.480Z] > Task :core:compileTestScala FAILED
[2024-06-05T02:04:56.353Z] 
[2024-06-05T02:04:56.353Z] > Task :core:compileScala
[2024-06-05T02:04:56.353Z] [Warn] /home/jenkins/.gradle/workers/warning:[options] bootstrap class path not set in conjunction with -source 8
[2024-06-05T02:04:56.353Z] /home/jenkins/jenkins-agent/workspace/Kafka_kafka_3.7/core/src/main/java/kafka/log/remote/RemoteLogManager.java:236:  [removal] AccessController in java.security has been deprecated and marked for removal
[2024-06-05T02:04:56.353Z] [Warn] /home/jenkins/jenkins-agent/workspace/Kafka_kafka_3.7/core/src/main/java/kafka/log/remote/RemoteLogManager.java:258:  [removal] AccessController in java.security has been deprecated and marked for removal
[2024-06-05T02:04:56.353Z] 
[2024-06-05T02:04:56.353Z] > Task :core:classes
[2024-06-05T02:04:56.353Z] > Task :core:compileTestJava NO-SOURCE
[2024-06-05T02:04:56.353Z] > Task :core:checkstyleMain
[2024-06-05T02:04:56.353Z] > Task :shell:compileJava
[2024-06-05T02:04:56.353Z] > Task :shell:classes
[2024-06-05T02:04:56.353Z] > Task :shell:checkstyleMain
[2024-06-05T02:05:02.872Z] > Task :clients:check
[2024-06-05T02:05:05.933Z] > Task :shell:spotbugsMain
[2024-06-05T02:05:20.711Z] > Task :core:spotbugsMain
[2024-06-05T02:05:21.169Z] > Task :core:compileTestScala
[2024-06-05T02:05:30.081Z] > Task :clients:check
[2024-06-05T02:06:13.585Z] 
[2024-06-05T02:06:13.586Z] FAILURE: Build failed with an exception.
[2024-06-05T02:06:13.586Z] 
[2024-06-05T02:06:13.586Z] * What went wrong:
[2024-06-05T02:06:13.586Z] Execution failed for task ':core:compileTestScala'.
[2024-06-05T02:06:13.586Z] > javac returned non-zero exit code
[2024-06-05T02:06:13.586Z] 
[2024-06-05T02:06:13.586Z] * Try:
[2024-06-05T02:06:13.586Z] > Run with --info option to get more log output.
[2024-06-05T02:06:13.586Z] 
[2024-06-05T02:06:13.586Z] Deprecated Gradle features were used in this build, making it incompatible with Gradle 9.0.
[2024-06-05T02:06:13.586Z] 
[2024-06-05T02:06:13.586Z] You can use '--warning-mode all' to show the individual deprecation warnings and determine if they come from your own scripts or plugins.
[2024-06-05T02:06:13.586Z] 
[2024-06-05T02:06:13.586Z] For more on this, please refer to https://docs.gradle.org/8.6/userguide/command_line_interface.html#sec:command_line_warnings in the Gradle documentation.
[2024-06-05T02:06:13.586Z] 
[2024-06-05T02:06:13.586Z] BUILD FAILED in 8m 1s
[2024-06-05T02:06:13.586Z] 264 actionable tasks: 210 executed, 54 up-to-date
[2024-06-05T02:06:13.586Z] 
[2024-06-05T02:06:13.586Z] Publishing build scan...
[2024-06-05T02:06:13.586Z] https://ge.apache.org/s/h55gir3mx5kgc
[2024-06-05T02:06:13.586Z] 
[2024-06-05T02:06:13.586Z] 
[2024-06-05T02:06:13.586Z] See the profiling report at: file:///home/jenkins/jenkins-agent/workspace/Kafka_kafka_3.7/build/reports/profile/profile-2024-06-05-01-58-13.html
[2024-06-05T02:06:13.586Z] A fine-grained performance profile is available: use the --scan option.
[Pipeline] }
[Pipeline] // withEnv
[Pipeline] }
[Pipeline] // withEnv
[Pipeline] }
[Pipeline] // withEnv
[Pipeline] }
[Pipeline] // node
[Pipeline] }
[Pipeline] // timestamps
[Pipeline] }
[Pipeline] // timeout
[Pipeline] }
[Pipeline] // stage
[Pipeline] }
Failed in branch JDK 8 and Scala 2.12
[2024-06-05T02:07:33.976Z] 
[2024-06-05T02:07:33.976Z] > Task :core:compileTestScala
[2024-06-05T02:07:33.976Z] [Error] /home/jenkins/.gradle/workers/warning:[options] bootstrap class path not set in conjunction with -source 8
[2024-06-05T02:07:33.976Z] /home/jenkins/jenkins-agent/workspace/Kafka_kafka_3.7/core/src/test/java/kafka/server/LogManagerIntegrationTest.java:69:  error: cannot find symbol
[2024-06-05T02:07:33.976Z] [Error] /home/jenkins/jenkins-agent/workspace/Kafka_kafka_3.7/core/src/test/java/kafka/server/LogManagerIntegrationTest.java:77:  error: cannot find symbol
[2024-06-05T02:07:33.976Z] javac exited with exit code 1
[2024-06-05T02:07:33.976Z] 
[2024-06-05T02:07:33.976Z] > Task :core:compileTestScala FAILED
[2024-06-05T02:07:50.476Z] > Task :core:spotbugsMain
[2024-06-05T02:09:19.889Z] 
[2024-06-05T02:09:19.889Z] FAILURE: Build failed with an exception.
[2024-06-05T02:09:19.889Z] 
[2024-06-05T02:09:19.889Z] * What went wrong:
[2024-06-05T02:09:19.889Z] Execution failed for task ':core:compileTestScala'.
[2024-06-05T02:09:19.889Z] > javac returned non-zero exit code
[2024-06-05T02:09:19.889Z] 
[2024-06-05T02:09:19.889Z] * Try:
[2024-06-05T02:09:19.889Z] > Run with --info option to get more log output.
[2024-06-05T02:09:19.889Z] 
[2024-06-05T02:09:19.889Z] Deprecated Gradle features were used in this build, making it incompatible with Gradle 9.0.
[2024-06-05T02:09:19.889Z] 
[2024-06-05T02:09:19.889Z] You can use '--warning-mode all' to show the individual deprecation warnings and determine if they come from your own scripts or plugins.
[2024-06-05T02:09:19.889Z] 
[2024-06-05T02:09:19.889Z] For more on this, please refer to https://docs.gradle.org/8.6/userguide/command_line_interface.html#sec:command_line_warnings in the Gradle documentation.
[2024-06-05T02:09:19.889Z] 
[2024-06-05T02:09:19.889Z] BUILD FAILED in 11m 7s
[2024-06-05T02:09:19.889Z] 267 actionable tasks: 214 executed, 53 up-to-date
[2024-06-05T02:09:19.889Z] 
[2024-06-05T02:09:19.889Z] Publishing build scan...
[2024-06-05T02:09:19.889Z] https://ge.apache.org/s/xtz5inm45jsnc
[2024-06-05T02:09:19.889Z] 
[2024-06-05T02:09:19.889Z] 
[2024-06-05T02:09:19.889Z] See the profiling report at: file:///home/jenkins/jenkins-agent/workspace/Kafka_kafka_3.7/build/reports/profile/profile-2024-06-05-01-58-17.html
[2024-06-05T02:09:19.889Z] A fine-grained performance profile is available: use the --scan option.
[Pipeline] }
[Pipeline] // withEnv
[Pipeline] }
[Pipeline] // withEnv
[Pipeline] }
[Pipeline] // withEnv
[Pipeline] }
[Pipeline] // node
[Pipeline] }
[Pipeline] // timestamps
[Pipeline] }
[Pipeline] // timeout
[Pipeline] }
[Pipeline] // stage
[Pipeline] }
Failed in branch JDK 17 and Scala 2.13
[2024-06-05T02:09:25.166Z] 
[2024-06-05T02:09:25.166Z] > Task :core:compileTestScala
[2024-06-05T02:09:25.166Z] Unexpected javac output: warning: [options] bootstrap class path not set in conjunction with -source 8
[2024-06-05T02:09:25.166Z] warning: [options] source value 8 is obsolete and will be removed in a future release
[2024-06-05T02:09:25.166Z] warning: [options] target value 8 is obsolete and will be removed in a future release
[2024-06-05T02:09:25.166Z] warning: [options] To suppress warnings about obsolete options, use -Xlint:-options.
[2024-06-05T02:09:25.166Z] /home/jenkins/workspace/Kafka_kafka_3.7/core/src/test/java/kafka/server/LogManagerIntegrationTest.java:69: error: cannot find symbol
[2024-06-05T02:09:25.166Z]     @ClusterTest(types = {Type.KRAFT, Type.CO_KRAFT}, brokers = 3)
[2024-06-05T02:09:25.166Z]                  ^
[2024-06-05T02:09:25.166Z]   symbol:   method types()
[2024-06-05T02:09:25.166Z]   location: @interface ClusterTest
[2024-06-05T02:09:25.166Z] /home/jenkins/workspace/Kafka_kafka_3.7/core/src/test/java/kafka/server/LogManagerIntegrationTest.java:77: error: cannot find symbol
[2024-06-05T02:09:25.166Z]         cluster.waitForTopic("foo", 1);
[2024-06-05T02:09:25.166Z]                ^
[2024-06-05T02:09:25.166Z]   symbol:   method waitForTopic(String,int)
[2024-06-05T02:09:25.166Z]   location: variable cluster of type ClusterInstance
[2024-06-05T02:09:25.166Z] Note: /home/jenkins/workspace/Kafka_kafka_3.7/core/src/test/java/kafka/log/remote/RemoteLogManagerTest.java uses or overrides a deprecated API.
[2024-06-05T02:09:25.166Z] Note: Recompile with -Xlint:deprecation for details.
[2024-06-05T02:09:25.166Z] Note: Some input files use unchecked or unsafe operations.
[2024-06-05T02:09:25.166Z] Note: Recompile with -Xlint:unchecked for details.
[2024-06-05T02:09:25.166Z] 2 errors
[2024-06-05T02:09:25.166Z] 4 warnings.
[2024-06-05T02:09:25.166Z] javac exited with exit code 1
[2024-06-05T02:09:25.166Z] 
[2024-06-05T02:09:25.166Z] > Task :core:compileTestScala FAILED
[2024-06-05T02:09:47.751Z] > Task :core:spotbugsMain
[2024-06-05T02:12:22.190Z] 
[2024-06-05T02:12:22.190Z] FAILURE: Build failed with an exception.
[2024-06-05T02:12:22.190Z] 
[2024-06-05T02:12:22.190Z] * What went wrong:
[2024-06-05T02:12:22.190Z] Execution failed for task ':core:compileTestScala'.
[2024-06-05T02:12:22.190Z] > javac returned non-zero exit code
[2024-06-05T02:12:22.190Z] 
[2024-06-05T02:12:22.190Z] * Try:
[2024-06-05T02:12:22.190Z] > Run with --info option to get more log output.
[2024-06-05T02:12:22.190Z] 
[2024-06-05T02:12:22.190Z] Deprecated Gradle features were used in this build, making it incompatible with Gradle 9.0.
[2024-06-05T02:12:22.190Z] 
[2024-06-05T02:12:22.190Z] You can use '--warning-mode all' to show the individual deprecation warnings and determine if they come from your own scripts or plugins.
[2024-06-05T02:12:22.190Z] 
[2024-06-05T02:12:22.190Z] For more on this, please refer to https://docs.gradle.org/8.6/userguide/command_line_interface.html#sec:command_line_warnings in the Gradle documentation.
[2024-06-05T02:12:22.190Z] 
[2024-06-05T02:12:22.190Z] BUILD FAILED in 14m 10s
[2024-06-05T02:12:22.190Z] 267 actionable tasks: 214 executed, 53 up-to-date
[2024-06-05T02:12:22.190Z] 
[2024-06-05T02:12:22.190Z] Publishing build scan...
[2024-06-05T02:12:22.190Z] https://ge.apache.org/s/v6d2el7l6nka6
[2024-06-05T02:12:22.190Z] 
[2024-06-05T02:12:22.190Z] 
[2024-06-05T02:12:22.190Z] See the profiling report at: file:///home/jenkins/workspace/Kafka_kafka_3.7/build/reports/profile/profile-2024-06-05-01-58-19.html
[2024-06-05T02:12:22.190Z] A fine-grained performance profile is available: use the --scan option.
[Pipeline] }
[Pipeline] // withEnv
[Pipeline] }
[Pipeline] // withEnv
[Pipeline] }
[Pipeline] // withEnv
[Pipeline] }
[Pipeline] // node
[Pipeline] }
[Pipeline] // timestamps
[Pipeline] }
[Pipeline] // timeout
[Pipeline] }
[Pipeline] // stage
[Pipeline] }
Failed in branch JDK 21 and Scala 2.13
[Pipeline] // parallel
[Pipeline] }
[Pipeline] // stage
[Pipeline] stage
[Pipeline] { (Declarative: Post Actions)
[Pipeline] script
[Pipeline] {
[Pipeline] node
Running on builds37 in /home/jenkins/jenkins-agent/workspace/Kafka_kafka_3.7
[Pipeline] {
[Pipeline] step