You are viewing a plain text version of this content. The canonical link for it is here.
Posted to oak-issues@jackrabbit.apache.org by "Marcel Reutegger (JIRA)" <ji...@apache.org> on 2017/04/20 07:48:04 UTC
[jira] [Updated] (OAK-6103) Build Jackrabbit Oak #190 failed
[ https://issues.apache.org/jira/browse/OAK-6103?page=com.atlassian.jira.plugin.system.issuetabpanels:all-tabpanel ]
Marcel Reutegger updated OAK-6103:
----------------------------------
Description:
Jenkins CI failure: https://builds.apache.org/view/J/job/Jackrabbit%20Oak/
The build Jackrabbit Oak #190 has failed.
First failed run: [Jackrabbit Oak #190|https://builds.apache.org/job/Jackrabbit%20Oak/190/] [console log|https://builds.apache.org/job/Jackrabbit%20Oak/190/console]
{noformat}
[ERROR] [ERROR] Some problems were encountered while processing the POMs:
[ERROR] Unresolveable build extension: Plugin org.apache.felix:maven-bundle-plugin:3.3.0 or one of its dependencies could not be resolved: Failure to find org.apache.felix:maven-bundle-plugin:jar:3.3.0 in https://repo.maven.apache.org/maven2 was cached in the local repository, resolution will not be reattempted until the update interval of central has elapsed or updates are forced @
{noformat}
was:
Jenkins CI failure: https://builds.apache.org/view/J/job/Jackrabbit%20Oak/
The build Jackrabbit Oak #190 has failed.
First failed run: [Jackrabbit Oak #190|https://builds.apache.org/job/Jackrabbit%20Oak/190/] [console log|https://builds.apache.org/job/Jackrabbit%20Oak/190/console]
> Build Jackrabbit Oak #190 failed
> --------------------------------
>
> Key: OAK-6103
> URL: https://issues.apache.org/jira/browse/OAK-6103
> Project: Jackrabbit Oak
> Issue Type: Bug
> Components: continuous integration
> Reporter: Hudson
>
> Jenkins CI failure: https://builds.apache.org/view/J/job/Jackrabbit%20Oak/
> The build Jackrabbit Oak #190 has failed.
> First failed run: [Jackrabbit Oak #190|https://builds.apache.org/job/Jackrabbit%20Oak/190/] [console log|https://builds.apache.org/job/Jackrabbit%20Oak/190/console]
> {noformat}
> [ERROR] [ERROR] Some problems were encountered while processing the POMs:
> [ERROR] Unresolveable build extension: Plugin org.apache.felix:maven-bundle-plugin:3.3.0 or one of its dependencies could not be resolved: Failure to find org.apache.felix:maven-bundle-plugin:jar:3.3.0 in https://repo.maven.apache.org/maven2 was cached in the local repository, resolution will not be reattempted until the update interval of central has elapsed or updates are forced @
> {noformat}
--
This message was sent by Atlassian JIRA
(v6.3.15#6346)