You are viewing a plain text version of this content. The canonical link for it is here.
Posted to builds@solr.apache.org by Policeman Jenkins Server via builds <bu...@solr.apache.org> on 2026/01/28 23:45:57 UTC
[JENKINS] Solr-main-macOS (64bit/hotspot/jdk-25) - Build # 8044 - Unstable!
Build: https://jenkins.thetaphi.de/job/Solr-main-macOS/8044/
Java: 64bit/hotspot/jdk-25 -XX:+UseCompressedOops -XX:+UseParallelGC
3 tests failed.
FAILED: org.apache.solr.client.solrj.apache.ConcurrentUpdateSolrClientBuilderTest.testSocketTimeoutOnCommit
Error Message:
org.apache.solr.client.solrj.SolrServerException: IOException occurred when talking to server at: http://116.202.157.212:53809
Stack Trace:
org.apache.solr.client.solrj.SolrServerException: IOException occurred when talking to server at: http://116.202.157.212:53809
at __randomizedtesting.SeedInfo.seed([D4D3948688C588E2:C833C20E8A914666]:0)
at app//org.apache.solr.client.solrj.apache.HttpSolrClient.executeMethod(HttpSolrClient.java:696)
at app//org.apache.solr.client.solrj.apache.HttpSolrClient.request(HttpSolrClient.java:254)
at app//org.apache.solr.client.solrj.apache.HttpSolrClient.request(HttpSolrClient.java:233)
at app//org.apache.solr.client.solrj.apache.ConcurrentUpdateSolrClient.request(ConcurrentUpdateSolrClient.java:501)
at app//org.apache.solr.client.solrj.SolrRequest.process(SolrRequest.java:302)
at app//org.apache.solr.client.solrj.SolrClient.commit(SolrClient.java:467)
at app//org.apache.solr.client.solrj.SolrClient.commit(SolrClient.java:443)
at app//org.apache.solr.client.solrj.apache.ConcurrentUpdateSolrClientBuilderTest.testSocketTimeoutOnCommit(ConcurrentUpdateSolrClientBuilderTest.java:68)
at java.base@25/jdk.internal.reflect.DirectMethodHandleAccessor.invoke(DirectMethodHandleAccessor.java:104)
at java.base@25/java.lang.reflect.Method.invoke(Method.java:565)
at app//com.carrotsearch.randomizedtesting.RandomizedRunner.invoke(RandomizedRunner.java:1763)
at app//com.carrotsearch.randomizedtesting.RandomizedRunner$8.evaluate(RandomizedRunner.java:946)
at app//com.carrotsearch.randomizedtesting.RandomizedRunner$9.evaluate(RandomizedRunner.java:982)
at app//com.carrotsearch.randomizedtesting.RandomizedRunner$10.evaluate(RandomizedRunner.java:996)
at app//org.apache.lucene.tests.util.TestRuleSetupTeardownChained$1.evaluate(TestRuleSetupTeardownChained.java:48)
at app//org.apache.lucene.tests.util.AbstractBeforeAfterRule$1.evaluate(AbstractBeforeAfterRule.java:43)
at app//org.apache.lucene.tests.util.TestRuleThreadAndTestName$1.evaluate(TestRuleThreadAndTestName.java:45)
at app//org.apache.lucene.tests.util.TestRuleIgnoreAfterMaxFailures$1.evaluate(TestRuleIgnoreAfterMaxFailures.java:60)
at app//org.apache.lucene.tests.util.TestRuleMarkFailure$1.evaluate(TestRuleMarkFailure.java:44)
at app//org.junit.rules.RunRules.evaluate(RunRules.java:20)
at app//com.carrotsearch.randomizedtesting.rules.StatementAdapter.evaluate(StatementAdapter.java:36)
at app//com.carrotsearch.randomizedtesting.ThreadLeakControl$StatementRunner.run(ThreadLeakControl.java:390)
at app//com.carrotsearch.randomizedtesting.ThreadLeakControl.lambda$forkTimeoutingTask$0(ThreadLeakControl.java:850)
at java.base@25/java.lang.Thread.run(Thread.java:1474)
Caused by: org.apache.http.NoHttpResponseException: 116.202.157.212:53809 failed to respond
at app//org.apache.http.impl.conn.DefaultHttpResponseParser.parseHead(DefaultHttpResponseParser.java:141)
at app//org.apache.http.impl.conn.DefaultHttpResponseParser.parseHead(DefaultHttpResponseParser.java:56)
at app//org.apache.http.impl.io.AbstractMessageParser.parse(AbstractMessageParser.java:259)
at app//org.apache.http.impl.DefaultBHttpClientConnection.receiveResponseHeader(DefaultBHttpClientConnection.java:163)
at app//org.apache.http.impl.conn.CPoolProxy.receiveResponseHeader(CPoolProxy.java:157)
at app//org.apache.http.protocol.HttpRequestExecutor.doReceiveResponse(HttpRequestExecutor.java:273)
at app//org.apache.http.protocol.HttpRequestExecutor.execute(HttpRequestExecutor.java:125)
at app//org.apache.http.impl.execchain.MainClientExec.execute(MainClientExec.java:272)
at app//org.apache.http.impl.execchain.ProtocolExec.execute(ProtocolExec.java:186)
at app//org.apache.http.impl.execchain.RetryExec.execute(RetryExec.java:89)
at app//org.apache.http.impl.execchain.RedirectExec.execute(RedirectExec.java:110)
at app//org.apache.http.impl.client.InternalHttpClient.doExecute(InternalHttpClient.java:185)
at app//org.apache.http.impl.client.CloseableHttpClient.execute(CloseableHttpClient.java:83)
at app//org.apache.http.impl.client.CloseableHttpClient.execute(CloseableHttpClient.java:56)
at app//org.apache.solr.client.solrj.apache.HttpSolrClient.executeMethod(HttpSolrClient.java:568)
... 23 more
FAILED: org.apache.solr.client.solrj.apache.ConcurrentUpdateSolrClientBuilderTest.testSocketTimeoutOnCommit
Error Message:
org.apache.solr.client.solrj.SolrServerException: IOException occurred when talking to server at: http://116.202.157.212:54092
Stack Trace:
org.apache.solr.client.solrj.SolrServerException: IOException occurred when talking to server at: http://116.202.157.212:54092
at __randomizedtesting.SeedInfo.seed([D4D3948688C588E2:C833C20E8A914666]:0)
at app//org.apache.solr.client.solrj.apache.HttpSolrClient.executeMethod(HttpSolrClient.java:696)
at app//org.apache.solr.client.solrj.apache.HttpSolrClient.request(HttpSolrClient.java:254)
at app//org.apache.solr.client.solrj.apache.HttpSolrClient.request(HttpSolrClient.java:233)
at app//org.apache.solr.client.solrj.apache.ConcurrentUpdateSolrClient.request(ConcurrentUpdateSolrClient.java:501)
at app//org.apache.solr.client.solrj.SolrRequest.process(SolrRequest.java:302)
at app//org.apache.solr.client.solrj.SolrClient.commit(SolrClient.java:467)
at app//org.apache.solr.client.solrj.SolrClient.commit(SolrClient.java:443)
at app//org.apache.solr.client.solrj.apache.ConcurrentUpdateSolrClientBuilderTest.testSocketTimeoutOnCommit(ConcurrentUpdateSolrClientBuilderTest.java:68)
at java.base@25/jdk.internal.reflect.DirectMethodHandleAccessor.invoke(DirectMethodHandleAccessor.java:104)
at java.base@25/java.lang.reflect.Method.invoke(Method.java:565)
at app//com.carrotsearch.randomizedtesting.RandomizedRunner.invoke(RandomizedRunner.java:1763)
at app//com.carrotsearch.randomizedtesting.RandomizedRunner$8.evaluate(RandomizedRunner.java:946)
at app//com.carrotsearch.randomizedtesting.RandomizedRunner$9.evaluate(RandomizedRunner.java:982)
at app//com.carrotsearch.randomizedtesting.RandomizedRunner$10.evaluate(RandomizedRunner.java:996)
at app//org.apache.lucene.tests.util.TestRuleSetupTeardownChained$1.evaluate(TestRuleSetupTeardownChained.java:48)
at app//org.apache.lucene.tests.util.AbstractBeforeAfterRule$1.evaluate(AbstractBeforeAfterRule.java:43)
at app//org.apache.lucene.tests.util.TestRuleThreadAndTestName$1.evaluate(TestRuleThreadAndTestName.java:45)
at app//org.apache.lucene.tests.util.TestRuleIgnoreAfterMaxFailures$1.evaluate(TestRuleIgnoreAfterMaxFailures.java:60)
at app//org.apache.lucene.tests.util.TestRuleMarkFailure$1.evaluate(TestRuleMarkFailure.java:44)
at app//org.junit.rules.RunRules.evaluate(RunRules.java:20)
at app//com.carrotsearch.randomizedtesting.rules.StatementAdapter.evaluate(StatementAdapter.java:36)
at app//com.carrotsearch.randomizedtesting.ThreadLeakControl$StatementRunner.run(ThreadLeakControl.java:390)
at app//com.carrotsearch.randomizedtesting.ThreadLeakControl.lambda$forkTimeoutingTask$0(ThreadLeakControl.java:850)
at java.base@25/java.lang.Thread.run(Thread.java:1474)
Caused by: org.apache.http.NoHttpResponseException: 116.202.157.212:54092 failed to respond
at app//org.apache.http.impl.conn.DefaultHttpResponseParser.parseHead(DefaultHttpResponseParser.java:141)
at app//org.apache.http.impl.conn.DefaultHttpResponseParser.parseHead(DefaultHttpResponseParser.java:56)
at app//org.apache.http.impl.io.AbstractMessageParser.parse(AbstractMessageParser.java:259)
at app//org.apache.http.impl.DefaultBHttpClientConnection.receiveResponseHeader(DefaultBHttpClientConnection.java:163)
at app//org.apache.http.impl.conn.CPoolProxy.receiveResponseHeader(CPoolProxy.java:157)
at app//org.apache.http.protocol.HttpRequestExecutor.doReceiveResponse(HttpRequestExecutor.java:273)
at app//org.apache.http.protocol.HttpRequestExecutor.execute(HttpRequestExecutor.java:125)
at app//org.apache.http.impl.execchain.MainClientExec.execute(MainClientExec.java:272)
at app//org.apache.http.impl.execchain.ProtocolExec.execute(ProtocolExec.java:186)
at app//org.apache.http.impl.execchain.RetryExec.execute(RetryExec.java:89)
at app//org.apache.http.impl.execchain.RedirectExec.execute(RedirectExec.java:110)
at app//org.apache.http.impl.client.InternalHttpClient.doExecute(InternalHttpClient.java:185)
at app//org.apache.http.impl.client.CloseableHttpClient.execute(CloseableHttpClient.java:83)
at app//org.apache.http.impl.client.CloseableHttpClient.execute(CloseableHttpClient.java:56)
at app//org.apache.solr.client.solrj.apache.HttpSolrClient.executeMethod(HttpSolrClient.java:568)
... 23 more
FAILED: org.apache.solr.client.solrj.apache.ConcurrentUpdateSolrClientBuilderTest.testSocketTimeoutOnCommit
Error Message:
org.apache.solr.client.solrj.SolrServerException: IOException occurred when talking to server at: http://116.202.157.212:54176
Stack Trace:
org.apache.solr.client.solrj.SolrServerException: IOException occurred when talking to server at: http://116.202.157.212:54176
at __randomizedtesting.SeedInfo.seed([D4D3948688C588E2:C833C20E8A914666]:0)
at app//org.apache.solr.client.solrj.apache.HttpSolrClient.executeMethod(HttpSolrClient.java:696)
at app//org.apache.solr.client.solrj.apache.HttpSolrClient.request(HttpSolrClient.java:254)
at app//org.apache.solr.client.solrj.apache.HttpSolrClient.request(HttpSolrClient.java:233)
at app//org.apache.solr.client.solrj.apache.ConcurrentUpdateSolrClient.request(ConcurrentUpdateSolrClient.java:501)
at app//org.apache.solr.client.solrj.SolrRequest.process(SolrRequest.java:302)
at app//org.apache.solr.client.solrj.SolrClient.commit(SolrClient.java:467)
at app//org.apache.solr.client.solrj.SolrClient.commit(SolrClient.java:443)
at app//org.apache.solr.client.solrj.apache.ConcurrentUpdateSolrClientBuilderTest.testSocketTimeoutOnCommit(ConcurrentUpdateSolrClientBuilderTest.java:68)
at java.base@25/jdk.internal.reflect.DirectMethodHandleAccessor.invoke(DirectMethodHandleAccessor.java:104)
at java.base@25/java.lang.reflect.Method.invoke(Method.java:565)
at app//com.carrotsearch.randomizedtesting.RandomizedRunner.invoke(RandomizedRunner.java:1763)
at app//com.carrotsearch.randomizedtesting.RandomizedRunner$8.evaluate(RandomizedRunner.java:946)
at app//com.carrotsearch.randomizedtesting.RandomizedRunner$9.evaluate(RandomizedRunner.java:982)
at app//com.carrotsearch.randomizedtesting.RandomizedRunner$10.evaluate(RandomizedRunner.java:996)
at app//org.apache.lucene.tests.util.TestRuleSetupTeardownChained$1.evaluate(TestRuleSetupTeardownChained.java:48)
at app//org.apache.lucene.tests.util.AbstractBeforeAfterRule$1.evaluate(AbstractBeforeAfterRule.java:43)
at app//org.apache.lucene.tests.util.TestRuleThreadAndTestName$1.evaluate(TestRuleThreadAndTestName.java:45)
at app//org.apache.lucene.tests.util.TestRuleIgnoreAfterMaxFailures$1.evaluate(TestRuleIgnoreAfterMaxFailures.java:60)
at app//org.apache.lucene.tests.util.TestRuleMarkFailure$1.evaluate(TestRuleMarkFailure.java:44)
at app//org.junit.rules.RunRules.evaluate(RunRules.java:20)
at app//com.carrotsearch.randomizedtesting.rules.StatementAdapter.evaluate(StatementAdapter.java:36)
at app//com.carrotsearch.randomizedtesting.ThreadLeakControl$StatementRunner.run(ThreadLeakControl.java:390)
at app//com.carrotsearch.randomizedtesting.ThreadLeakControl.lambda$forkTimeoutingTask$0(ThreadLeakControl.java:850)
at java.base@25/java.lang.Thread.run(Thread.java:1474)
Caused by: org.apache.http.NoHttpResponseException: 116.202.157.212:54176 failed to respond
at app//org.apache.http.impl.conn.DefaultHttpResponseParser.parseHead(DefaultHttpResponseParser.java:141)
at app//org.apache.http.impl.conn.DefaultHttpResponseParser.parseHead(DefaultHttpResponseParser.java:56)
at app//org.apache.http.impl.io.AbstractMessageParser.parse(AbstractMessageParser.java:259)
at app//org.apache.http.impl.DefaultBHttpClientConnection.receiveResponseHeader(DefaultBHttpClientConnection.java:163)
at app//org.apache.http.impl.conn.CPoolProxy.receiveResponseHeader(CPoolProxy.java:157)
at app//org.apache.http.protocol.HttpRequestExecutor.doReceiveResponse(HttpRequestExecutor.java:273)
at app//org.apache.http.protocol.HttpRequestExecutor.execute(HttpRequestExecutor.java:125)
at app//org.apache.http.impl.execchain.MainClientExec.execute(MainClientExec.java:272)
at app//org.apache.http.impl.execchain.ProtocolExec.execute(ProtocolExec.java:186)
at app//org.apache.http.impl.execchain.RetryExec.execute(RetryExec.java:89)
at app//org.apache.http.impl.execchain.RedirectExec.execute(RedirectExec.java:110)
at app//org.apache.http.impl.client.InternalHttpClient.doExecute(InternalHttpClient.java:185)
at app//org.apache.http.impl.client.CloseableHttpClient.execute(CloseableHttpClient.java:83)
at app//org.apache.http.impl.client.CloseableHttpClient.execute(CloseableHttpClient.java:56)
at app//org.apache.solr.client.solrj.apache.HttpSolrClient.executeMethod(HttpSolrClient.java:568)
... 23 more
[JENKINS] Solr-main-macOS (64bit/hotspot/jdk-23.0.2) - Build # 8045 - Still Unstable!
Posted by Policeman Jenkins Server via builds <bu...@solr.apache.org>.
Build: https://jenkins.thetaphi.de/job/Solr-main-macOS/8045/
Java: 64bit/hotspot/jdk-23.0.2 -XX:+UseCompressedOops -XX:+UseSerialGC
1 tests failed.
FAILED: org.apache.solr.client.solrj.impl.CloudSolrClientCacheTest.testStaleStateRetryWaitsAfterSkipFailure
Error Message:
java.lang.AssertionError: Refresh should have been called
Stack Trace:
java.lang.AssertionError: Refresh should have been called
at __randomizedtesting.SeedInfo.seed([C31F0686CDF4E05C:10D15330454D71AC]:0)
at org.junit.Assert.fail(Assert.java:89)
at org.junit.Assert.assertTrue(Assert.java:42)
at org.apache.solr.client.solrj.impl.CloudSolrClientCacheTest.testStaleStateRetryWaitsAfterSkipFailure(CloudSolrClientCacheTest.java:235)
at java.base/jdk.internal.reflect.DirectMethodHandleAccessor.invoke(DirectMethodHandleAccessor.java:103)
at java.base/java.lang.reflect.Method.invoke(Method.java:580)
at com.carrotsearch.randomizedtesting.RandomizedRunner.invoke(RandomizedRunner.java:1763)
at com.carrotsearch.randomizedtesting.RandomizedRunner$8.evaluate(RandomizedRunner.java:946)
at com.carrotsearch.randomizedtesting.RandomizedRunner$9.evaluate(RandomizedRunner.java:982)
at com.carrotsearch.randomizedtesting.RandomizedRunner$10.evaluate(RandomizedRunner.java:996)
at com.carrotsearch.randomizedtesting.rules.SystemPropertiesRestoreRule$1.evaluate(SystemPropertiesRestoreRule.java:80)
at org.junit.rules.RunRules.evaluate(RunRules.java:20)
at org.apache.lucene.tests.util.TestRuleSetupTeardownChained$1.evaluate(TestRuleSetupTeardownChained.java:48)
at org.apache.lucene.tests.util.AbstractBeforeAfterRule$1.evaluate(AbstractBeforeAfterRule.java:43)
at org.apache.lucene.tests.util.TestRuleThreadAndTestName$1.evaluate(TestRuleThreadAndTestName.java:45)
at org.apache.lucene.tests.util.TestRuleIgnoreAfterMaxFailures$1.evaluate(TestRuleIgnoreAfterMaxFailures.java:60)
at org.apache.lucene.tests.util.TestRuleMarkFailure$1.evaluate(TestRuleMarkFailure.java:44)
at org.junit.rules.RunRules.evaluate(RunRules.java:20)
at com.carrotsearch.randomizedtesting.rules.StatementAdapter.evaluate(StatementAdapter.java:36)
at com.carrotsearch.randomizedtesting.ThreadLeakControl$StatementRunner.run(ThreadLeakControl.java:390)
at com.carrotsearch.randomizedtesting.ThreadLeakControl.forkTimeoutingTask(ThreadLeakControl.java:843)
at com.carrotsearch.randomizedtesting.ThreadLeakControl$3.evaluate(ThreadLeakControl.java:490)
at com.carrotsearch.randomizedtesting.RandomizedRunner.runSingleTest(RandomizedRunner.java:955)
at com.carrotsearch.randomizedtesting.RandomizedRunner$5.evaluate(RandomizedRunner.java:840)
at com.carrotsearch.randomizedtesting.RandomizedRunner$6.evaluate(RandomizedRunner.java:891)
at com.carrotsearch.randomizedtesting.RandomizedRunner$7.evaluate(RandomizedRunner.java:902)
at com.carrotsearch.randomizedtesting.rules.StatementAdapter.evaluate(StatementAdapter.java:36)
at com.carrotsearch.randomizedtesting.rules.StatementAdapter.evaluate(StatementAdapter.java:36)
at org.apache.lucene.tests.util.AbstractBeforeAfterRule$1.evaluate(AbstractBeforeAfterRule.java:43)
at com.carrotsearch.randomizedtesting.rules.SystemPropertiesRestoreRule$1.evaluate(SystemPropertiesRestoreRule.java:80)
at org.junit.rules.RunRules.evaluate(RunRules.java:20)
at org.apache.lucene.tests.util.AbstractBeforeAfterRule$1.evaluate(AbstractBeforeAfterRule.java:43)
at com.carrotsearch.randomizedtesting.rules.StatementAdapter.evaluate(StatementAdapter.java:36)
at org.apache.lucene.tests.util.TestRuleStoreClassName$1.evaluate(TestRuleStoreClassName.java:38)
at com.carrotsearch.randomizedtesting.rules.NoShadowingOrOverridesOnMethodsRule$1.evaluate(NoShadowingOrOverridesOnMethodsRule.java:40)
at com.carrotsearch.randomizedtesting.rules.NoShadowingOrOverridesOnMethodsRule$1.evaluate(NoShadowingOrOverridesOnMethodsRule.java:40)
at com.carrotsearch.randomizedtesting.rules.StatementAdapter.evaluate(StatementAdapter.java:36)
at com.carrotsearch.randomizedtesting.rules.StatementAdapter.evaluate(StatementAdapter.java:36)
at org.apache.lucene.tests.util.TestRuleAssertionsRequired$1.evaluate(TestRuleAssertionsRequired.java:53)
at org.apache.lucene.tests.util.AbstractBeforeAfterRule$1.evaluate(AbstractBeforeAfterRule.java:43)
at org.apache.lucene.tests.util.TestRuleMarkFailure$1.evaluate(TestRuleMarkFailure.java:44)
at org.apache.lucene.tests.util.TestRuleIgnoreAfterMaxFailures$1.evaluate(TestRuleIgnoreAfterMaxFailures.java:60)
at org.apache.lucene.tests.util.TestRuleIgnoreTestSuites$1.evaluate(TestRuleIgnoreTestSuites.java:47)
at org.junit.rules.RunRules.evaluate(RunRules.java:20)
at com.carrotsearch.randomizedtesting.rules.StatementAdapter.evaluate(StatementAdapter.java:36)
at com.carrotsearch.randomizedtesting.ThreadLeakControl$StatementRunner.run(ThreadLeakControl.java:390)
at com.carrotsearch.randomizedtesting.ThreadLeakControl.lambda$forkTimeoutingTask$0(ThreadLeakControl.java:850)
at java.base/java.lang.Thread.run(Thread.java:1575)