You are viewing a plain text version of this content. The canonical link for it is here.
Posted to notifications@ant.apache.org by Apache Jenkins Server <je...@builds.apache.org> on 2018/08/10 12:57:30 UTC
Build failed in Jenkins: IvyDE #382
See <https://builds.apache.org/job/IvyDE/382/display/redirect?page=changes>
Changes:
[gintas] Revise messages
------------------------------------------
[...truncated 308.62 KB...]
[pde-build] customAssembly:
[pde-build]
[pde-build] jar.processing:
[pde-build]
[pde-build] customAssembly:
[pde-build]
[pde-build] assemble.archive:
[pde-build]
[pde-build] customAssembly:
[pde-build]
[pde-build] cleanup.assembly:
[pde-build] [delete] Deleting directory <https://builds.apache.org/job/IvyDE/ws/work/eclipse/tmp>
[pde-build]
[pde-build] generate.p2.metadata:
[pde-build] [p2.generator] Generating metadata for ..
[pde-build] [p2.generator] Generation completed with success [0 seconds].
[pde-build]
[pde-build] init:
[pde-build]
[pde-build] packageElement:
[pde-build]
[pde-build] main:
[pde-build]
[pde-build] assemble.org.apache.ivyde.eclipse.resolvevisualizer.feature:
[pde-build]
[pde-build] main:
[pde-build] [mkdir] Created dir: <https://builds.apache.org/job/IvyDE/ws/work/eclipse/tmp>
[pde-build]
[pde-build] gather.bin.parts:
[pde-build]
[pde-build] customAssembly:
[pde-build]
[pde-build] jar.processing:
[pde-build]
[pde-build] customAssembly:
[pde-build]
[pde-build] assemble.archive:
[pde-build]
[pde-build] customAssembly:
[pde-build]
[pde-build] cleanup.assembly:
[pde-build] [delete] Deleting directory <https://builds.apache.org/job/IvyDE/ws/work/eclipse/tmp>
[pde-build]
[pde-build] generate.p2.metadata:
[pde-build] [p2.generator] Generating metadata for ..
[pde-build] [p2.generator] Generation completed with success [0 seconds].
[pde-build]
[pde-build] postPackage:
[pde-build]
[pde-build] postBuild:
[pde-build]
[pde-build] postBuild:
[pde-build]
[pde-build] gatherLogs:
[pde-build] [mkdir] Created dir: <https://builds.apache.org/job/IvyDE/ws/work/eclipse/2.3.0.rc1-201808101256-jenkins-382/compilelogs>
[pde-build]
[pde-build] allElements:
[pde-build]
[pde-build] allElementsDelegator:
[pde-build]
[pde-build] init:
[pde-build]
[pde-build] gatherLogs:
[pde-build]
[pde-build] init:
[pde-build]
[pde-build] zip.logs:
[pde-build] [mkdir] Created dir: <https://builds.apache.org/job/IvyDE/ws/work/eclipse/features/org.apache.ivyde.feature/feature.temp.folder>
[pde-build]
[pde-build] init:
[pde-build]
[pde-build] all.features:
[pde-build]
[pde-build] all.plugins:
[pde-build]
[pde-build] properties:
[pde-build]
[pde-build] init:
[pde-build]
[pde-build] gather.logs:
[pde-build] [mkdir] Created dir: <https://builds.apache.org/job/IvyDE/ws/work/eclipse/features/org.apache.ivyde.feature/feature.temp.folder/plugins/org.apache.ivyde.eclipse_2.3.0.rc1-201808101256-jenkins-382>
[pde-build] [copy] Copying 1 file to <https://builds.apache.org/job/IvyDE/ws/work/eclipse/features/org.apache.ivyde.feature/feature.temp.folder/plugins/org.apache.ivyde.eclipse_2.3.0.rc1-201808101256-jenkins-382>
[pde-build]
[pde-build] update.feature:
[pde-build]
[pde-build] all.children:
[pde-build] [zip] Building zip: <https://builds.apache.org/job/IvyDE/ws/work/eclipse/features/org.apache.ivyde.feature/org.apache.ivyde.feature_2.3.0.rc1-201808101256-jenkins-382.log.zip>
[pde-build] [delete] Deleting directory <https://builds.apache.org/job/IvyDE/ws/work/eclipse/features/org.apache.ivyde.feature/feature.temp.folder>
[pde-build]
[pde-build] init:
[pde-build]
[pde-build] gatherLogs:
[pde-build]
[pde-build] init:
[pde-build]
[pde-build] zip.logs:
[pde-build] [mkdir] Created dir: <https://builds.apache.org/job/IvyDE/ws/work/eclipse/features/org.apache.ivyde.eclipse.resolvevisualizer.feature/feature.temp.folder>
[pde-build]
[pde-build] init:
[pde-build]
[pde-build] all.features:
[pde-build]
[pde-build] all.plugins:
[pde-build]
[pde-build] properties:
[pde-build]
[pde-build] init:
[pde-build]
[pde-build] gather.logs:
[pde-build] [mkdir] Created dir: <https://builds.apache.org/job/IvyDE/ws/work/eclipse/features/org.apache.ivyde.eclipse.resolvevisualizer.feature/feature.temp.folder/plugins/org.apache.ivyde.eclipse.resolvevisualizer_2.3.0.rc1-201808101256-jenkins-382>
[pde-build] [copy] Copying 1 file to <https://builds.apache.org/job/IvyDE/ws/work/eclipse/features/org.apache.ivyde.eclipse.resolvevisualizer.feature/feature.temp.folder/plugins/org.apache.ivyde.eclipse.resolvevisualizer_2.3.0.rc1-201808101256-jenkins-382>
[pde-build]
[pde-build] update.feature:
[pde-build]
[pde-build] all.children:
[pde-build] [zip] Building zip: <https://builds.apache.org/job/IvyDE/ws/work/eclipse/features/org.apache.ivyde.eclipse.resolvevisualizer.feature/org.apache.ivyde.eclipse.resolvevisualizer.feature_2.3.0.rc1-201808101256-jenkins-382.log.zip>
[pde-build] [delete] Deleting directory <https://builds.apache.org/job/IvyDE/ws/work/eclipse/features/org.apache.ivyde.eclipse.resolvevisualizer.feature/feature.temp.folder>
[pde-build] [unzip] Expanding: <https://builds.apache.org/job/IvyDE/ws/work/eclipse/features/org.apache.ivyde.eclipse.resolvevisualizer.feature/org.apache.ivyde.eclipse.resolvevisualizer.feature_2.3.0.rc1-201808101256-jenkins-382.log.zip> into <https://builds.apache.org/job/IvyDE/ws/work/eclipse/2.3.0.rc1-201808101256-jenkins-382/compilelogs>
[pde-build] [unzip] Expanding: <https://builds.apache.org/job/IvyDE/ws/work/eclipse/features/org.apache.ivyde.feature/org.apache.ivyde.feature_2.3.0.rc1-201808101256-jenkins-382.log.zip> into <https://builds.apache.org/job/IvyDE/ws/work/eclipse/2.3.0.rc1-201808101256-jenkins-382/compilelogs>
[pde-build] BUILD SUCCESSFUL
[pde-build]
[pde-build] BUILD SUCCESSFUL
[pde-build] Total time: 12 seconds
generate-p2-category:
[java] Generating metadata for ..
[java] Generation completed with success [0 seconds].
generate-dist-doc-files:
[mkdir] Created dir: <https://builds.apache.org/job/IvyDE/ws/work/dist/apache-ivyde-2.3.0.rc1-201808101256-jenkins-382/doc>
[copy] Copying 88 files to <https://builds.apache.org/job/IvyDE/ws/work/dist/apache-ivyde-2.3.0.rc1-201808101256-jenkins-382/doc>
generate-dist-doc-articles:
[asciidoctor:convert] Render asciidoc files from <https://builds.apache.org/job/IvyDE/ws/doc/src> to <https://builds.apache.org/job/IvyDE/ws/work/dist/apache-ivyde-2.3.0.rc1-201808101256-jenkins-382/doc> with backend=xhtml5
generate-dist-doc-book-adoc:
[mkdir] Created dir: <https://builds.apache.org/job/IvyDE/ws/work/book>
generate-dist-doc-book:
[asciidoctor:convert] Render asciidoc files from <https://builds.apache.org/job/IvyDE/ws/work/book> to <https://builds.apache.org/job/IvyDE/ws/work/dist/apache-ivyde-2.3.0.rc1-201808101256-jenkins-382/doc> with backend=xhtml5
[asciidoctor:convert] asciidoctor: WARNING: include file has illegal reference to ancestor of jail, auto-recovering
[asciidoctor:convert] asciidoctor: WARNING: include file has illegal reference to ancestor of jail, auto-recovering
[asciidoctor:convert] asciidoctor: WARNING: include file has illegal reference to ancestor of jail, auto-recovering
[asciidoctor:convert] asciidoctor: WARNING: include file has illegal reference to ancestor of jail, auto-recovering
[asciidoctor:convert] asciidoctor: ERROR: book.adoc: line 50: invalid part, must have at least one section (e.g., chapter, appendix, etc.)
[asciidoctor:convert] asciidoctor: WARNING: include file has illegal reference to ancestor of jail, auto-recovering
[asciidoctor:convert] asciidoctor: WARNING: include file has illegal reference to ancestor of jail, auto-recovering
[asciidoctor:convert] asciidoctor: WARNING: include file has illegal reference to ancestor of jail, auto-recovering
[asciidoctor:convert] asciidoctor: WARNING: include file has illegal reference to ancestor of jail, auto-recovering
[asciidoctor:convert] asciidoctor: WARNING: include file has illegal reference to ancestor of jail, auto-recovering
[asciidoctor:convert] asciidoctor: WARNING: include file has illegal reference to ancestor of jail, auto-recovering
[asciidoctor:convert] asciidoctor: WARNING: include file has illegal reference to ancestor of jail, auto-recovering
[asciidoctor:convert] asciidoctor: WARNING: include file has illegal reference to ancestor of jail, auto-recovering
[asciidoctor:convert] asciidoctor: WARNING: include file has illegal reference to ancestor of jail, auto-recovering
[asciidoctor:convert] asciidoctor: WARNING: include file has illegal reference to ancestor of jail, auto-recovering
[asciidoctor:convert] asciidoctor: WARNING: include file has illegal reference to ancestor of jail, auto-recovering
[asciidoctor:convert] asciidoctor: WARNING: include file has illegal reference to ancestor of jail, auto-recovering
[asciidoctor:convert] asciidoctor: WARNING: include file has illegal reference to ancestor of jail, auto-recovering
[asciidoctor:convert] asciidoctor: WARNING: include file has illegal reference to ancestor of jail, auto-recovering
[asciidoctor:convert] asciidoctor: WARNING: include file has illegal reference to ancestor of jail, auto-recovering
[asciidoctor:convert] asciidoctor: WARNING: include file has illegal reference to ancestor of jail, auto-recovering
[asciidoctor:convert] asciidoctor: WARNING: include file has illegal reference to ancestor of jail, auto-recovering
[asciidoctor:convert] asciidoctor: WARNING: include file has illegal reference to ancestor of jail, auto-recovering
[asciidoctor:convert] asciidoctor: WARNING: include file has illegal reference to ancestor of jail, auto-recovering
[asciidoctor:convert] asciidoctor: WARNING: include file has illegal reference to ancestor of jail, auto-recovering
[asciidoctor:convert] asciidoctor: WARNING: include file has illegal reference to ancestor of jail, auto-recovering
[asciidoctor:convert] asciidoctor: ERROR: book.adoc: line 134: invalid part, must have at least one section (e.g., chapter, appendix, etc.)
[asciidoctor:convert] asciidoctor: WARNING: include file has illegal reference to ancestor of jail, auto-recovering
[asciidoctor:convert] asciidoctor: WARNING: include file has illegal reference to ancestor of jail, auto-recovering
[asciidoctor:convert] asciidoctor: WARNING: include file has illegal reference to ancestor of jail, auto-recovering
[asciidoctor:convert] asciidoctor: WARNING: include file has illegal reference to ancestor of jail, auto-recovering
generate-dist-doc-html:
package-binaries:
[unzip] Expanding: <https://builds.apache.org/job/IvyDE/ws/work/eclipse/2.3.0.rc1-201808101256-jenkins-382/org.apache.ivyde.feature-2.3.0.rc1-201808101256-jenkins-382.zip> into <https://builds.apache.org/job/IvyDE/ws/work/dist/apache-ivyde-2.3.0.rc1-201808101256-jenkins-382>
[unzip] Expanding: <https://builds.apache.org/job/IvyDE/ws/work/eclipse/2.3.0.rc1-201808101256-jenkins-382/org.apache.ivyde.eclipse.resolvevisualizer.feature-2.3.0.rc1-201808101256-jenkins-382.zip> into <https://builds.apache.org/job/IvyDE/ws/work/dist/apache-ivyde-2.3.0.rc1-201808101256-jenkins-382>
[copy] Copying 2 files to <https://builds.apache.org/job/IvyDE/ws/work/dist/apache-ivyde-2.3.0.rc1-201808101256-jenkins-382>
[copy] Copying 2 files to <https://builds.apache.org/job/IvyDE/ws/work/dist/apache-ivyde-2.3.0.rc1-201808101256-jenkins-382>
[mkdir] Created dir: <https://builds.apache.org/job/IvyDE/ws/dist>
[zip] Building zip: <https://builds.apache.org/job/IvyDE/382/artifact/dist/apache-ivyde-2.3.0.rc1-201808101256-jenkins-382.zip>
[tar] Building tar: <https://builds.apache.org/job/IvyDE/382/artifact/dist/apache-ivyde-2.3.0.rc1-201808101256-jenkins-382.tar.gz>
[tar] Entry: apache-ivyde-2.3.0.rc1-201808101256-jenkins-382/doc/images/sec_add_credentials_duplicate_resolved.png longer than 100 characters.
[tar] Resulting tar file can only be processed successfully by GNU compatible tar commands
[tar] Entry: apache-ivyde-2.3.0.rc1-201808101256-jenkins-382/features/org.apache.ivyde.eclipse.resolvevisualizer.feature_2.3.0.rc1-201808101256-jenkins-382.jar longer than 100 characters.
[tar] Entry: apache-ivyde-2.3.0.rc1-201808101256-jenkins-382/features/org.apache.ivyde.feature_2.3.0.rc1-201808101256-jenkins-382.jar longer than 100 characters.
[tar] Entry: apache-ivyde-2.3.0.rc1-201808101256-jenkins-382/plugins/org.apache.ivyde.eclipse.resolvevisualizer_2.3.0.rc1-201808101256-jenkins-382.jar longer than 100 characters.
[tar] Entry: apache-ivyde-2.3.0.rc1-201808101256-jenkins-382/plugins/org.apache.ivyde.eclipse_2.3.0.rc1-201808101256-jenkins-382.jar longer than 100 characters.
package-sources:
checksum:
dist:
download-ivy:
init-ivy:
checkstyle-internal:
[ivy:cachepath] ivy.instance reference an ivy:settings defined in an other classloader. An new default one will be used in this project.
[ivy:cachepath] :: Apache Ivy 2.5.0-rc1 - 20180412005306 :: http://ant.apache.org/ivy/ ::
[ivy:cachepath] :: loading settings :: url = jar:<https://builds.apache.org/job/IvyDE/ws/work/ivy.jar!/org/apache/ivy/core/settings/ivysettings.xml>
[ivy:cachepath] :: resolving dependencies :: com.puppycrawl.tools#checkstyle-caller;working
[ivy:cachepath] confs: [default]
[ivy:cachepath] :: resolution report :: resolve 375ms :: artifacts dl 0ms
---------------------------------------------------------------------
| | modules || artifacts |
| conf | number| search|dwnlded|evicted|| number|dwnlded|
---------------------------------------------------------------------
| default | 1 | 0 | 0 | 0 || 0 | 0 |
---------------------------------------------------------------------
[ivy:cachepath]
[ivy:cachepath] :: problems summary ::
[ivy:cachepath] :::: WARNINGS
[ivy:cachepath] module not found: com.puppycrawl.tools#checkstyle;6.19
[ivy:cachepath] ==== local: tried
[ivy:cachepath] /home/jenkins/.ivy2/local/com.puppycrawl.tools/checkstyle/6.19/ivys/ivy.xml
[ivy:cachepath] -- artifact com.puppycrawl.tools#checkstyle;6.19!checkstyle.jar:
[ivy:cachepath] /home/jenkins/.ivy2/local/com.puppycrawl.tools/checkstyle/6.19/jars/checkstyle.jar
[ivy:cachepath] ==== shared: tried
[ivy:cachepath] /home/jenkins/.ivy2/shared/com.puppycrawl.tools/checkstyle/6.19/ivys/ivy.xml
[ivy:cachepath] -- artifact com.puppycrawl.tools#checkstyle;6.19!checkstyle.jar:
[ivy:cachepath] /home/jenkins/.ivy2/shared/com.puppycrawl.tools/checkstyle/6.19/jars/checkstyle.jar
[ivy:cachepath] ==== public: tried
[ivy:cachepath] https://repo1.maven.org/maven2/com/puppycrawl/tools/checkstyle/6.19/checkstyle-6.19.pom
[ivy:cachepath] -- artifact com.puppycrawl.tools#checkstyle;6.19!checkstyle.jar:
[ivy:cachepath] https://repo1.maven.org/maven2/com/puppycrawl/tools/checkstyle/6.19/checkstyle-6.19.jar
[ivy:cachepath] ::::::::::::::::::::::::::::::::::::::::::::::
[ivy:cachepath] :: UNRESOLVED DEPENDENCIES ::
[ivy:cachepath] ::::::::::::::::::::::::::::::::::::::::::::::
[ivy:cachepath] :: com.puppycrawl.tools#checkstyle;6.19: not found
[ivy:cachepath] ::::::::::::::::::::::::::::::::::::::::::::::
[ivy:cachepath] :::: ERRORS
[ivy:cachepath] Server access error at url https://repo1.maven.org/maven2/com/puppycrawl/tools/checkstyle/6.19/checkstyle-6.19.pom (javax.net.ssl.SSLException: Received fatal alert: protocol_version)
[ivy:cachepath] Server access error at url https://repo1.maven.org/maven2/com/puppycrawl/tools/checkstyle/6.19/checkstyle-6.19.jar (javax.net.ssl.SSLException: Received fatal alert: protocol_version)
[ivy:cachepath]
[ivy:cachepath] :: USE VERBOSE OR DEBUG MESSAGE LEVEL FOR MORE DETAILS
BUILD FAILED
<https://builds.apache.org/job/IvyDE/ws/build.xml>:514: impossible to resolve dependencies:
resolve failed - see output for details
Total time: 1 minute 1 second
Build step 'Invoke Ant' marked build as failure
[locks-and-latches] Releasing all the locks
[locks-and-latches] All the locks released
Archiving artifacts
[Fast Archiver] Compressed 30.24 MB of artifacts by 21.3% relative to #381
Jenkins build is back to normal : IvyDE #384
Posted by Apache Jenkins Server <je...@builds.apache.org>.
See <https://builds.apache.org/job/IvyDE/384/display/redirect>
Build failed in Jenkins: IvyDE #383
Posted by Apache Jenkins Server <je...@builds.apache.org>.
See <https://builds.apache.org/job/IvyDE/383/display/redirect>
------------------------------------------
[...truncated 164.22 KB...]
[get] ....................................................
[get] ....................................................
[get] ....................................................
[get] ....................................................
[get] ....................................................
[get] ....................................................
[get] ....................................................
[get] ....................................................
[get] ....................................................
[get] ....................................................
[get] ....................................................
[get] ....................................................
[get] ....................................................
[get] ....................................................
[get] ....................................................
[get] ....................................................
[get] ....................................................
[get] ....................................................
[get] ....................................................
[get] ....................................................
[get] ....................................................
[get] ....................................................
[get] ....................................................
[get] ....................................................
[get] ....................................................
[get] ....................................................
[get] ....................................................
[get] ....................................................
[get] ....................................................
[get] ....................................................
[get] ....................................................
[get] ....................................................
[get] ....................................................
[get] ....................................................
[get] ....................................................
[get] ....................................................
[get] ....................................................
[get] ....................................................
[get] ....................................................
[get] ....................................................
[get] ....................................................
[get] ....................................................
[get] ....................................................
[get] ....................................................
[get] ....................................................
[get] ....................................................
[get] ....................................................
[get] ....................................................
[get] ....................................................
[get] ....................................................
[get] ....................................................
[get] ....................................................
[get] ....................................................
[get] ....................................................
[get] ....................................................
[get] ....................................................
[get] ....................................................
[get] ....................................................
[get] ....................................................
[get] ....................................................
[get] ....................................................
[get] ....................................................
[get] ....................................................
[get] ....................................................
[get] ....................................................
[get] ....................................................
[get] ....................................................
[get] ................
eclipse-check-download-emf:
eclipse-get-emf:
[get] Getting: http://download.eclipse.org/modeling/emf/emf/downloads/drops/2.9.2/R201402031126/emf-runtime-2.9.2.zip
[get] To: <https://builds.apache.org/job/IvyDE/ws/dependencies/emf-runtime-2.9.2.zip>
[get] http://download.eclipse.org/modeling/emf/emf/downloads/drops/2.9.2/R201402031126/emf-runtime-2.9.2.zip moved to http://ftp.osuosl.org/pub/eclipse/modeling/emf/emf/downloads/drops/2.9.2/R201402031126/emf-runtime-2.9.2.zip
[get] ....................................................
[get] ....................................................
[get] ....................................................
[get] ....................................................
[get] ...........................................
eclipse-check-download-xsd:
eclipse-get-xsd:
[get] Getting: http://download.eclipse.org/modeling/emf/emf/downloads/drops/2.9.2/R201402031126/xsd-runtime-2.9.2.zip
[get] To: <https://builds.apache.org/job/IvyDE/ws/dependencies/xsd-runtime-2.9.2.zip>
[get] ....................................................
[get] ....................................................
[get] ....................................................
[get] ....................................................
[get] ....................................................
[get] ....
eclipse-check-download-gef:
eclipse-get-gef:
[get] Getting: http://archive.eclipse.org/tools/gef/downloads/drops/3.9.100/R201405261516/GEF-SDK-3.9.100.zip
[get] To: <https://builds.apache.org/job/IvyDE/ws/dependencies/GEF-SDK-3.9.100.zip>
[get] ....................................................
[get] ....................................................
[get] ....................................................
[get] ....................................................
[get] ....................................................
[get] ....................................................
[get] ....................................................
[get] ....................................................
[get] ....................................................
[get] ....................................................
[get] ....................................................
[get] ....................................................
[get] ....................................................
[get] ....................................................
[get] ....................................................
[get] ....................................................
[get] ....................................................
[get] ....................................................
[get] ....................................................
[get] ....................................................
[get] ....................................................
[get] ....................................................
[get] ....................................................
[get] ....................................................
[get] ....................................................
[get] ....................................................
[get] ....................................................
[get] ....................................................
[get] ....................................................
[get] ....................................................
[get] ....................................................
[get] ....................................................
[get] ....................................................
[get] ....................................................
[get] ....................................................
[get] ....................................................
[get] ....................................................
[get] ....................................................
[get] ....................................................
[get] .......
eclipse-check-download-zest:
eclipse-get-zest:
[get] Getting: http://archive.eclipse.org/tools/gef/downloads/drops/3.9.100/R201405261516/GEF-zest-3.9.100.zip
[get] To: <https://builds.apache.org/job/IvyDE/ws/dependencies/GEF-zest-3.9.100.zip>
[get] ....................................................
[get] ....................................................
[get] ....................................................
[get] ....................................................
[get] ....................................................
[get] ..........................
download-eclipse:
check-unzip-eclipse:
unzip-eclipse:
[unzip] Expanding: <https://builds.apache.org/job/IvyDE/ws/dependencies/eclipse-SDK-4.3.2-win32.zip> into <https://builds.apache.org/job/IvyDE/ws/dependencies>
[mkdir] Created dir: <https://builds.apache.org/job/IvyDE/ws/dependencies/eclipse/dropins/wtp-repo-R-3.9.5-20180409100740>
[unzip] Expanding: <https://builds.apache.org/job/IvyDE/ws/dependencies/wtp-repo-R-3.9.5-20180409100740.zip> into <https://builds.apache.org/job/IvyDE/ws/dependencies/eclipse/dropins/wtp-repo-R-3.9.5-20180409100740>
[mkdir] Created dir: <https://builds.apache.org/job/IvyDE/ws/dependencies/eclipse/dropins/emf-runtime-2.9.2>
[unzip] Expanding: <https://builds.apache.org/job/IvyDE/ws/dependencies/emf-runtime-2.9.2.zip> into <https://builds.apache.org/job/IvyDE/ws/dependencies/eclipse/dropins/emf-runtime-2.9.2>
[mkdir] Created dir: <https://builds.apache.org/job/IvyDE/ws/dependencies/eclipse/dropins/xsd-runtime-2.9.2>
[unzip] Expanding: <https://builds.apache.org/job/IvyDE/ws/dependencies/xsd-runtime-2.9.2.zip> into <https://builds.apache.org/job/IvyDE/ws/dependencies/eclipse/dropins/xsd-runtime-2.9.2>
[mkdir] Created dir: <https://builds.apache.org/job/IvyDE/ws/dependencies/eclipse/dropins/GEF-SDK-3.9.100>
[unzip] Expanding: <https://builds.apache.org/job/IvyDE/ws/dependencies/GEF-SDK-3.9.100.zip> into <https://builds.apache.org/job/IvyDE/ws/dependencies/eclipse/dropins/GEF-SDK-3.9.100>
[mkdir] Created dir: <https://builds.apache.org/job/IvyDE/ws/dependencies/eclipse/dropins/GEF-zest-3.9.100>
[unzip] Expanding: <https://builds.apache.org/job/IvyDE/ws/dependencies/GEF-zest-3.9.100.zip> into <https://builds.apache.org/job/IvyDE/ws/dependencies/eclipse/dropins/GEF-zest-3.9.100>
prepare-eclipse:
jenkins-prepare-properties:
jenkins-install-ivy:
check-baseLocation:
get-ivy-jar:
download-ivy:
init-ivy:
compute-ivy-bundle-version:
[echo] Ivy Bundle-Version: 2.5.0.cr2_20181206005343
install-ivy-jar:
[copy] Copying 1 file to <https://builds.apache.org/job/IvyDE/ws/dependencies/eclipse-SDK-4.3.2-win32/plugins>
[echo] Ivy 2.5.0.cr2_20181206005343 has been installed in <https://builds.apache.org/job/IvyDE/ws/dependencies/eclipse-SDK-4.3.2-win32>
install-ivy:
jenkins-prepare:
BUILD SUCCESSFUL
Total time: 7 minutes 27 seconds
[IvyDE] $ /home/jenkins/tools/ant/apache-ant-1.9.9/bin/ant dist checkstyle rat
Buildfile: <https://builds.apache.org/job/IvyDE/ws/build.xml>
clean-eclipse-doc:
generate-sample-zip:
[zip] Building zip: <https://builds.apache.org/job/IvyDE/ws/doc/src/sample/webapp-js-repo.zip>
download-ivy:
[mkdir] Created dir: <https://builds.apache.org/job/IvyDE/ws/work>
[get] Getting: http://repo1.maven.org/maven2/org/apache/ivy/ivy/2.5.0-rc1/ivy-2.5.0-rc1.jar
[get] To: <https://builds.apache.org/job/IvyDE/ws/work/ivy.jar>
init-ivy:
init-asciidoctor-extensions:
[ivy:cachepath] :: Apache Ivy 2.5.0-rc1 - 20180412005306 :: http://ant.apache.org/ivy/ ::
[ivy:cachepath] :: loading settings :: url = jar:<https://builds.apache.org/job/IvyDE/ws/work/ivy.jar!/org/apache/ivy/core/settings/ivysettings.xml>
[ivy:cachepath]
[ivy:cachepath] :: problems summary ::
[ivy:cachepath] :::: WARNINGS
[ivy:cachepath] module not found: org.asciidoctor#asciidoctorj;1.5.6
[ivy:cachepath] ==== local: tried
[ivy:cachepath] /home/jenkins/.ivy2/local/org.asciidoctor/asciidoctorj/1.5.6/ivys/ivy.xml
[ivy:cachepath] -- artifact org.asciidoctor#asciidoctorj;1.5.6!asciidoctorj.jar:
[ivy:cachepath] /home/jenkins/.ivy2/local/org.asciidoctor/asciidoctorj/1.5.6/jars/asciidoctorj.jar
[ivy:cachepath] ==== shared: tried
[ivy:cachepath] /home/jenkins/.ivy2/shared/org.asciidoctor/asciidoctorj/1.5.6/ivys/ivy.xml
[ivy:cachepath] -- artifact org.asciidoctor#asciidoctorj;1.5.6!asciidoctorj.jar:
[ivy:cachepath] /home/jenkins/.ivy2/shared/org.asciidoctor/asciidoctorj/1.5.6/jars/asciidoctorj.jar
[ivy:cachepath] ==== public: tried
[ivy:cachepath] https://repo1.maven.org/maven2/org/asciidoctor/asciidoctorj/1.5.6/asciidoctorj-1.5.6.pom
[ivy:cachepath] -- artifact org.asciidoctor#asciidoctorj;1.5.6!asciidoctorj.jar:
[ivy:cachepath] https://repo1.maven.org/maven2/org/asciidoctor/asciidoctorj/1.5.6/asciidoctorj-1.5.6.jar
[ivy:cachepath] ::::::::::::::::::::::::::::::::::::::::::::::
[ivy:cachepath] :: UNRESOLVED DEPENDENCIES ::
[ivy:cachepath] ::::::::::::::::::::::::::::::::::::::::::::::
[ivy:cachepath] :: org.asciidoctor#asciidoctorj;1.5.6: not found
[ivy:cachepath] ::::::::::::::::::::::::::::::::::::::::::::::
[ivy:cachepath] :::: ERRORS
[ivy:cachepath] Server access error at url https://repo1.maven.org/maven2/org/asciidoctor/asciidoctorj/1.5.6/asciidoctorj-1.5.6.pom (javax.net.ssl.SSLException: Received fatal alert: protocol_version)
[ivy:cachepath] Server access error at url https://repo1.maven.org/maven2/org/asciidoctor/asciidoctorj/1.5.6/asciidoctorj-1.5.6.jar (javax.net.ssl.SSLException: Received fatal alert: protocol_version)
[ivy:cachepath]
[ivy:cachepath] :: USE VERBOSE OR DEBUG MESSAGE LEVEL FOR MORE DETAILS
BUILD FAILED
<https://builds.apache.org/job/IvyDE/ws/build.xml>:68: impossible to resolve dependencies:
resolve failed - see output for details
Total time: 2 seconds
Build step 'Invoke Ant' marked build as failure
[locks-and-latches] Releasing all the locks
[locks-and-latches] All the locks released
Archiving artifacts