You are viewing a plain text version of this content. The canonical link for it is here.
Posted to dev@lucene.apache.org by Policeman Jenkins Server <je...@thetaphi.de> on 2019/06/04 01:01:58 UTC

[JENKINS-EA] Lucene-Solr-8.x-Linux (64bit/jdk-13-ea+18) - Build # 659 - Unstable!

Build: https://jenkins.thetaphi.de/job/Lucene-Solr-8.x-Linux/659/
Java: 64bit/jdk-13-ea+18 -XX:-UseCompressedOops -XX:+UseSerialGC

2 tests failed.
FAILED:  org.apache.solr.cloud.NestedShardedAtomicUpdateTest.test

Error Message:
Error from server at http://127.0.0.1:44037/_fy/se/collection1: non ok status: 500, message:Server Error

Stack Trace:
org.apache.solr.client.solrj.impl.HttpSolrClient$RemoteSolrException: Error from server at http://127.0.0.1:44037/_fy/se/collection1: non ok status: 500, message:Server Error
	at __randomizedtesting.SeedInfo.seed([18047704CDCF82AD:905048DE6333EF55]:0)
	at org.apache.solr.client.solrj.impl.HttpSolrClient.executeMethod(HttpSolrClient.java:579)
	at org.apache.solr.client.solrj.impl.HttpSolrClient.request(HttpSolrClient.java:255)
	at org.apache.solr.client.solrj.impl.HttpSolrClient.request(HttpSolrClient.java:244)
	at org.apache.solr.client.solrj.SolrRequest.process(SolrRequest.java:207)
	at org.apache.solr.client.solrj.SolrRequest.process(SolrRequest.java:224)
	at org.apache.solr.BaseDistributedSearchTestCase.add(BaseDistributedSearchTestCase.java:576)
	at org.apache.solr.cloud.NestedShardedAtomicUpdateTest.indexDocAndRandomlyCommit(NestedShardedAtomicUpdateTest.java:221)
	at org.apache.solr.cloud.NestedShardedAtomicUpdateTest.sendWrongRouteParam(NestedShardedAtomicUpdateTest.java:191)
	at org.apache.solr.cloud.NestedShardedAtomicUpdateTest.test(NestedShardedAtomicUpdateTest.java:55)
	at java.base/jdk.internal.reflect.NativeMethodAccessorImpl.invoke0(Native Method)
	at java.base/jdk.internal.reflect.NativeMethodAccessorImpl.invoke(NativeMethodAccessorImpl.java:62)
	at java.base/jdk.internal.reflect.DelegatingMethodAccessorImpl.invoke(DelegatingMethodAccessorImpl.java:43)
	at java.base/java.lang.reflect.Method.invoke(Method.java:567)
	at com.carrotsearch.randomizedtesting.RandomizedRunner.invoke(RandomizedRunner.java:1750)
	at com.carrotsearch.randomizedtesting.RandomizedRunner$8.evaluate(RandomizedRunner.java:938)
	at com.carrotsearch.randomizedtesting.RandomizedRunner$9.evaluate(RandomizedRunner.java:974)
	at com.carrotsearch.randomizedtesting.RandomizedRunner$10.evaluate(RandomizedRunner.java:988)
	at org.apache.solr.BaseDistributedSearchTestCase$ShardsRepeatRule$ShardsFixedStatement.callStatement(BaseDistributedSearchTestCase.java:1082)
	at org.apache.solr.BaseDistributedSearchTestCase$ShardsRepeatRule$ShardsStatement.evaluate(BaseDistributedSearchTestCase.java:1054)
	at com.carrotsearch.randomizedtesting.rules.SystemPropertiesRestoreRule$1.evaluate(SystemPropertiesRestoreRule.java:57)
	at org.apache.lucene.util.TestRuleSetupTeardownChained$1.evaluate(TestRuleSetupTeardownChained.java:49)
	at org.apache.lucene.util.AbstractBeforeAfterRule$1.evaluate(AbstractBeforeAfterRule.java:45)
	at org.apache.lucene.util.TestRuleThreadAndTestName$1.evaluate(TestRuleThreadAndTestName.java:48)
	at org.apache.lucene.util.TestRuleIgnoreAfterMaxFailures$1.evaluate(TestRuleIgnoreAfterMaxFailures.java:64)
	at org.apache.lucene.util.TestRuleMarkFailure$1.evaluate(TestRuleMarkFailure.java:47)
	at com.carrotsearch.randomizedtesting.rules.StatementAdapter.evaluate(StatementAdapter.java:36)
	at com.carrotsearch.randomizedtesting.ThreadLeakControl$StatementRunner.run(ThreadLeakControl.java:368)
	at com.carrotsearch.randomizedtesting.ThreadLeakControl.forkTimeoutingTask(ThreadLeakControl.java:817)
	at com.carrotsearch.randomizedtesting.ThreadLeakControl$3.evaluate(ThreadLeakControl.java:468)
	at com.carrotsearch.randomizedtesting.RandomizedRunner.runSingleTest(RandomizedRunner.java:947)
	at com.carrotsearch.randomizedtesting.RandomizedRunner$5.evaluate(RandomizedRunner.java:832)
	at com.carrotsearch.randomizedtesting.RandomizedRunner$6.evaluate(RandomizedRunner.java:883)
	at com.carrotsearch.randomizedtesting.RandomizedRunner$7.evaluate(RandomizedRunner.java:894)
	at com.carrotsearch.randomizedtesting.rules.StatementAdapter.evaluate(StatementAdapter.java:36)
	at com.carrotsearch.randomizedtesting.rules.SystemPropertiesRestoreRule$1.evaluate(SystemPropertiesRestoreRule.java:57)
	at org.apache.lucene.util.AbstractBeforeAfterRule$1.evaluate(AbstractBeforeAfterRule.java:45)
	at com.carrotsearch.randomizedtesting.rules.StatementAdapter.evaluate(StatementAdapter.java:36)
	at org.apache.lucene.util.TestRuleStoreClassName$1.evaluate(TestRuleStoreClassName.java:41)
	at com.carrotsearch.randomizedtesting.rules.NoShadowingOrOverridesOnMethodsRule$1.evaluate(NoShadowingOrOverridesOnMethodsRule.java:40)
	at com.carrotsearch.randomizedtesting.rules.NoShadowingOrOverridesOnMethodsRule$1.evaluate(NoShadowingOrOverridesOnMethodsRule.java:40)
	at com.carrotsearch.randomizedtesting.rules.StatementAdapter.evaluate(StatementAdapter.java:36)
	at com.carrotsearch.randomizedtesting.rules.StatementAdapter.evaluate(StatementAdapter.java:36)
	at org.apache.lucene.util.TestRuleAssertionsRequired$1.evaluate(TestRuleAssertionsRequired.java:53)
	at org.apache.lucene.util.TestRuleMarkFailure$1.evaluate(TestRuleMarkFailure.java:47)
	at org.apache.lucene.util.TestRuleIgnoreAfterMaxFailures$1.evaluate(TestRuleIgnoreAfterMaxFailures.java:64)
	at org.apache.lucene.util.TestRuleIgnoreTestSuites$1.evaluate(TestRuleIgnoreTestSuites.java:54)
	at com.carrotsearch.randomizedtesting.rules.StatementAdapter.evaluate(StatementAdapter.java:36)
	at com.carrotsearch.randomizedtesting.ThreadLeakControl$StatementRunner.run(ThreadLeakControl.java:368)
	at java.base/java.lang.Thread.run(Thread.java:835)


FAILED:  org.apache.solr.cloud.TestCloudRecovery2.test

Error Message:
Error from server at http://127.0.0.1:37231/solr: Async exception during distributed update: java.net.ConnectException: Connection refused

Stack Trace:
org.apache.solr.client.solrj.impl.HttpSolrClient$RemoteSolrException: Error from server at http://127.0.0.1:37231/solr: Async exception during distributed update: java.net.ConnectException: Connection refused
	at __randomizedtesting.SeedInfo.seed([18047704CDCF82AD:905048DE6333EF55]:0)
	at org.apache.solr.client.solrj.impl.HttpSolrClient.executeMethod(HttpSolrClient.java:649)
	at org.apache.solr.client.solrj.impl.HttpSolrClient.request(HttpSolrClient.java:255)
	at org.apache.solr.client.solrj.impl.HttpSolrClient.request(HttpSolrClient.java:244)
	at org.apache.solr.client.solrj.SolrRequest.process(SolrRequest.java:207)
	at org.apache.solr.client.solrj.request.UpdateRequest.commit(UpdateRequest.java:239)
	at org.apache.solr.cloud.TestCloudRecovery2.test(TestCloudRecovery2.java:67)
	at java.base/jdk.internal.reflect.NativeMethodAccessorImpl.invoke0(Native Method)
	at java.base/jdk.internal.reflect.NativeMethodAccessorImpl.invoke(NativeMethodAccessorImpl.java:62)
	at java.base/jdk.internal.reflect.DelegatingMethodAccessorImpl.invoke(DelegatingMethodAccessorImpl.java:43)
	at java.base/java.lang.reflect.Method.invoke(Method.java:567)
	at com.carrotsearch.randomizedtesting.RandomizedRunner.invoke(RandomizedRunner.java:1750)
	at com.carrotsearch.randomizedtesting.RandomizedRunner$8.evaluate(RandomizedRunner.java:938)
	at com.carrotsearch.randomizedtesting.RandomizedRunner$9.evaluate(RandomizedRunner.java:974)
	at com.carrotsearch.randomizedtesting.RandomizedRunner$10.evaluate(RandomizedRunner.java:988)
	at com.carrotsearch.randomizedtesting.rules.SystemPropertiesRestoreRule$1.evaluate(SystemPropertiesRestoreRule.java:57)
	at org.apache.lucene.util.TestRuleSetupTeardownChained$1.evaluate(TestRuleSetupTeardownChained.java:49)
	at org.apache.lucene.util.AbstractBeforeAfterRule$1.evaluate(AbstractBeforeAfterRule.java:45)
	at org.apache.lucene.util.TestRuleThreadAndTestName$1.evaluate(TestRuleThreadAndTestName.java:48)
	at org.apache.lucene.util.TestRuleIgnoreAfterMaxFailures$1.evaluate(TestRuleIgnoreAfterMaxFailures.java:64)
	at org.apache.lucene.util.TestRuleMarkFailure$1.evaluate(TestRuleMarkFailure.java:47)
	at com.carrotsearch.randomizedtesting.rules.StatementAdapter.evaluate(StatementAdapter.java:36)
	at com.carrotsearch.randomizedtesting.ThreadLeakControl$StatementRunner.run(ThreadLeakControl.java:368)
	at com.carrotsearch.randomizedtesting.ThreadLeakControl.forkTimeoutingTask(ThreadLeakControl.java:817)
	at com.carrotsearch.randomizedtesting.ThreadLeakControl$3.evaluate(ThreadLeakControl.java:468)
	at com.carrotsearch.randomizedtesting.RandomizedRunner.runSingleTest(RandomizedRunner.java:947)
	at com.carrotsearch.randomizedtesting.RandomizedRunner$5.evaluate(RandomizedRunner.java:832)
	at com.carrotsearch.randomizedtesting.RandomizedRunner$6.evaluate(RandomizedRunner.java:883)
	at com.carrotsearch.randomizedtesting.RandomizedRunner$7.evaluate(RandomizedRunner.java:894)
	at com.carrotsearch.randomizedtesting.rules.StatementAdapter.evaluate(StatementAdapter.java:36)
	at com.carrotsearch.randomizedtesting.rules.SystemPropertiesRestoreRule$1.evaluate(SystemPropertiesRestoreRule.java:57)
	at org.apache.lucene.util.AbstractBeforeAfterRule$1.evaluate(AbstractBeforeAfterRule.java:45)
	at com.carrotsearch.randomizedtesting.rules.StatementAdapter.evaluate(StatementAdapter.java:36)
	at org.apache.lucene.util.TestRuleStoreClassName$1.evaluate(TestRuleStoreClassName.java:41)
	at com.carrotsearch.randomizedtesting.rules.NoShadowingOrOverridesOnMethodsRule$1.evaluate(NoShadowingOrOverridesOnMethodsRule.java:40)
	at com.carrotsearch.randomizedtesting.rules.NoShadowingOrOverridesOnMethodsRule$1.evaluate(NoShadowingOrOverridesOnMethodsRule.java:40)
	at com.carrotsearch.randomizedtesting.rules.StatementAdapter.evaluate(StatementAdapter.java:36)
	at com.carrotsearch.randomizedtesting.rules.StatementAdapter.evaluate(StatementAdapter.java:36)
	at org.apache.lucene.util.TestRuleAssertionsRequired$1.evaluate(TestRuleAssertionsRequired.java:53)
	at org.apache.lucene.util.TestRuleMarkFailure$1.evaluate(TestRuleMarkFailure.java:47)
	at org.apache.lucene.util.TestRuleIgnoreAfterMaxFailures$1.evaluate(TestRuleIgnoreAfterMaxFailures.java:64)
	at org.apache.lucene.util.TestRuleIgnoreTestSuites$1.evaluate(TestRuleIgnoreTestSuites.java:54)
	at com.carrotsearch.randomizedtesting.rules.StatementAdapter.evaluate(StatementAdapter.java:36)
	at com.carrotsearch.randomizedtesting.ThreadLeakControl$StatementRunner.run(ThreadLeakControl.java:368)
	at java.base/java.lang.Thread.run(Thread.java:835)




Build Log:
[...truncated 14617 lines...]
   [junit4] Suite: org.apache.solr.cloud.NestedShardedAtomicUpdateTest
   [junit4]   2> 1411111 INFO  (SUITE-NestedShardedAtomicUpdateTest-seed#[18047704CDCF82AD]-worker) [    ] o.a.s.SolrTestCaseJ4 SecureRandom sanity checks: test.solr.allowed.securerandom=null & java.security.egd=file:/dev/./urandom
   [junit4]   2> Creating dataDir: /home/jenkins/workspace/Lucene-Solr-8.x-Linux/solr/build/solr-core/test/J1/temp/solr.cloud.NestedShardedAtomicUpdateTest_18047704CDCF82AD-001/init-core-data-001
   [junit4]   2> 1411112 INFO  (SUITE-NestedShardedAtomicUpdateTest-seed#[18047704CDCF82AD]-worker) [    ] o.a.s.SolrTestCaseJ4 Using PointFields (NUMERIC_POINTS_SYSPROP=true) w/NUMERIC_DOCVALUES_SYSPROP=false
   [junit4]   2> 1411112 INFO  (SUITE-NestedShardedAtomicUpdateTest-seed#[18047704CDCF82AD]-worker) [    ] o.a.s.SolrTestCaseJ4 Randomized ssl (false) and clientAuth (false) via: @org.apache.solr.util.RandomizeSSL(reason="", ssl=0.0/0.0, value=0.0/0.0, clientAuth=0.0/0.0)
   [junit4]   2> 1411112 INFO  (SUITE-NestedShardedAtomicUpdateTest-seed#[18047704CDCF82AD]-worker) [    ] o.a.s.BaseDistributedSearchTestCase Setting hostContext system property: /_fy/se
   [junit4]   2> 1411115 INFO  (TEST-NestedShardedAtomicUpdateTest.test-seed#[18047704CDCF82AD]) [    ] o.a.s.c.ZkTestServer STARTING ZK TEST SERVER
   [junit4]   2> 1411115 INFO  (ZkTestServer Run Thread) [    ] o.a.s.c.ZkTestServer client port:0.0.0.0/0.0.0.0:0
   [junit4]   2> 1411116 INFO  (ZkTestServer Run Thread) [    ] o.a.s.c.ZkTestServer Starting server
   [junit4]   2> 1411215 INFO  (TEST-NestedShardedAtomicUpdateTest.test-seed#[18047704CDCF82AD]) [    ] o.a.s.c.ZkTestServer start zk server on port:36349
   [junit4]   2> 1411216 INFO  (TEST-NestedShardedAtomicUpdateTest.test-seed#[18047704CDCF82AD]) [    ] o.a.s.c.ZkTestServer parse host and port list: 127.0.0.1:36349
   [junit4]   2> 1411216 INFO  (TEST-NestedShardedAtomicUpdateTest.test-seed#[18047704CDCF82AD]) [    ] o.a.s.c.ZkTestServer connecting to 127.0.0.1 36349
   [junit4]   2> 1411217 INFO  (TEST-NestedShardedAtomicUpdateTest.test-seed#[18047704CDCF82AD]) [    ] o.a.s.c.c.ConnectionManager Waiting for client to connect to ZooKeeper
   [junit4]   2> 1411218 INFO  (zkConnectionManagerCallback-9096-thread-1) [    ] o.a.s.c.c.ConnectionManager zkClient has connected
   [junit4]   2> 1411218 INFO  (TEST-NestedShardedAtomicUpdateTest.test-seed#[18047704CDCF82AD]) [    ] o.a.s.c.c.ConnectionManager Client is connected to ZooKeeper
   [junit4]   2> 1411218 INFO  (TEST-NestedShardedAtomicUpdateTest.test-seed#[18047704CDCF82AD]) [    ] o.a.s.c.c.ConnectionManager Waiting for client to connect to ZooKeeper
   [junit4]   2> 1411219 INFO  (zkConnectionManagerCallback-9098-thread-1) [    ] o.a.s.c.c.ConnectionManager zkClient has connected
   [junit4]   2> 1411219 INFO  (TEST-NestedShardedAtomicUpdateTest.test-seed#[18047704CDCF82AD]) [    ] o.a.s.c.c.ConnectionManager Client is connected to ZooKeeper
   [junit4]   2> 1411219 INFO  (TEST-NestedShardedAtomicUpdateTest.test-seed#[18047704CDCF82AD]) [    ] o.a.s.c.ZkTestServer put /home/jenkins/workspace/Lucene-Solr-8.x-Linux/solr/core/src/test-files/solr/collection1/conf/solrconfig-tlog.xml to /configs/conf1/solrconfig.xml
   [junit4]   2> 1411220 INFO  (TEST-NestedShardedAtomicUpdateTest.test-seed#[18047704CDCF82AD]) [    ] o.a.s.c.ZkTestServer put /home/jenkins/workspace/Lucene-Solr-8.x-Linux/solr/core/src/test-files/solr/collection1/conf/schema-nest.xml to /configs/conf1/schema.xml
   [junit4]   2> 1411220 INFO  (TEST-NestedShardedAtomicUpdateTest.test-seed#[18047704CDCF82AD]) [    ] o.a.s.c.ZkTestServer put /home/jenkins/workspace/Lucene-Solr-8.x-Linux/solr/core/src/test-files/solr/collection1/conf/solrconfig.snippet.randomindexconfig.xml to /configs/conf1/solrconfig.snippet.randomindexconfig.xml
   [junit4]   2> 1411220 INFO  (TEST-NestedShardedAtomicUpdateTest.test-seed#[18047704CDCF82AD]) [    ] o.a.s.c.ZkTestServer put /home/jenkins/workspace/Lucene-Solr-8.x-Linux/solr/core/src/test-files/solr/collection1/conf/stopwords.txt to /configs/conf1/stopwords.txt
   [junit4]   2> 1411221 INFO  (TEST-NestedShardedAtomicUpdateTest.test-seed#[18047704CDCF82AD]) [    ] o.a.s.c.ZkTestServer put /home/jenkins/workspace/Lucene-Solr-8.x-Linux/solr/core/src/test-files/solr/collection1/conf/protwords.txt to /configs/conf1/protwords.txt
   [junit4]   2> 1411221 INFO  (TEST-NestedShardedAtomicUpdateTest.test-seed#[18047704CDCF82AD]) [    ] o.a.s.c.ZkTestServer put /home/jenkins/workspace/Lucene-Solr-8.x-Linux/solr/core/src/test-files/solr/collection1/conf/currency.xml to /configs/conf1/currency.xml
   [junit4]   2> 1411222 INFO  (TEST-NestedShardedAtomicUpdateTest.test-seed#[18047704CDCF82AD]) [    ] o.a.s.c.ZkTestServer put /home/jenkins/workspace/Lucene-Solr-8.x-Linux/solr/core/src/test-files/solr/collection1/conf/enumsConfig.xml to /configs/conf1/enumsConfig.xml
   [junit4]   2> 1411222 INFO  (TEST-NestedShardedAtomicUpdateTest.test-seed#[18047704CDCF82AD]) [    ] o.a.s.c.ZkTestServer put /home/jenkins/workspace/Lucene-Solr-8.x-Linux/solr/core/src/test-files/solr/collection1/conf/open-exchange-rates.json to /configs/conf1/open-exchange-rates.json
   [junit4]   2> 1411222 INFO  (TEST-NestedShardedAtomicUpdateTest.test-seed#[18047704CDCF82AD]) [    ] o.a.s.c.ZkTestServer put /home/jenkins/workspace/Lucene-Solr-8.x-Linux/solr/core/src/test-files/solr/collection1/conf/mapping-ISOLatin1Accent.txt to /configs/conf1/mapping-ISOLatin1Accent.txt
   [junit4]   2> 1411223 INFO  (TEST-NestedShardedAtomicUpdateTest.test-seed#[18047704CDCF82AD]) [    ] o.a.s.c.ZkTestServer put /home/jenkins/workspace/Lucene-Solr-8.x-Linux/solr/core/src/test-files/solr/collection1/conf/old_synonyms.txt to /configs/conf1/old_synonyms.txt
   [junit4]   2> 1411223 INFO  (TEST-NestedShardedAtomicUpdateTest.test-seed#[18047704CDCF82AD]) [    ] o.a.s.c.ZkTestServer put /home/jenkins/workspace/Lucene-Solr-8.x-Linux/solr/core/src/test-files/solr/collection1/conf/synonyms.txt to /configs/conf1/synonyms.txt
   [junit4]   2> 1411223 INFO  (TEST-NestedShardedAtomicUpdateTest.test-seed#[18047704CDCF82AD]) [    ] o.a.s.c.AbstractFullDistribZkTestBase Will use NRT replicas unless explicitly asked otherwise
   [junit4]   2> 1411309 WARN  (TEST-NestedShardedAtomicUpdateTest.test-seed#[18047704CDCF82AD]) [    ] o.e.j.s.AbstractConnector Ignoring deprecated socket close linger time
   [junit4]   2> 1411309 INFO  (TEST-NestedShardedAtomicUpdateTest.test-seed#[18047704CDCF82AD]) [    ] o.a.s.c.s.e.JettySolrRunner Start Jetty (original configured port=0)
   [junit4]   2> 1411309 INFO  (TEST-NestedShardedAtomicUpdateTest.test-seed#[18047704CDCF82AD]) [    ] o.a.s.c.s.e.JettySolrRunner Trying to start Jetty on port 0 try number 1 ...
   [junit4]   2> 1411309 INFO  (TEST-NestedShardedAtomicUpdateTest.test-seed#[18047704CDCF82AD]) [    ] o.e.j.s.Server jetty-9.4.14.v20181114; built: 2018-11-14T21:20:31.478Z; git: c4550056e785fb5665914545889f21dc136ad9e6; jvm 13-ea+18
   [junit4]   2> 1411310 INFO  (TEST-NestedShardedAtomicUpdateTest.test-seed#[18047704CDCF82AD]) [    ] o.e.j.s.session DefaultSessionIdManager workerName=node0
   [junit4]   2> 1411310 INFO  (TEST-NestedShardedAtomicUpdateTest.test-seed#[18047704CDCF82AD]) [    ] o.e.j.s.session No SessionScavenger set, using defaults
   [junit4]   2> 1411310 INFO  (TEST-NestedShardedAtomicUpdateTest.test-seed#[18047704CDCF82AD]) [    ] o.e.j.s.session node0 Scavenging every 600000ms
   [junit4]   2> 1411311 INFO  (TEST-NestedShardedAtomicUpdateTest.test-seed#[18047704CDCF82AD]) [    ] o.e.j.s.h.ContextHandler Started o.e.j.s.ServletContextHandler@13a6964a{/_fy/se,null,AVAILABLE}
   [junit4]   2> 1411311 INFO  (TEST-NestedShardedAtomicUpdateTest.test-seed#[18047704CDCF82AD]) [    ] o.e.j.s.AbstractConnector Started ServerConnector@3b297bee{HTTP/1.1,[http/1.1, h2c]}{127.0.0.1:34901}
   [junit4]   2> 1411311 INFO  (TEST-NestedShardedAtomicUpdateTest.test-seed#[18047704CDCF82AD]) [    ] o.e.j.s.Server Started @1411336ms
   [junit4]   2> 1411311 INFO  (TEST-NestedShardedAtomicUpdateTest.test-seed#[18047704CDCF82AD]) [    ] o.a.s.c.s.e.JettySolrRunner Jetty properties: {hostContext=/_fy/se, solr.data.dir=/home/jenkins/workspace/Lucene-Solr-8.x-Linux/solr/build/solr-core/test/J1/temp/solr.cloud.NestedShardedAtomicUpdateTest_18047704CDCF82AD-001/tempDir-001/control/data, hostPort=34901, coreRootDirectory=/home/jenkins/workspace/Lucene-Solr-8.x-Linux/solr/build/solr-core/test/J1/temp/solr.cloud.NestedShardedAtomicUpdateTest_18047704CDCF82AD-001/control-001/cores, replicaType=NRT}
   [junit4]   2> 1411311 ERROR (TEST-NestedShardedAtomicUpdateTest.test-seed#[18047704CDCF82AD]) [    ] o.a.s.u.StartupLoggingUtils Missing Java Option solr.log.dir. Logging may be missing or incomplete.
   [junit4]   2> 1411311 INFO  (TEST-NestedShardedAtomicUpdateTest.test-seed#[18047704CDCF82AD]) [    ] o.a.s.s.SolrDispatchFilter Using logger factory org.apache.logging.slf4j.Log4jLoggerFactory
   [junit4]   2> 1411312 INFO  (TEST-NestedShardedAtomicUpdateTest.test-seed#[18047704CDCF82AD]) [    ] o.a.s.s.SolrDispatchFilter  ___      _       Welcome to Apache Solr™ version 8.2.0
   [junit4]   2> 1411312 INFO  (TEST-NestedShardedAtomicUpdateTest.test-seed#[18047704CDCF82AD]) [    ] o.a.s.s.SolrDispatchFilter / __| ___| |_ _   Starting in cloud mode on port null
   [junit4]   2> 1411312 INFO  (TEST-NestedShardedAtomicUpdateTest.test-seed#[18047704CDCF82AD]) [    ] o.a.s.s.SolrDispatchFilter \__ \/ _ \ | '_|  Install dir: null
   [junit4]   2> 1411312 INFO  (TEST-NestedShardedAtomicUpdateTest.test-seed#[18047704CDCF82AD]) [    ] o.a.s.s.SolrDispatchFilter |___/\___/_|_|    Start time: 2019-06-04T00:34:52.683047Z
   [junit4]   2> 1411312 INFO  (TEST-NestedShardedAtomicUpdateTest.test-seed#[18047704CDCF82AD]) [    ] o.a.s.c.c.ConnectionManager Waiting for client to connect to ZooKeeper
   [junit4]   2> 1411313 INFO  (zkConnectionManagerCallback-9100-thread-1) [    ] o.a.s.c.c.ConnectionManager zkClient has connected
   [junit4]   2> 1411313 INFO  (TEST-NestedShardedAtomicUpdateTest.test-seed#[18047704CDCF82AD]) [    ] o.a.s.c.c.ConnectionManager Client is connected to ZooKeeper
   [junit4]   2> 1411313 INFO  (TEST-NestedShardedAtomicUpdateTest.test-seed#[18047704CDCF82AD]) [    ] o.a.s.s.SolrDispatchFilter Loading solr.xml from SolrHome (not found in ZooKeeper)
   [junit4]   2> 1411313 INFO  (TEST-NestedShardedAtomicUpdateTest.test-seed#[18047704CDCF82AD]) [    ] o.a.s.c.SolrXmlConfig Loading container configuration from /home/jenkins/workspace/Lucene-Solr-8.x-Linux/solr/build/solr-core/test/J1/temp/solr.cloud.NestedShardedAtomicUpdateTest_18047704CDCF82AD-001/control-001/solr.xml
   [junit4]   2> 1411315 INFO  (TEST-NestedShardedAtomicUpdateTest.test-seed#[18047704CDCF82AD]) [    ] o.a.s.c.SolrXmlConfig Configuration parameter autoReplicaFailoverWorkLoopDelay is ignored
   [junit4]   2> 1411316 INFO  (TEST-NestedShardedAtomicUpdateTest.test-seed#[18047704CDCF82AD]) [    ] o.a.s.c.SolrXmlConfig Configuration parameter autoReplicaFailoverBadNodeExpiration is ignored
   [junit4]   2> 1411321 INFO  (TEST-NestedShardedAtomicUpdateTest.test-seed#[18047704CDCF82AD]) [    ] o.a.s.c.SolrXmlConfig MBean server found: com.sun.jmx.mbeanserver.JmxMBeanServer@20641fb9, but no JMX reporters were configured - adding default JMX reporter.
   [junit4]   2> 1411408 INFO  (TEST-NestedShardedAtomicUpdateTest.test-seed#[18047704CDCF82AD]) [    ] o.a.s.h.c.HttpShardHandlerFactory Host whitelist initialized: WhitelistHostChecker [whitelistHosts=null, whitelistHostCheckingEnabled=false]
   [junit4]   2> 1411408 WARN  (TEST-NestedShardedAtomicUpdateTest.test-seed#[18047704CDCF82AD]) [    ] o.e.j.u.s.S.config No Client EndPointIdentificationAlgorithm configured for SslContextFactory@18f8867a[provider=null,keyStore=null,trustStore=null]
   [junit4]   2> 1411410 WARN  (TEST-NestedShardedAtomicUpdateTest.test-seed#[18047704CDCF82AD]) [    ] o.e.j.u.s.S.config No Client EndPointIdentificationAlgorithm configured for SslContextFactory@187694c7[provider=null,keyStore=null,trustStore=null]
   [junit4]   2> 1411411 INFO  (TEST-NestedShardedAtomicUpdateTest.test-seed#[18047704CDCF82AD]) [    ] o.a.s.c.ZkContainer Zookeeper client=127.0.0.1:36349/solr
   [junit4]   2> 1411411 INFO  (TEST-NestedShardedAtomicUpdateTest.test-seed#[18047704CDCF82AD]) [    ] o.a.s.c.c.ConnectionManager Waiting for client to connect to ZooKeeper
   [junit4]   2> 1411412 INFO  (zkConnectionManagerCallback-9107-thread-1) [    ] o.a.s.c.c.ConnectionManager zkClient has connected
   [junit4]   2> 1411412 INFO  (TEST-NestedShardedAtomicUpdateTest.test-seed#[18047704CDCF82AD]) [    ] o.a.s.c.c.ConnectionManager Client is connected to ZooKeeper
   [junit4]   2> 1411412 INFO  (TEST-NestedShardedAtomicUpdateTest.test-seed#[18047704CDCF82AD]) [n:127.0.0.1:34901__fy%2Fse    ] o.a.s.c.c.ConnectionManager Waiting for client to connect to ZooKeeper
   [junit4]   2> 1411413 INFO  (zkConnectionManagerCallback-9109-thread-1) [    ] o.a.s.c.c.ConnectionManager zkClient has connected
   [junit4]   2> 1411413 INFO  (TEST-NestedShardedAtomicUpdateTest.test-seed#[18047704CDCF82AD]) [n:127.0.0.1:34901__fy%2Fse    ] o.a.s.c.c.ConnectionManager Client is connected to ZooKeeper
   [junit4]   2> 1411442 INFO  (TEST-NestedShardedAtomicUpdateTest.test-seed#[18047704CDCF82AD]) [n:127.0.0.1:34901__fy%2Fse    ] o.a.s.c.OverseerElectionContext I am going to be the leader 127.0.0.1:34901__fy%2Fse
   [junit4]   2> 1411442 INFO  (TEST-NestedShardedAtomicUpdateTest.test-seed#[18047704CDCF82AD]) [n:127.0.0.1:34901__fy%2Fse    ] o.a.s.c.Overseer Overseer (id=72365864093745156-127.0.0.1:34901__fy%2Fse-n_0000000000) starting
   [junit4]   2> 1411444 INFO  (TEST-NestedShardedAtomicUpdateTest.test-seed#[18047704CDCF82AD]) [n:127.0.0.1:34901__fy%2Fse    ] o.a.s.c.c.ConnectionManager Waiting for client to connect to ZooKeeper
   [junit4]   2> 1411445 INFO  (zkConnectionManagerCallback-9116-thread-1) [    ] o.a.s.c.c.ConnectionManager zkClient has connected
   [junit4]   2> 1411445 INFO  (TEST-NestedShardedAtomicUpdateTest.test-seed#[18047704CDCF82AD]) [n:127.0.0.1:34901__fy%2Fse    ] o.a.s.c.c.ConnectionManager Client is connected to ZooKeeper
   [junit4]   2> 1411445 INFO  (TEST-NestedShardedAtomicUpdateTest.test-seed#[18047704CDCF82AD]) [n:127.0.0.1:34901__fy%2Fse    ] o.a.s.c.s.i.ZkClientClusterStateProvider Cluster at 127.0.0.1:36349/solr ready
   [junit4]   2> 1411446 INFO  (OverseerStateUpdate-72365864093745156-127.0.0.1:34901__fy%2Fse-n_0000000000) [n:127.0.0.1:34901__fy%2Fse    ] o.a.s.c.Overseer Starting to work on the main queue : 127.0.0.1:34901__fy%2Fse
   [junit4]   2> 1411446 INFO  (TEST-NestedShardedAtomicUpdateTest.test-seed#[18047704CDCF82AD]) [n:127.0.0.1:34901__fy%2Fse    ] o.a.s.c.ZkController Register node as live in ZooKeeper:/live_nodes/127.0.0.1:34901__fy%2Fse
   [junit4]   2> 1411447 INFO  (zkCallback-9108-thread-1) [    ] o.a.s.c.c.ZkStateReader Updated live nodes from ZooKeeper... (0) -> (1)
   [junit4]   2> 1411447 INFO  (zkCallback-9115-thread-1) [    ] o.a.s.c.c.ZkStateReader Updated live nodes from ZooKeeper... (0) -> (1)
   [junit4]   2> 1411460 INFO  (TEST-NestedShardedAtomicUpdateTest.test-seed#[18047704CDCF82AD]) [n:127.0.0.1:34901__fy%2Fse    ] o.a.s.h.a.MetricsHistoryHandler No .system collection, keeping metrics history in memory.
   [junit4]   2> 1411478 INFO  (TEST-NestedShardedAtomicUpdateTest.test-seed#[18047704CDCF82AD]) [n:127.0.0.1:34901__fy%2Fse    ] o.a.s.m.r.SolrJmxReporter JMX monitoring for 'solr.node' (registry 'solr.node') enabled at server: com.sun.jmx.mbeanserver.JmxMBeanServer@20641fb9
   [junit4]   2> 1411489 INFO  (TEST-NestedShardedAtomicUpdateTest.test-seed#[18047704CDCF82AD]) [n:127.0.0.1:34901__fy%2Fse    ] o.a.s.m.r.SolrJmxReporter JMX monitoring for 'solr.jvm' (registry 'solr.jvm') enabled at server: com.sun.jmx.mbeanserver.JmxMBeanServer@20641fb9
   [junit4]   2> 1411489 INFO  (TEST-NestedShardedAtomicUpdateTest.test-seed#[18047704CDCF82AD]) [n:127.0.0.1:34901__fy%2Fse    ] o.a.s.m.r.SolrJmxReporter JMX monitoring for 'solr.jetty' (registry 'solr.jetty') enabled at server: com.sun.jmx.mbeanserver.JmxMBeanServer@20641fb9
   [junit4]   2> 1411490 INFO  (TEST-NestedShardedAtomicUpdateTest.test-seed#[18047704CDCF82AD]) [n:127.0.0.1:34901__fy%2Fse    ] o.a.s.c.CorePropertiesLocator Found 0 core definitions underneath /home/jenkins/workspace/Lucene-Solr-8.x-Linux/solr/build/solr-core/test/J1/temp/solr.cloud.NestedShardedAtomicUpdateTest_18047704CDCF82AD-001/control-001/cores
   [junit4]   2> 1411507 INFO  (TEST-NestedShardedAtomicUpdateTest.test-seed#[18047704CDCF82AD]) [    ] o.a.s.c.c.ConnectionManager Waiting for client to connect to ZooKeeper
   [junit4]   2> 1411507 INFO  (zkConnectionManagerCallback-9122-thread-1) [    ] o.a.s.c.c.ConnectionManager zkClient has connected
   [junit4]   2> 1411507 INFO  (TEST-NestedShardedAtomicUpdateTest.test-seed#[18047704CDCF82AD]) [    ] o.a.s.c.c.ConnectionManager Client is connected to ZooKeeper
   [junit4]   2> 1411507 INFO  (TEST-NestedShardedAtomicUpdateTest.test-seed#[18047704CDCF82AD]) [    ] o.a.s.c.c.ZkStateReader Updated live nodes from ZooKeeper... (0) -> (1)
   [junit4]   2> 1411508 INFO  (TEST-NestedShardedAtomicUpdateTest.test-seed#[18047704CDCF82AD]) [    ] o.a.s.c.s.i.ZkClientClusterStateProvider Cluster at 127.0.0.1:36349/solr ready
   [junit4]   2> 1411509 INFO  (qtp466304847-23925) [n:127.0.0.1:34901__fy%2Fse    ] o.a.s.h.a.CollectionsHandler Invoked Collection Action :create with params collection.configName=conf1&name=control_collection&nrtReplicas=1&action=CREATE&numShards=1&createNodeSet=127.0.0.1:34901__fy%252Fse&wt=javabin&version=2 and sendToOCPQueue=true
   [junit4]   2> 1411511 INFO  (OverseerThreadFactory-8297-thread-1-processing-n:127.0.0.1:34901__fy%2Fse) [n:127.0.0.1:34901__fy%2Fse    ] o.a.s.c.a.c.CreateCollectionCmd Create collection control_collection
   [junit4]   2> 1411614 INFO  (qtp466304847-23924) [n:127.0.0.1:34901__fy%2Fse    x:control_collection_shard1_replica_n1] o.a.s.h.a.CoreAdminOperation core create command qt=/admin/cores&collection.configName=conf1&newCollection=true&name=control_collection_shard1_replica_n1&action=CREATE&numShards=1&collection=control_collection&shard=shard1&wt=javabin&version=2&replicaType=NRT
   [junit4]   2> 1411614 INFO  (qtp466304847-23924) [n:127.0.0.1:34901__fy%2Fse    x:control_collection_shard1_replica_n1] o.a.s.c.TransientSolrCoreCacheDefault Allocating transient cache for 4 transient cores
   [junit4]   2> 1412921 INFO  (qtp466304847-23924) [n:127.0.0.1:34901__fy%2Fse c:control_collection s:shard1  x:control_collection_shard1_replica_n1] o.a.s.c.SolrConfig Using Lucene MatchVersion: 8.2.0
   [junit4]   2> 1412934 INFO  (qtp466304847-23924) [n:127.0.0.1:34901__fy%2Fse c:control_collection s:shard1  x:control_collection_shard1_replica_n1] o.a.s.s.IndexSchema [control_collection_shard1_replica_n1] Schema name=nested-docs
   [junit4]   2> 1412937 INFO  (qtp466304847-23924) [n:127.0.0.1:34901__fy%2Fse c:control_collection s:shard1  x:control_collection_shard1_replica_n1] o.a.s.s.IndexSchema Loaded schema nested-docs/1.6 with uniqueid field id
   [junit4]   2> 1412937 INFO  (qtp466304847-23924) [n:127.0.0.1:34901__fy%2Fse c:control_collection s:shard1  x:control_collection_shard1_replica_n1] o.a.s.c.CoreContainer Creating SolrCore 'control_collection_shard1_replica_n1' using configuration from collection control_collection, trusted=true
   [junit4]   2> 1412937 INFO  (qtp466304847-23924) [n:127.0.0.1:34901__fy%2Fse c:control_collection s:shard1  x:control_collection_shard1_replica_n1] o.a.s.m.r.SolrJmxReporter JMX monitoring for 'solr.core.control_collection.shard1.replica_n1' (registry 'solr.core.control_collection.shard1.replica_n1') enabled at server: com.sun.jmx.mbeanserver.JmxMBeanServer@20641fb9
   [junit4]   2> 1412937 INFO  (qtp466304847-23924) [n:127.0.0.1:34901__fy%2Fse c:control_collection s:shard1  x:control_collection_shard1_replica_n1] o.a.s.c.SolrCore [[control_collection_shard1_replica_n1] ] Opening new SolrCore at [/home/jenkins/workspace/Lucene-Solr-8.x-Linux/solr/build/solr-core/test/J1/temp/solr.cloud.NestedShardedAtomicUpdateTest_18047704CDCF82AD-001/control-001/cores/control_collection_shard1_replica_n1], dataDir=[/home/jenkins/workspace/Lucene-Solr-8.x-Linux/solr/build/solr-core/test/J1/temp/solr.cloud.NestedShardedAtomicUpdateTest_18047704CDCF82AD-001/control-001/cores/control_collection_shard1_replica_n1/data/]
   [junit4]   2> 1412938 INFO  (qtp466304847-23924) [n:127.0.0.1:34901__fy%2Fse c:control_collection s:shard1  x:control_collection_shard1_replica_n1] o.a.s.u.RandomMergePolicy RandomMergePolicy wrapping class org.apache.lucene.index.LogDocMergePolicy: [LogDocMergePolicy: minMergeSize=1000, mergeFactor=37, maxMergeSize=9223372036854775807, maxMergeSizeForForcedMerge=9223372036854775807, calibrateSizeByDeletes=false, maxMergeDocs=2147483647, maxCFSSegmentSizeMB=8.796093022207999E12, noCFSRatio=1.0]
   [junit4]   2> 1412940 WARN  (qtp466304847-23924) [n:127.0.0.1:34901__fy%2Fse c:control_collection s:shard1  x:control_collection_shard1_replica_n1] o.a.s.c.RequestHandlers INVALID paramSet a in requestHandler {type = requestHandler,name = /dump,class = DumpRequestHandler,attributes = {initParams=a, name=/dump, class=DumpRequestHandler},args = {defaults={a=A,b=B}}}
   [junit4]   2> 1412973 INFO  (qtp466304847-23924) [n:127.0.0.1:34901__fy%2Fse c:control_collection s:shard1  x:control_collection_shard1_replica_n1] o.a.s.u.UpdateHandler Using UpdateLog implementation: org.apache.solr.update.UpdateLog
   [junit4]   2> 1412973 INFO  (qtp466304847-23924) [n:127.0.0.1:34901__fy%2Fse c:control_collection s:shard1  x:control_collection_shard1_replica_n1] o.a.s.u.UpdateLog Initializing UpdateLog: dataDir= defaultSyncLevel=FLUSH numRecordsToKeep=100 maxNumLogsToKeep=10 numVersionBuckets=65536
   [junit4]   2> 1412974 INFO  (qtp466304847-23924) [n:127.0.0.1:34901__fy%2Fse c:control_collection s:shard1  x:control_collection_shard1_replica_n1] o.a.s.u.CommitTracker Hard AutoCommit: disabled
   [junit4]   2> 1412974 INFO  (qtp466304847-23924) [n:127.0.0.1:34901__fy%2Fse c:control_collection s:shard1  x:control_collection_shard1_replica_n1] o.a.s.u.CommitTracker Soft AutoCommit: disabled
   [junit4]   2> 1412975 INFO  (qtp466304847-23924) [n:127.0.0.1:34901__fy%2Fse c:control_collection s:shard1  x:control_collection_shard1_replica_n1] o.a.s.u.RandomMergePolicy RandomMergePolicy wrapping class org.apache.lucene.index.LogDocMergePolicy: [LogDocMergePolicy: minMergeSize=1000, mergeFactor=15, maxMergeSize=9223372036854775807, maxMergeSizeForForcedMerge=9223372036854775807, calibrateSizeByDeletes=true, maxMergeDocs=2147483647, maxCFSSegmentSizeMB=8.796093022207999E12, noCFSRatio=0.0]
   [junit4]   2> 1412975 INFO  (qtp466304847-23924) [n:127.0.0.1:34901__fy%2Fse c:control_collection s:shard1  x:control_collection_shard1_replica_n1] o.a.s.s.SolrIndexSearcher Opening [Searcher@144d9dd2[control_collection_shard1_replica_n1] main]
   [junit4]   2> 1412975 INFO  (qtp466304847-23924) [n:127.0.0.1:34901__fy%2Fse c:control_collection s:shard1  x:control_collection_shard1_replica_n1] o.a.s.r.ManagedResourceStorage Configured ZooKeeperStorageIO with znodeBase: /configs/conf1
   [junit4]   2> 1412976 INFO  (qtp466304847-23924) [n:127.0.0.1:34901__fy%2Fse c:control_collection s:shard1  x:control_collection_shard1_replica_n1] o.a.s.r.ManagedResourceStorage Loaded null at path _rest_managed.json using ZooKeeperStorageIO:path=/configs/conf1
   [junit4]   2> 1412976 INFO  (qtp466304847-23924) [n:127.0.0.1:34901__fy%2Fse c:control_collection s:shard1  x:control_collection_shard1_replica_n1] o.a.s.h.ReplicationHandler Commits will be reserved for 10000ms.
   [junit4]   2> 1412976 INFO  (qtp466304847-23924) [n:127.0.0.1:34901__fy%2Fse c:control_collection s:shard1  x:control_collection_shard1_replica_n1] o.a.s.u.UpdateLog Could not find max version in index or recent updates, using new clock 1635368036568399872
   [junit4]   2> 1412978 INFO  (searcherExecutor-8302-thread-1-processing-n:127.0.0.1:34901__fy%2Fse x:control_collection_shard1_replica_n1 c:control_collection s:shard1) [n:127.0.0.1:34901__fy%2Fse c:control_collection s:shard1  x:control_collection_shard1_replica_n1] o.a.s.c.SolrCore [control_collection_shard1_replica_n1] Registered new searcher Searcher@144d9dd2[control_collection_shard1_replica_n1] main{ExitableDirectoryReader(UninvertingDirectoryReader())}
   [junit4]   2> 1412979 INFO  (qtp466304847-23924) [n:127.0.0.1:34901__fy%2Fse c:control_collection s:shard1  x:control_collection_shard1_replica_n1] o.a.s.c.ZkShardTerms Successful update of terms at /collections/control_collection/terms/shard1 to Terms{values={core_node2=0}, version=0}
   [junit4]   2> 1412979 INFO  (qtp466304847-23924) [n:127.0.0.1:34901__fy%2Fse c:control_collection s:shard1  x:control_collection_shard1_replica_n1] o.a.s.c.ShardLeaderElectionContextBase make sure parent is created /collections/control_collection/leaders/shard1
   [junit4]   2> 1412980 INFO  (qtp466304847-23924) [n:127.0.0.1:34901__fy%2Fse c:control_collection s:shard1  x:control_collection_shard1_replica_n1] o.a.s.c.ShardLeaderElectionContext Enough replicas found to continue.
   [junit4]   2> 1412980 INFO  (qtp466304847-23924) [n:127.0.0.1:34901__fy%2Fse c:control_collection s:shard1  x:control_collection_shard1_replica_n1] o.a.s.c.ShardLeaderElectionContext I may be the new leader - try and sync
   [junit4]   2> 1412980 INFO  (qtp466304847-23924) [n:127.0.0.1:34901__fy%2Fse c:control_collection s:shard1  x:control_collection_shard1_replica_n1] o.a.s.c.SyncStrategy Sync replicas to http://127.0.0.1:34901/_fy/se/control_collection_shard1_replica_n1/
   [junit4]   2> 1412980 INFO  (qtp466304847-23924) [n:127.0.0.1:34901__fy%2Fse c:control_collection s:shard1  x:control_collection_shard1_replica_n1] o.a.s.c.SyncStrategy Sync Success - now sync replicas to me
   [junit4]   2> 1412980 INFO  (qtp466304847-23924) [n:127.0.0.1:34901__fy%2Fse c:control_collection s:shard1  x:control_collection_shard1_replica_n1] o.a.s.c.SyncStrategy http://127.0.0.1:34901/_fy/se/control_collection_shard1_replica_n1/ has no replicas
   [junit4]   2> 1412980 INFO  (qtp466304847-23924) [n:127.0.0.1:34901__fy%2Fse c:control_collection s:shard1  x:control_collection_shard1_replica_n1] o.a.s.c.ShardLeaderElectionContextBase Creating leader registration node /collections/control_collection/leaders/shard1/leader after winning as /collections/control_collection/leader_elect/shard1/election/72365864093745156-core_node2-n_0000000000
   [junit4]   2> 1412981 INFO  (qtp466304847-23924) [n:127.0.0.1:34901__fy%2Fse c:control_collection s:shard1  x:control_collection_shard1_replica_n1] o.a.s.c.ShardLeaderElectionContext I am the new leader: http://127.0.0.1:34901/_fy/se/control_collection_shard1_replica_n1/ shard1
   [junit4]   2> 1413082 INFO  (zkCallback-9108-thread-1) [    ] o.a.s.c.c.ZkStateReader A cluster state change: [WatchedEvent state:SyncConnected type:NodeDataChanged path:/collections/control_collection/state.json] for collection [control_collection] has occurred - updating... (live nodes size: [1])
   [junit4]   2> 1413082 INFO  (zkCallback-9108-thread-2) [    ] o.a.s.c.c.ZkStateReader A cluster state change: [WatchedEvent state:SyncConnected type:NodeDataChanged path:/collections/control_collection/state.json] for collection [control_collection] has occurred - updating... (live nodes size: [1])
   [junit4]   2> 1413082 INFO  (qtp466304847-23924) [n:127.0.0.1:34901__fy%2Fse c:control_collection s:shard1  x:control_collection_shard1_replica_n1] o.a.s.c.ZkController I am the leader, no recovery necessary
   [junit4]   2> 1413083 INFO  (qtp466304847-23924) [n:127.0.0.1:34901__fy%2Fse c:control_collection s:shard1  x:control_collection_shard1_replica_n1] o.a.s.s.HttpSolrCall [admin] webapp=null path=/admin/cores params={qt=/admin/cores&collection.configName=conf1&newCollection=true&name=control_collection_shard1_replica_n1&action=CREATE&numShards=1&collection=control_collection&shard=shard1&wt=javabin&version=2&replicaType=NRT} status=0 QTime=1469
   [junit4]   2> 1413084 INFO  (qtp466304847-23925) [n:127.0.0.1:34901__fy%2Fse    ] o.a.s.h.a.CollectionsHandler Wait for new collection to be active for at most 45 seconds. Check all shard replicas
   [junit4]   2> 1413183 INFO  (zkCallback-9108-thread-2) [    ] o.a.s.c.c.ZkStateReader A cluster state change: [WatchedEvent state:SyncConnected type:NodeDataChanged path:/collections/control_collection/state.json] for collection [control_collection] has occurred - updating... (live nodes size: [1])
   [junit4]   2> 1413183 INFO  (zkCallback-9108-thread-1) [    ] o.a.s.c.c.ZkStateReader A cluster state change: [WatchedEvent state:SyncConnected type:NodeDataChanged path:/collections/control_collection/state.json] for collection [control_collection] has occurred - updating... (live nodes size: [1])
   [junit4]   2> 1413184 INFO  (zkCallback-9108-thread-3) [    ] o.a.s.c.c.ZkStateReader A cluster state change: [WatchedEvent state:SyncConnected type:NodeDataChanged path:/collections/control_collection/state.json] for collection [control_collection] has occurred - updating... (live nodes size: [1])
   [junit4]   2> 1413184 INFO  (qtp466304847-23925) [n:127.0.0.1:34901__fy%2Fse    ] o.a.s.s.HttpSolrCall [admin] webapp=null path=/admin/collections params={collection.configName=conf1&name=control_collection&nrtReplicas=1&action=CREATE&numShards=1&createNodeSet=127.0.0.1:34901__fy%252Fse&wt=javabin&version=2} status=0 QTime=1674
   [junit4]   2> 1413186 INFO  (TEST-NestedShardedAtomicUpdateTest.test-seed#[18047704CDCF82AD]) [    ] o.a.s.c.c.ConnectionManager Waiting for client to connect to ZooKeeper
   [junit4]   2> 1413187 INFO  (zkConnectionManagerCallback-9128-thread-1) [    ] o.a.s.c.c.ConnectionManager zkClient has connected
   [junit4]   2> 1413187 INFO  (TEST-NestedShardedAtomicUpdateTest.test-seed#[18047704CDCF82AD]) [    ] o.a.s.c.c.ConnectionManager Client is connected to ZooKeeper
   [junit4]   2> 1413187 INFO  (TEST-NestedShardedAtomicUpdateTest.test-seed#[18047704CDCF82AD]) [    ] o.a.s.c.c.ZkStateReader Updated live nodes from ZooKeeper... (0) -> (1)
   [junit4]   2> 1413188 INFO  (TEST-NestedShardedAtomicUpdateTest.test-seed#[18047704CDCF82AD]) [    ] o.a.s.c.s.i.ZkClientClusterStateProvider Cluster at 127.0.0.1:36349/solr ready
   [junit4]   2> 1413188 INFO  (TEST-NestedShardedAtomicUpdateTest.test-seed#[18047704CDCF82AD]) [    ] o.a.s.c.ChaosMonkey monkey: init - expire sessions:false cause connection loss:false
   [junit4]   2> 1413188 INFO  (qtp466304847-23926) [n:127.0.0.1:34901__fy%2Fse    ] o.a.s.h.a.CollectionsHandler Invoked Collection Action :create with params collection.configName=conf1&name=collection1&nrtReplicas=1&action=CREATE&numShards=4&createNodeSet=&stateFormat=1&wt=javabin&version=2 and sendToOCPQueue=true
   [junit4]   2> 1413190 INFO  (OverseerThreadFactory-8297-thread-2-processing-n:127.0.0.1:34901__fy%2Fse) [n:127.0.0.1:34901__fy%2Fse    ] o.a.s.c.a.c.CreateCollectionCmd Create collection collection1
   [junit4]   2> 1413190 INFO  (OverseerCollectionConfigSetProcessor-72365864093745156-127.0.0.1:34901__fy%2Fse-n_0000000000) [n:127.0.0.1:34901__fy%2Fse    ] o.a.s.c.OverseerTaskQueue Response ZK path: /overseer/collection-queue-work/qnr-0000000000 doesn't exist.  Requestor may have disconnected from ZooKeeper
   [junit4]   2> 1413391 WARN  (OverseerThreadFactory-8297-thread-2-processing-n:127.0.0.1:34901__fy%2Fse) [n:127.0.0.1:34901__fy%2Fse    ] o.a.s.c.a.c.CreateCollectionCmd It is unusual to create a collection (collection1) without cores.
   [junit4]   2> 1413392 INFO  (qtp466304847-23926) [n:127.0.0.1:34901__fy%2Fse    ] o.a.s.h.a.CollectionsHandler Wait for new collection to be active for at most 45 seconds. Check all shard replicas
   [junit4]   2> 1413392 INFO  (qtp466304847-23926) [n:127.0.0.1:34901__fy%2Fse    ] o.a.s.s.HttpSolrCall [admin] webapp=null path=/admin/collections params={collection.configName=conf1&name=collection1&nrtReplicas=1&action=CREATE&numShards=4&createNodeSet=&stateFormat=1&wt=javabin&version=2} status=0 QTime=203
   [junit4]   2> 1413393 INFO  (TEST-NestedShardedAtomicUpdateTest.test-seed#[18047704CDCF82AD]) [    ] o.a.s.c.AbstractFullDistribZkTestBase Creating jetty instances pullReplicaCount=0 numOtherReplicas=4
   [junit4]   2> 1413458 INFO  (TEST-NestedShardedAtomicUpdateTest.test-seed#[18047704CDCF82AD]) [    ] o.a.s.c.AbstractFullDistribZkTestBase create jetty 1 in directory /home/jenkins/workspace/Lucene-Solr-8.x-Linux/solr/build/solr-core/test/J1/temp/solr.cloud.NestedShardedAtomicUpdateTest_18047704CDCF82AD-001/shard-1-001 of type NRT
   [junit4]   2> 1413459 WARN  (closeThreadPool-9129-thread-1) [    ] o.e.j.s.AbstractConnector Ignoring deprecated socket close linger time
   [junit4]   2> 1413466 INFO  (closeThreadPool-9129-thread-1) [    ] o.a.s.c.s.e.JettySolrRunner Start Jetty (original configured port=0)
   [junit4]   2> 1413466 INFO  (closeThreadPool-9129-thread-1) [    ] o.a.s.c.s.e.JettySolrRunner Trying to start Jetty on port 0 try number 1 ...
   [junit4]   2> 1413466 INFO  (closeThreadPool-9129-thread-1) [    ] o.e.j.s.Server jetty-9.4.14.v20181114; built: 2018-11-14T21:20:31.478Z; git: c4550056e785fb5665914545889f21dc136ad9e6; jvm 13-ea+18
   [junit4]   2> 1413467 INFO  (closeThreadPool-9129-thread-1) [    ] o.e.j.s.session DefaultSessionIdManager workerName=node0
   [junit4]   2> 1413467 INFO  (closeThreadPool-9129-thread-1) [    ] o.e.j.s.session No SessionScavenger set, using defaults
   [junit4]   2> 1413467 INFO  (closeThreadPool-9129-thread-1) [    ] o.e.j.s.session node0 Scavenging every 660000ms
   [junit4]   2> 1413467 INFO  (closeThreadPool-9129-thread-1) [    ] o.e.j.s.h.ContextHandler Started o.e.j.s.ServletContextHandler@689ac5eb{/_fy/se,null,AVAILABLE}
   [junit4]   2> 1413468 INFO  (closeThreadPool-9129-thread-1) [    ] o.e.j.s.AbstractConnector Started ServerConnector@1c6ed6b6{HTTP/1.1,[http/1.1, h2c]}{127.0.0.1:45697}
   [junit4]   2> 1413468 INFO  (closeThreadPool-9129-thread-1) [    ] o.e.j.s.Server Started @1413492ms
   [junit4]   2> 1413468 INFO  (closeThreadPool-9129-thread-1) [    ] o.a.s.c.s.e.JettySolrRunner Jetty properties: {hostContext=/_fy/se, solrconfig=solrconfig.xml, solr.data.dir=/home/jenkins/workspace/Lucene-Solr-8.x-Linux/solr/build/solr-core/test/J1/temp/solr.cloud.NestedShardedAtomicUpdateTest_18047704CDCF82AD-001/tempDir-001/jetty1, hostPort=45697, coreRootDirectory=/home/jenkins/workspace/Lucene-Solr-8.x-Linux/solr/build/solr-core/test/J1/temp/solr.cloud.NestedShardedAtomicUpdateTest_18047704CDCF82AD-001/shard-1-001/cores}
   [junit4]   2> 1413468 ERROR (closeThreadPool-9129-thread-1) [    ] o.a.s.u.StartupLoggingUtils Missing Java Option solr.log.dir. Logging may be missing or incomplete.
   [junit4]   2> 1413468 INFO  (closeThreadPool-9129-thread-1) [    ] o.a.s.s.SolrDispatchFilter Using logger factory org.apache.logging.slf4j.Log4jLoggerFactory
   [junit4]   2> 1413468 INFO  (closeThreadPool-9129-thread-1) [    ] o.a.s.s.SolrDispatchFilter  ___      _       Welcome to Apache Solr™ version 8.2.0
   [junit4]   2> 1413468 INFO  (closeThreadPool-9129-thread-1) [    ] o.a.s.s.SolrDispatchFilter / __| ___| |_ _   Starting in cloud mode on port null
   [junit4]   2> 1413468 INFO  (closeThreadPool-9129-thread-1) [    ] o.a.s.s.SolrDispatchFilter \__ \/ _ \ | '_|  Install dir: null
   [junit4]   2> 1413468 INFO  (closeThreadPool-9129-thread-1) [    ] o.a.s.s.SolrDispatchFilter |___/\___/_|_|    Start time: 2019-06-04T00:34:54.839311Z
   [junit4]   2> 1413472 INFO  (closeThreadPool-9129-thread-1) [    ] o.a.s.c.c.ConnectionManager Waiting for client to connect to ZooKeeper
   [junit4]   2> 1413476 INFO  (zkConnectionManagerCallback-9131-thread-1) [    ] o.a.s.c.c.ConnectionManager zkClient has connected
   [junit4]   2> 1413476 INFO  (closeThreadPool-9129-thread-1) [    ] o.a.s.c.c.ConnectionManager Client is connected to ZooKeeper
   [junit4]   2> 1413477 INFO  (closeThreadPool-9129-thread-1) [    ] o.a.s.s.SolrDispatchFilter Loading solr.xml from SolrHome (not found in ZooKeeper)
   [junit4]   2> 1413477 INFO  (closeThreadPool-9129-thread-1) [    ] o.a.s.c.SolrXmlConfig Loading container configuration from /home/jenkins/workspace/Lucene-Solr-8.x-Linux/solr/build/solr-core/test/J1/temp/solr.cloud.NestedShardedAtomicUpdateTest_18047704CDCF82AD-001/shard-1-001/solr.xml
   [junit4]   2> 1413479 INFO  (closeThreadPool-9129-thread-1) [    ] o.a.s.c.SolrXmlConfig Configuration parameter autoReplicaFailoverWorkLoopDelay is ignored
   [junit4]   2> 1413479 INFO  (closeThreadPool-9129-thread-1) [    ] o.a.s.c.SolrXmlConfig Configuration parameter autoReplicaFailoverBadNodeExpiration is ignored
   [junit4]   2> 1413480 INFO  (closeThreadPool-9129-thread-1) [    ] o.a.s.c.SolrXmlConfig MBean server found: com.sun.jmx.mbeanserver.JmxMBeanServer@20641fb9, but no JMX reporters were configured - adding default JMX reporter.
   [junit4]   2> 1413532 INFO  (TEST-NestedShardedAtomicUpdateTest.test-seed#[18047704CDCF82AD]) [    ] o.a.s.c.AbstractFullDistribZkTestBase create jetty 2 in directory /home/jenkins/workspace/Lucene-Solr-8.x-Linux/solr/build/solr-core/test/J1/temp/solr.cloud.NestedShardedAtomicUpdateTest_18047704CDCF82AD-001/shard-2-001 of type NRT
   [junit4]   2> 1413533 WARN  (closeThreadPool-9129-thread-2) [    ] o.e.j.s.AbstractConnector Ignoring deprecated socket close linger time
   [junit4]   2> 1413533 INFO  (closeThreadPool-9129-thread-2) [    ] o.a.s.c.s.e.JettySolrRunner Start Jetty (original configured port=0)
   [junit4]   2> 1413533 INFO  (closeThreadPool-9129-thread-2) [    ] o.a.s.c.s.e.JettySolrRunner Trying to start Jetty on port 0 try number 1 ...
   [junit4]   2> 1413533 INFO  (closeThreadPool-9129-thread-2) [    ] o.e.j.s.Server jetty-9.4.14.v20181114; built: 2018-11-14T21:20:31.478Z; git: c4550056e785fb5665914545889f21dc136ad9e6; jvm 13-ea+18
   [junit4]   2> 1413533 INFO  (closeThreadPool-9129-thread-2) [    ] o.e.j.s.session DefaultSessionIdManager workerName=node0
   [junit4]   2> 1413533 INFO  (closeThreadPool-9129-thread-2) [    ] o.e.j.s.session No SessionScavenger set, using defaults
   [junit4]   2> 1413533 INFO  (closeThreadPool-9129-thread-2) [    ] o.e.j.s.session node0 Scavenging every 660000ms
   [junit4]   2> 1413534 INFO  (closeThreadPool-9129-thread-2) [    ] o.e.j.s.h.ContextHandler Started o.e.j.s.ServletContextHandler@14000a1d{/_fy/se,null,AVAILABLE}
   [junit4]   2> 1413534 INFO  (closeThreadPool-9129-thread-2) [    ] o.e.j.s.AbstractConnector Started ServerConnector@37de89a2{HTTP/1.1,[http/1.1, h2c]}{127.0.0.1:44037}
   [junit4]   2> 1413534 INFO  (closeThreadPool-9129-thread-2) [    ] o.e.j.s.Server Started @1413559ms
   [junit4]   2> 1413534 INFO  (closeThreadPool-9129-thread-2) [    ] o.a.s.c.s.e.JettySolrRunner Jetty properties: {hostContext=/_fy/se, solrconfig=solrconfig.xml, solr.data.dir=/home/jenkins/workspace/Lucene-Solr-8.x-Linux/solr/build/solr-core/test/J1/temp/solr.cloud.NestedShardedAtomicUpdateTest_18047704CDCF82AD-001/tempDir-001/jetty2, hostPort=44037, coreRootDirectory=/home/jenkins/workspace/Lucene-Solr-8.x-Linux/solr/build/solr-core/test/J1/temp/solr.cloud.NestedShardedAtomicUpdateTest_18047704CDCF82AD-001/shard-2-001/cores}
   [junit4]   2> 1413534 ERROR (closeThreadPool-9129-thread-2) [    ] o.a.s.u.StartupLoggingUtils Missing Java Option solr.log.dir. Logging may be missing or incomplete.
   [junit4]   2> 1413534 INFO  (closeThreadPool-9129-thread-2) [    ] o.a.s.s.SolrDispatchFilter Using logger factory org.apache.logging.slf4j.Log4jLoggerFactory
   [junit4]   2> 1413534 INFO  (closeThreadPool-9129-thread-2) [    ] o.a.s.s.SolrDispatchFilter  ___      _       Welcome to Apache Solr™ version 8.2.0
   [junit4]   2> 1413534 INFO  (closeThreadPool-9129-thread-2) [    ] o.a.s.s.SolrDispatchFilter / __| ___| |_ _   Starting in cloud mode on port null
   [junit4]   2> 1413534 INFO  (closeThreadPool-9129-thread-2) [    ] o.a.s.s.SolrDispatchFilter \__ \/ _ \ | '_|  Install dir: null
   [junit4]   2> 1413534 INFO  (closeThreadPool-9129-thread-2) [    ] o.a.s.s.SolrDispatchFilter |___/\___/_|_|    Start time: 2019-06-04T00:34:54.905753Z
   [junit4]   2> 1413535 INFO  (closeThreadPool-9129-thread-2) [    ] o.a.s.c.c.ConnectionManager Waiting for client to connect to ZooKeeper
   [junit4]   2> 1413535 INFO  (zkConnectionManagerCallback-9134-thread-1) [    ] o.a.s.c.c.ConnectionManager zkClient has connected
   [junit4]   2> 1413535 INFO  (closeThreadPool-9129-thread-2) [    ] o.a.s.c.c.ConnectionManager Client is connected to ZooKeeper
   [junit4]   2> 1413536 INFO  (closeThreadPool-9129-thread-2) [    ] o.a.s.s.SolrDispatchFilter Loading solr.xml from SolrHome (not found in ZooKeeper)
   [junit4]   2> 1413536 INFO  (closeThreadPool-9129-thread-2) [    ] o.a.s.c.SolrXmlConfig Loading container configuration from /home/jenkins/workspace/Lucene-Solr-8.x-Linux/solr/build/solr-core/test/J1/temp/solr.cloud.NestedShardedAtomicUpdateTest_18047704CDCF82AD-001/shard-2-001/solr.xml
   [junit4]   2> 1413549 INFO  (closeThreadPool-9129-thread-2) [    ] o.a.s.c.SolrXmlConfig Configuration parameter autoReplicaFailoverWorkLoopDelay is ignored
   [junit4]   2> 1413549 INFO  (closeThreadPool-9129-thread-2) [    ] o.a.s.c.SolrXmlConfig Configuration parameter autoReplicaFailoverBadNodeExpiration is ignored
   [junit4]   2> 1413550 INFO  (closeThreadPool-9129-thread-2) [    ] o.a.s.c.SolrXmlConfig MBean server found: com.sun.jmx.mbeanserver.JmxMBeanServer@20641fb9, but no JMX reporters were configured - adding default JMX reporter.
   [junit4]   2> 1413590 INFO  (closeThreadPool-9129-thread-1) [    ] o.a.s.h.c.HttpShardHandlerFactory Host whitelist initialized: WhitelistHostChecker [whitelistHosts=null, whitelistHostCheckingEnabled=false]
   [junit4]   2> 1413590 WARN  (closeThreadPool-9129-thread-1) [    ] o.e.j.u.s.S.config No Client EndPointIdentificationAlgorithm configured for SslContextFactory@ff663b7[provider=null,keyStore=null,trustStore=null]
   [junit4]   2> 1413593 WARN  (closeThreadPool-9129-thread-1) [    ] o.e.j.u.s.S.config No Client EndPointIdentificationAlgorithm configured for SslContextFactory@52c2121f[provider=null,keyStore=null,trustStore=null]
   [junit4]   2> 1413594 INFO  (closeThreadPool-9129-thread-1) [    ] o.a.s.c.ZkContainer Zookeeper client=127.0.0.1:36349/solr
   [junit4]   2> 1413596 INFO  (closeThreadPool-9129-thread-1) [    ] o.a.s.c.c.ConnectionManager Waiting for client to connect to ZooKeeper
   [junit4]   2> 1413598 INFO  (zkConnectionManagerCallback-9141-thread-1) [    ] o.a.s.c.c.ConnectionManager zkClient has connected
   [junit4]   2> 1413598 INFO  (closeThreadPool-9129-thread-1) [    ] o.a.s.c.c.ConnectionManager Client is connected to ZooKeeper
   [junit4]   2> 1413603 INFO  (closeThreadPool-9129-thread-1) [n:127.0.0.1:45697__fy%2Fse    ] o.a.s.c.c.ConnectionManager Waiting for client to connect to ZooKeeper
   [junit4]   2> 1413603 INFO  (zkConnectionManagerCallback-9143-thread-1) [    ] o.a.s.c.c.ConnectionManager zkClient has connected
   [junit4]   2> 1413603 INFO  (closeThreadPool-9129-thread-1) [n:127.0.0.1:45697__fy%2Fse    ] o.a.s.c.c.ConnectionManager Client is connected to ZooKeeper
   [junit4]   2> 1413605 INFO  (closeThreadPool-9129-thread-1) [n:127.0.0.1:45697__fy%2Fse    ] o.a.s.c.c.ZkStateReader Updated live nodes from ZooKeeper... (0) -> (1)
   [junit4]   2> 1413607 INFO  (closeThreadPool-9129-thread-1) [n:127.0.0.1:45697__fy%2Fse    ] o.a.s.c.ZkController Publish node=127.0.0.1:45697__fy%2Fse as DOWN
   [junit4]   2> 1413607 INFO  (closeThreadPool-9129-thread-1) [n:127.0.0.1:45697__fy%2Fse    ] o.a.s.c.TransientSolrCoreCacheDefault Allocating transient cache for 4 transient cores
   [junit4]   2> 1413607 INFO  (closeThreadPool-9129-thread-1) [n:127.0.0.1:45697__fy%2Fse    ] o.a.s.c.ZkController Register node as live in ZooKeeper:/live_nodes/127.0.0.1:45697__fy%2Fse
   [junit4]   2> 1413608 INFO  (zkCallback-9115-thread-1) [    ] o.a.s.c.c.ZkStateReader Updated live nodes from ZooKeeper... (1) -> (2)
   [junit4]   2> 1413608 INFO  (zkCallback-9127-thread-1) [    ] o.a.s.c.c.ZkStateReader Updated live nodes from ZooKeeper... (1) -> (2)
   [junit4]   2> 1413608 INFO  (zkCallback-9108-thread-3) [    ] o.a.s.c.c.ZkStateReader Updated live nodes from ZooKeeper... (1) -> (2)
   [junit4]   2> 1413608 INFO  (zkCallback-9142-thread-1) [    ] o.a.s.c.c.ZkStateReader Updated live nodes from ZooKeeper... (1) -> (2)
   [junit4]   2> 1413614 INFO  (closeThreadPool-9129-thread-1) [n:127.0.0.1:45697__fy%2Fse    ] o.a.s.c.c.ConnectionManager Waiting for client to connect to ZooKeeper
   [junit4]   2> 1413616 INFO  (zkConnectionManagerCallback-9150-thread-1) [    ] o.a.s.c.c.ConnectionManager zkClient has connected
   [junit4]   2> 1413616 INFO  (closeThreadPool-9129-thread-1) [n:127.0.0.1:45697__fy%2Fse    ] o.a.s.c.c.ConnectionManager Client is connected to ZooKeeper
   [junit4]   2> 1413617 INFO  (closeThreadPool-9129-thread-1) [n:127.0.0.1:45697__fy%2Fse    ] o.a.s.c.c.ZkStateReader Updated live nodes from ZooKeeper... (0) -> (2)
   [junit4]   2> 1413617 INFO  (closeThreadPool-9129-thread-1) [n:127.0.0.1:45697__fy%2Fse    ] o.a.s.c.s.i.ZkClientClusterStateProvider Cluster at 127.0.0.1:36349/solr ready
   [junit4]   2> 1413629 INFO  (closeThreadPool-9129-thread-1) [n:127.0.0.1:45697__fy%2Fse    ] o.a.s.h.a.MetricsHistoryHandler No .system collection, keeping metrics history in memory.
   [junit4]   2> 1413652 INFO  (closeThreadPool-9129-thread-2) [    ] o.a.s.h.c.HttpShardHandlerFactory Host whitelist initialized: WhitelistHostChecker [whitelistHosts=null, whitelistHostCheckingEnabled=false]
   [junit4]   2> 1413653 WARN  (closeThreadPool-9129-thread-2) [    ] o.e.j.u.s.S.config No Client EndPointIdentificationAlgorithm configured for SslContextFactory@1d75b1b7[provider=null,keyStore=null,trustStore=null]
   [junit4]   2> 1413657 INFO  (closeThreadPool-9129-thread-1) [n:127.0.0.1:45697__fy%2Fse    ] o.a.s.m.r.SolrJmxReporter JMX monitoring for 'solr.node' (registry 'solr.node') enabled at server: com.sun.jmx.mbeanserver.JmxMBeanServer@20641fb9
   [junit4]   2> 1413657 INFO  (TEST-NestedShardedAtomicUpdateTest.test-seed#[18047704CDCF82AD]) [    ] o.a.s.c.AbstractFullDistribZkTestBase create jetty 3 in directory /home/jenkins/workspace/Lucene-Solr-8.x-Linux/solr/build/solr-core/test/J1/temp/solr.cloud.NestedShardedAtomicUpdateTest_18047704CDCF82AD-001/shard-3-001 of type NRT
   [junit4]   2> 1413659 WARN  (closeThreadPool-9129-thread-3) [    ] o.e.j.s.AbstractConnector Ignoring deprecated socket close linger time
   [junit4]   2> 1413659 INFO  (closeThreadPool-9129-thread-3) [    ] o.a.s.c.s.e.JettySolrRunner Start Jetty (original configured port=0)
   [junit4]   2> 1413659 INFO  (closeThreadPool-9129-thread-3) [    ] o.a.s.c.s.e.JettySolrRunner Trying to start Jetty on port 0 try number 1 ...
   [junit4]   2> 1413660 INFO  (closeThreadPool-9129-thread-3) [    ] o.e.j.s.Server jetty-9.4.14.v20181114; built: 2018-11-14T21:20:31.478Z; git: c4550056e785fb5665914545889f21dc136ad9e6; jvm 13-ea+18
   [junit4]   2> 1413661 WARN  (closeThreadPool-9129-thread-2) [    ] o.e.j.u.s.S.config No Client EndPointIdentificationAlgorithm configured for SslContextFactory@55ba538c[provider=null,keyStore=null,trustStore=null]
   [junit4]   2> 1413662 INFO  (closeThreadPool-9129-thread-2) [    ] o.a.s.c.ZkContainer Zookeeper client=127.0.0.1:36349/solr
   [junit4]   2> 1413665 INFO  (closeThreadPool-9129-thread-2) [    ] o.a.s.c.c.ConnectionManager Waiting for client to connect to ZooKeeper
   [junit4]   2> 1413668 INFO  (closeThreadPool-9129-thread-1) [n:127.0.0.1:45697__fy%2Fse    ] o.a.s.m.r.SolrJmxReporter JMX monitoring for 'solr.jvm' (registry 'solr.jvm') enabled at server: com.sun.jmx.mbeanserver.JmxMBeanServer@20641fb9
   [junit4]   2> 1413668 INFO  (closeThreadPool-9129-thread-1) [n:127.0.0.1:45697__fy%2Fse    ] o.a.s.m.r.SolrJmxReporter JMX monitoring for 'solr.jetty' (registry 'solr.jetty') enabled at server: com.sun.jmx.mbeanserver.JmxMBeanServer@20641fb9
   [junit4]   2> 1413669 INFO  (closeThreadPool-9129-thread-1) [n:127.0.0.1:45697__fy%2Fse    ] o.a.s.c.CorePropertiesLocator Found 0 core definitions underneath /home/jenkins/workspace/Lucene-Solr-8.x-Linux/solr/build/solr-core/test/J1/temp/solr.cloud.NestedShardedAtomicUpdateTest_18047704CDCF82AD-001/shard-1-001/cores
   [junit4]   2> 1413669 INFO  (zkConnectionManagerCallback-9157-thread-1) [    ] o.a.s.c.c.ConnectionManager zkClient has connected
   [junit4]   2> 1413669 INFO  (closeThreadPool-9129-thread-2) [    ] o.a.s.c.c.ConnectionManager Client is connected to ZooKeeper
   [junit4]   2> 1413678 INFO  (closeThreadPool-9129-thread-2) [n:127.0.0.1:44037__fy%2Fse    ] o.a.s.c.c.ConnectionManager Waiting for client to connect to ZooKeeper
   [junit4]   2> 1413684 INFO  (zkConnectionManagerCallback-9159-thread-1) [    ] o.a.s.c.c.ConnectionManager zkClient has connected
   [junit4]   2> 1413684 INFO  (closeThreadPool-9129-thread-2) [n:127.0.0.1:44037__fy%2Fse    ] o.a.s.c.c.ConnectionManager Client is connected to ZooKeeper
   [junit4]   2> 1413686 INFO  (closeThreadPool-9129-thread-2) [n:127.0.0.1:44037__fy%2Fse    ] o.a.s.c.c.ZkStateReader Updated live nodes from ZooKeeper... (0) -> (2)
   [junit4]   2> 1413693 INFO  (closeThreadPool-9129-thread-3) [    ] o.e.j.s.session DefaultSessionIdManager workerName=node0
   [junit4]   2> 1413693 INFO  (closeThreadPool-9129-thread-3) [    ] o.e.j.s.session No SessionScavenger set, using defaults
   [junit4]   2> 1413693 INFO  (closeThreadPool-9129-thread-3) [    ] o.e.j.s.session node0 Scavenging every 660000ms
   [junit4]   2> 1413694 INFO  (closeThreadPool-9129-thread-2) [n:127.0.0.1:44037__fy%2Fse    ] o.a.s.c.ZkController Publish node=127.0.0.1:44037__fy%2Fse as DOWN
   [junit4]   2> 1413695 INFO  (closeThreadPool-9129-thread-2) [n:127.0.0.1:44037__fy%2Fse    ] o.a.s.c.TransientSolrCoreCacheDefault Allocating transient cache for 4 transient cores
   [junit4]   2> 1413695 INFO  (closeThreadPool-9129-thread-2) [n:127.0.0.1:44037__fy%2Fse    ] o.a.s.c.ZkController Register node as live in ZooKeeper:/live_nodes/127.0.0.1:44037__fy%2Fse
   [junit4]   2> 1413695 INFO  (zkCallback-9108-thread-3) [    ] o.a.s.c.c.ZkStateReader Updated live nodes from ZooKeeper... (2) -> (3)
   [junit4]   2> 1413695 INFO  (zkCallback-9127-thread-1) [    ] o.a.s.c.c.ZkStateReader Updated live nodes from ZooKeeper... (2) -> (3)
   [junit4]   2> 1413695 INFO  (zkCallback-9115-thread-1) [    ] o.a.s.c.c.ZkStateReader Updated live nodes from ZooKeeper... (2) -> (3)
   [junit4]   2> 1413695 INFO  (zkCallback-9142-thread-1) [    ] o.a.s.c.c.ZkStateReader Updated live nodes from ZooKeeper... (2) -> (3)
   [junit4]   2> 1413696 INFO  (closeThreadPool-9129-thread-3) [    ] o.e.j.s.h.ContextHandler Started o.e.j.s.ServletContextHandler@7ed33e34{/_fy/se,null,AVAILABLE}
   [junit4]   2> 1413697 INFO  (closeThreadPool-9129-thread-3) [    ] o.e.j.s.AbstractConnector Started ServerConnector@1ec568b3{HTTP/1.1,[http/1.1, h2c]}{127.0.0.1:35309}
   [junit4]   2> 1413697 INFO  (closeThreadPool-9129-thread-3) [    ] o.e.j.s.Server Started @1413721ms
   [junit4]   2> 1413697 INFO  (closeThreadPool-9129-thread-3) [    ] o.a.s.c.s.e.JettySolrRunner Jetty properties: {hostContext=/_fy/se, solrconfig=solrconfig.xml, solr.data.dir=/home/jenkins/workspace/Lucene-Solr-8.x-Linux/solr/build/solr-core/test/J1/temp/solr.cloud.NestedShardedAtomicUpdateTest_18047704CDCF82AD-001/tempDir-001/jetty3, hostPort=35309, coreRootDirectory=/home/jenkins/workspace/Lucene-Solr-8.x-Linux/solr/build/solr-core/test/J1/temp/solr.cloud.NestedShardedAtomicUpdateTest_18047704CDCF82AD-001/shard-3-001/cores}
   [junit4]   2> 1413697 ERROR (closeThreadPool-9129-thread-3) [    ] o.a.s.u.StartupLoggingUtils Missing Java Option solr.log.dir. Logging may be missing or incomplete.
   [junit4]   2> 1413697 INFO  (closeThreadPool-9129-thread-3) [    ] o.a.s.s.SolrDispatchFilter Using logger factory org.apache.logging.slf4j.Log4jLoggerFactory
   [junit4]   2> 1413697 INFO  (closeThreadPool-9129-thread-3) [    ] o.a.s.s.SolrDispatchFilter  ___      _       Welcome to Apache Solr™ version 8.2.0
   [junit4]   2> 1413697 INFO  (closeThreadPool-9129-thread-3) [    ] o.a.s.s.SolrDispatchFilter / __| ___| |_ _   Starting in cloud mode on port null
   [junit4]   2> 1413697 INFO  (closeThreadPool-9129-thread-3) [    ] o.a.s.s.SolrDispatchFilter \__ \/ _ \ | '_|  Install dir: null
   [junit4]   2> 1413697 INFO  (closeThreadPool-9129-thread-3) [    ] o.a.s.s.SolrDispatchFilter |___/\___/_|_|    Start time: 2019-06-04T00:34:55.068325Z
   [junit4]   2> 1413700 INFO  (zkCallback-9149-thread-1) [    ] o.a.s.c.c.ZkStateReader Updated live nodes from ZooKeeper... (2) -> (3)
   [junit4]   2> 1413700 INFO  (zkCallback-9158-thread-1) [    ] o.a.s.c.c.ZkStateReader Updated live nodes from ZooKeeper... (2) -> (3)
   [junit4]   2> 1413700 INFO  (closeThreadPool-9129-thread-2) [n:127.0.0.1:44037__fy%2Fse    ] o.a.s.c.c.ConnectionManager Waiting for client to connect to ZooKeeper
   [junit4]   2> 1413700 INFO  (closeThreadPool-9129-thread-3) [    ] o.a.s.c.c.ConnectionManager Waiting for client to connect to ZooKeeper
   [junit4]   2> 1413704 INFO  (zkConnectionManagerCallback-9166-thread-1) [    ] o.a.s.c.c.ConnectionManager zkClient has connected
   [junit4]   2> 1413704 INFO  (closeThreadPool-9129-thread-2) [n:127.0.0.1:44037__fy%2Fse    ] o.a.s.c.c.ConnectionManager Client is connected to ZooKeeper
   [junit4]   2> 1413705 INFO  (zkConnectionManagerCallback-9168-thread-1) [    ] o.a.s.c.c.ConnectionManager zkClient has connected
   [junit4]   2> 1413705 INFO  (closeThreadPool-9129-thread-3) [    ] o.a.s.c.c.ConnectionManager Client is connected to ZooKeeper
   [junit4]   2> 1413705 INFO  (closeThreadPool-9129-thread-2) [n:127.0.0.1:44037__fy%2Fse    ] o.a.s.c.c.ZkStateReader Updated live nodes from ZooKeeper... (0) -> (3)
   [junit4]   2> 1413705 INFO  (closeThreadPool-9129-thread-3) [    ] o.a.s.s.SolrDispatchFilter Loading solr.xml from SolrHome (not found in ZooKeeper)
   [junit4]   2> 1413706 INFO  (closeThreadPool-9129-thread-3) [    ] o.a.s.c.SolrXmlConfig Loading container configuration from /home/jenkins/workspace/Lucene-Solr-8.x-Linux/solr/build/solr-core/test/J1/temp/solr.cloud.NestedShardedAtomicUpdateTest_18047704CDCF82AD-001/shard-3-001/solr.xml
   [junit4]   2> 1413708 INFO  (closeThreadPool-9129-thread-3) [    ] o.a.s.c.SolrXmlConfig Configuration parameter autoReplicaFailoverWorkLoopDelay is ignored
   [junit4]   2> 1413708 INFO  (closeThreadPool-9129-thread-3) [    ] o.a.s.c.SolrXmlConfig Configuration parameter autoReplicaFailoverBadNodeExpiration is ignored
   [junit4]   2> 1413709 INFO  (closeThreadPool-9129-thread-3) [    ] o.a.s.c.SolrXmlConfig MBean server found: com.sun.jmx.mbeanserver.JmxMBeanServer@20641fb9, but no JMX reporters were configured - adding default JMX reporter.
   [junit4]   2> 1413711 INFO  (closeThreadPool-9129-thread-2) [n:127.0.0.1:44037__fy%2Fse    ] o.a.s.c.s.i.ZkClientClusterStateProvider Cluster at 127.0.0.1:36349/solr ready
   [junit4]   2> 1413724 INFO  (closeThreadPool-9129-thread-2) [n:127.0.0.1:44037__fy%2Fse    ] o.a.s.h.a.MetricsHistoryHandler No .system collection, keeping metrics history in memory.
   [junit4]   2> 1413752 INFO  (closeThreadPool-9129-thread-2) [n:127.0.0.1:44037__fy%2Fse    ] o.a.s.m.r.SolrJmxReporter JMX monitoring for 'solr.node' (registry 'solr.node') enabled at server: com.sun.jmx.mbeanserver.JmxMBeanServer@20641fb9
   [junit4]   2> 1413763 INFO  (closeThreadPool-9129-thread-2) [n:127.0.0.1:44037__fy%2Fse    ] o.a.s.m.r.SolrJmxReporter JMX monitoring for 'solr.jvm' (registry 'solr.jvm') enabled at server: com.sun.jmx.mbeanserver.JmxMBeanServer@20641fb9
   [junit4]   2> 1413764 INFO  (closeThreadPool-9129-thread-2) [n:127.0.0.1:44037__fy%2Fse    ] o.a.s.m.r.SolrJmxReporter JMX monitoring for 'solr.jetty' (registry 'solr.jetty') enabled at server: com.sun.jmx.mbeanserver.JmxMBeanServer@20641fb9
   [junit4]   2> 1413765 INFO  (closeThreadPool-9129-thread-2) [n:127.0.0.1:44037__fy%2Fse    ] o.a.s.c.CorePropertiesLocator Found 0 core definitions underneath /home/jenkins/workspace/Lucene-Solr-8.x-Linux/solr/build/solr-core/test/J1/temp/solr.cloud.NestedShardedAtomicUpdateTest_18047704CDCF82AD-001/shard-2-001/cores
   [junit4]   2> 1413770 INFO  (TEST-NestedShardedAtomicUpdateTest.test-seed#[18047704CDCF82AD]) [    ] o.a.s.c.AbstractFullDistribZkTestBase create jetty 4 in directory /home/jenkins/workspace/Lucene-Solr-8.x-Linux/solr/build/solr-core/test/J1/temp/solr.cloud.NestedShardedAtomicUpdateTest_18047704CDCF82AD-001/shard-4-001 of type NRT
   [junit4]   2> 1413770 WARN  (closeThreadPool-9129-thread-1) [    ] o.e.j.s.AbstractConnector Ignoring deprecated socket close linger time
   [junit4]   2> 1413770 INFO  (closeThreadPool-9129-thread-1) [    ] o.a.s.c.s.e.JettySolrRunner Start Jetty (original configured port=0)
   [junit4]   2> 1413770 INFO  (closeThreadPool-9129-thread-1) [    ] o.a.s.c.s.e.JettySolrRunner Trying to start Jetty on port 0 try number 1 ...
   [junit4]   2> 1413770 INFO  (closeThreadPool-9129-thread-1) [    ] o.e.j.s.Server jetty-9.4.14.v20181114; built: 2018-11-14T21:20:31.478Z; git: c4550056e785fb5665914545889f21dc136ad9e6; jvm 13-ea+18
   [junit4]   2> 1413771 INFO  (closeThreadPool-9129-thread-1) [    ] o.e.j.s.session DefaultSessionIdManager workerName=node0
   [junit4]   2> 1413771 INFO  (closeThreadPool-9129-thread-1) [    ] o.e.j.s.session No SessionScavenger set, using defaults
   [junit4]   2> 1413771 INFO  (closeThreadPool-9129-thread-1) [    ] o.e.j.s.session node0 Scavenging every 660000ms
   [junit4]   2> 1413771 INFO  (closeThreadPool-9129-thread-1) [    ] o.e.j.s.h.ContextHandler Started o.e.j.s.ServletContextHandler@35f2668e{/_fy/se,null,AVAILABLE}
   [junit4]   2> 1413771 INFO  (closeThreadPool-9129-thread-1) [    ] o.e.j.s.AbstractConnector Started ServerConnector@298434ba{HTTP/1.1,[http/1.1, h2c]}{127.0.0.1:44147}
   [junit4]   2> 1413771 INFO  (closeThreadPool-9129-thread-1) [    ] o.e.j.s.Server Started @1413796ms
   [junit4]   2> 1413771 INFO  (closeThreadPool-9129-thread-1) [    ] o.a.s.c.s.e.JettySolrRunner Jetty properties: {hostContext=/_fy/se, solrconfig=solrconfig.xml, solr.data.dir=/home/jenkins/workspace/Lucene-Solr-8.x-Linux/solr/build/solr-core/test/J1/temp/solr.cloud.NestedShardedAtomicUpdateTest_18047704CDCF82AD-001/tempDir-001/jetty4, hostPort=44147, coreRootDirectory=/home/jenkins/workspace/Lucene-Solr-8.x-Linux/solr/build/solr-core/test/J1/temp/solr.cloud.NestedShardedAtomicUpdateTest_18047704CDCF82AD-001/shard-4-001/cores, replicaType=NRT}
   [junit4]   2> 1413771 ERROR (closeThreadPool-9129-thread-1) [    ] o.a.s.u.StartupLoggingUtils Missing Java Option solr.log.dir. Logging may be missing or incomplete.
   [junit4]   2> 1413771 INFO  (closeThreadPool-9129-thread-1) [    ] o.a.s.s.SolrDispatchFilter Using logger factory org.apache.logging.slf4j.Log4jLoggerFactory
   [junit4]   2> 1413772 INFO  (closeThreadPool-9129-thread-1) [    ] o.a.s.s.SolrDispatchFilter  ___      _       Welcome to Apache Solr™ version 8.2.0
   [junit4]   2> 1413772 INFO  (closeThreadPool-9129-thread-1) [    ] o.a.s.s.SolrDispatchFilter / __| ___| |_ _   Starting in cloud mode on port null
   [junit4]   2> 1413772 INFO  (closeThreadPool-9129-thread-1) [    ] o.a.s.s.SolrDispatchFilter \__ \/ _ \ | '_|  Install dir: null
   [junit4]   2> 1413772 INFO  (closeThreadPool-9129-thread-1) [    ] o.a.s.s.SolrDispatchFilter |___/\___/_|_|    Start time: 2019-06-04T00:34:55.143078Z
   [junit4]   2> 1413772 INFO  (closeThreadPool-9129-thread-1) [    ] o.a.s.c.c.ConnectionManager Waiting for client to connect to ZooKeeper
   [junit4]   2> 1413776 INFO  (zkConnectionManagerCallback-9172-thread-1) [    ] o.a.s.c.c.ConnectionManager zkClient has connected
   [junit4]   2> 1413776 INFO  (closeThreadPool-9129-thread-1) [    ] o.a.s.c.c.ConnectionManager Client is connected to ZooKeeper
   [junit4]   2> 1413777 INFO  (closeThreadPool-9129-thread-1) [    ] o.a.s.s.SolrDispatchFilter Loading solr.xml from SolrHome (not found in ZooKeeper)
   [junit4]   2> 1413777 INFO  (closeThreadPool-9129-thread-1) [    ] o.a.s.c.SolrXmlConfig Loading container configuration from /home/jenkins/workspace/Lucene-Solr-8.x-Linux/solr/build/solr-core/test/J1/temp/solr.cloud.NestedShardedAtomicUpdateTest_18047704CDCF82AD-001/shard-4-001/solr.xml
   [junit4]   2> 1413779 INFO  (closeThreadPool-9129-thread-1) [    ] o.a.s.c.SolrXmlConfig Configuration parameter autoReplicaFailoverWorkLoopDelay is ignored
   [junit4]   2> 1413779 INFO  (closeThreadPool-9129-thread-1) [    ] o.a.s.c.SolrXmlConfig Configuration parameter autoReplicaFailoverBadNodeExpiration is ignored
   [junit4]   2> 1413780 INFO  (closeThreadPool-9129-thread-1) [    ] o.a.s.c.SolrXmlConfig MBean server found: com.sun.jmx.mbeanserver.JmxMBeanServer@20641fb9, but no JMX reporters were configured - adding default JMX reporter.
   [junit4]   2> 1413799 INFO  (closeThreadPool-9129-thread-3) [    ] o.a.s.h.c.HttpShardHandlerFactory Host whitelist initialized: WhitelistHostChecker [whitelistHosts=null, whitelistHostCheckingEnabled=false]
   [junit4]   2> 1413799 WARN  (closeThreadPool-9129-thread-3) [    ] o.e.j.u.s.S.config No Client EndPointIdentificationAlgorithm configured for SslContextFactory@1efaf49[provider=null,keyStore=null,trustStore=null]
   [junit4]   2> 1413801 WARN  (closeThreadPool-9129-thread-3) [    ] o.e.j.u.s.S.config No Client EndPointIdentificationAlgorithm configured for SslContextFactory@1e13b548[provider=null,keyStore=null,trustStore=null]
   [junit4]   2> 1413801 INFO  (closeThreadPool-9129-thread-3) [    ] o.a.s.c.ZkContainer Zookeeper client=127.0.0.1:36349/solr
   [junit4]   2> 1413802 INFO  (closeThreadPool-9129-thread-3) [    ] o.a.s.c.c.ConnectionManager Waiting for client to connect to ZooKeeper
   [junit4]   2> 1413802 INFO  (zkConnectionManagerCallback-9179-thread-1) [    ] o.a.s.c.c.ConnectionManager zkClient has connected
   [junit4]   2> 1413802 INFO  (closeThreadPool-9129-thread-3) [    ] o.a.s.c.c.ConnectionManager Client is connected to ZooKeeper
   [junit4]   2> 1413803 INFO  (closeThreadPool-9129-thread-3) [n:127.0.0.1:35309__fy%2Fse    ] o.a.s.c.c.ConnectionManager Waiting for client to connect to ZooKeeper
   [junit4]   2> 1413803 INFO  (zkConnectionManagerCallback-9181-thread-1) [    ] o.a.s.c.c.ConnectionManager zkClient has connected
   [junit4]   2> 1413803 INFO  (closeThreadPool-9129-thread-3) [n:127.0.0.1:35309__fy%2Fse    ] o.a.s.c.c.ConnectionManager Client is connected to ZooKeeper
   [junit4]   2> 1413805 INFO  (closeThreadPool-9129-thread-3) [n:127.0.0.1:35309__fy%2Fse    ] o.a.s.c.c.ZkStateReader Updated live nodes from ZooKeeper... (0) -> (3)
   [junit4]   2> 1413808 INFO  (closeThreadPool-9129-thread-3) [n:127.0.0.1:35309__fy%2Fse    ] o.a.s.c.ZkController Publish node=127.0.0.1:35309__fy%2Fse as DOWN
   [junit4]   2> 1413808 INFO  (closeThreadPool-9129-thread-3) [n:127.0.0.1:35309__fy%2Fse    ] o.a.s.c.TransientSolrCoreCacheDefault Allocating transient cache for 4 transient cores
   [junit4]   2> 1413808 INFO  (closeThreadPool-9129-thread-3) [n:127.0.0.1:35309__fy%2Fse    ] o.a.s.c.ZkController Register node as live in ZooKeeper:/live_nodes/127.0.0.1:35309__fy%2Fse
   [junit4]   2> 1413809 INFO  (zkCallback-9142-thread-1) [    ] o.a.s.c.c.ZkStateReader Updated live nodes from ZooKeeper... (3) -> (4)
   [junit4]   2> 1413809 INFO  (zkCallback-9115-thread-1) [    ] o.a.s.c.c.ZkStateReader Updated live nodes from ZooKeeper... (3) -> (4)
   [junit4]   2> 1413809 INFO  (zkCallback-9127-thread-1) [    ] o.a.s.c.c.ZkStateReader Updated live nodes from ZooKeeper... (3) -> (4)
   [junit4]   2> 1413809 INFO  (zkCallback-9158-thread-1) [    ] o.a.s.c.c.ZkStateReader Updated live nodes from ZooKeeper... (3) -> (4)
   [junit4]   2> 1413809 INFO  (zkCallback-9108-thread-3) [    ] o.a.s.c.c.ZkStateReader Updated live nodes from ZooKeeper... (3) -> (4)
   [junit4]   2> 1413809 INFO  (zkCallback-9149-thread-1) [    ] o.a.s.c.c.ZkStateReader Updated live nodes from ZooKeeper... (3) -> (4)
   [junit4]   2> 1413812 INFO  (zkCallback-9165-thread-1) [    ] o.a.s.c.c.ZkStateReader Updated live nodes from ZooKeeper... (3) -> (4)
   [junit4]   2> 1413813 INFO  (zkCallback-9180-thread-1) [    ] o.a.s.c.c.ZkStateReader Updated live nodes from ZooKeeper... (3) -> (4)
   [junit4]   2> 1413813 INFO  (closeThreadPool-9129-thread-3) [n:127.0.0.1:35309__fy%2Fse    ] o.a.s.c.c.ConnectionManager Waiting for client to connect to ZooKeeper
   [junit4]   2> 1413813 INFO  (zkConnectionManagerCallback-9188-thread-1) [    ] o.a.s.c.c.ConnectionManager zkClient has connected
   [junit4]   2> 1413813 INFO  (closeThreadPool-9129-thread-3) [n:127.0.0.1:35309__fy%2Fse    ] o.a.s.c.c.ConnectionManager Client is connected to ZooKeeper
   [junit4]   2> 1413814 INFO  (closeThreadPool-9129-thread-3) [n:127.0.0.1:35309__fy%2Fse    ] o.a.s.c.c.ZkStateReader Updated live nodes from ZooKeeper... (0) -> (4)
   [junit4]   2> 1413814 INFO  (closeThreadPool-9129-thread-3) [n:127.0.0.1:35309__fy%2Fse    ] o.a.s.c.s.i.ZkClientClusterStateProvider Cluster at 127.0.0.1:36349/solr ready
   [junit4]   2> 1413828 INFO  (closeThreadPool-9129-thread-3) [n:127.0.0.1:35309__fy%2Fse    ] o.a.s.h.a.MetricsHistoryHandler No .system collection, keeping metrics history in memory.
   [junit4]   2> 1413845 INFO  (closeThreadPool-9129-thread-3) [n:127.0.0.1:35309__fy%2Fse    ] o.a.s.m.r.SolrJmxReporter JMX monitoring for 'solr.node' (registry 'solr.node') enabled at server: com.sun.jmx.mbeanserver.JmxMBeanServer@20641fb9
   [junit4]   2> 1413855 INFO  (closeThreadPool-9129-thread-3) [n:127.0.0.1:35309__fy%2Fse    ] o.a.s.m.r.SolrJmxReporter JMX monitoring for 'solr.jvm' (registry 'solr.jvm') enabled at server: com.sun.jmx.mbeanserver.JmxMBeanServer@20641fb9
   [junit4]   2> 1413855 INFO  (closeThreadPool-9129-thread-3) [n:127.0.0.1:35309__fy%2Fse    ] o.a.s.m.r.SolrJmxReporter JMX monitoring for 'solr.jetty' (registry 'solr.jetty') enabled at server: com.sun.jmx.mbeanserver.JmxMBeanServer@20641fb9
   [junit4]   2> 1413857 INFO  (closeThreadPool-9129-thread-3) [n:127.0.0.1:35309__fy%2Fse    ] o.a.s.c.CorePropertiesLocator Found 0 core definitions underneath /home/jenkins/workspace/Lucene-Solr-8.x-Linux/solr/build/solr-core/test/J1/temp/solr.cloud.NestedShardedAtomicUpdateTest_18047704CDCF82AD-001/shard-3-001/cores
   [junit4]   2> 1413873 INFO  (closeThreadPool-9129-thread-1) [    ] o.a.s.h.c.HttpShardHandlerFactory Host whitelist initialized: WhitelistHostChecker [whitelistHosts=null, whitelistHostCheckingEnabled=false]
   [junit4]   2> 1413873 WARN  (closeThreadPool-9129-thread-1) [    ] o.e.j.u.s.S.config No Client EndPointIdentificationAlgorithm configured for SslContextFactory@5440b283[provider=null,keyStore=null,trustStore=null]
   [junit4]   2> 1413876 WARN  (closeThreadPool-9129-thread-1) [    ] o.e.j.u.s.S.config No Client EndPointIdentificationAlgorithm configured for SslContextFactory@52d7bcec[provider=null,keyStore=null,trustStore=null]
   [junit4]   2> 1413877 INFO  (closeThreadPool-9129-thread-1) [    ] o.a.s.c.ZkContainer Zookeeper client=127.0.0.1:36349/solr
   [junit4]   2> 1413877 INFO  (closeThreadPool-9129-thread-1) [    ] o.a.s.c.c.ConnectionManager Waiting for client to connect to ZooKeeper
   [junit4]   2> 1413877 INFO  (zkConnectionManagerCallback-9195-thread-1) [    ] o.a.s.c.c.ConnectionManager zkClient has connected
   [junit4]   2> 1413877 INFO  (closeThreadPool-9129-thread-1) [    ] o.a.s.c.c.ConnectionManager Client is connected to ZooKeeper
   [junit4]   2> 1413878 INFO  (closeThreadPool-9129-thread-1) [    ] o.a.s.c.c.ConnectionManager Waiting for client to connect to ZooKeeper
   [junit4]   2> 1413879 INFO  (zkConnectionManagerCallback-9197-thread-1) [    ] o.a.s.c.c.ConnectionManager zkClient has connected
   [junit4]   2> 1413879 INFO  (closeThreadPool-9129-thread-1) [    ] o.a.s.c.c.ConnectionManager Client is connected to ZooKeeper
   [junit4]   2> 1413880 INFO  (closeThreadPool-9129-thread-1) [    ] o.a.s.c.c.ZkStateReader Updated live nodes from ZooKeeper... (0) -> (4)
   [junit4]   2> 1413882 INFO  (closeThreadPool-9129-thread-1) [    ] o.a.s.c.ZkController Publish node=127.0.0.1:44147__fy%2Fse as DOWN
   [junit4]   2> 1413882 INFO  (closeThreadPool-9129-thread-1) [    ] o.a.s.c.TransientSolrCoreCacheDefault Allocating transient cache for 4 transient cores
   [junit4]   2> 1413882 INFO  (closeThreadPool-9129-thread-1) [    ] o.a.s.c.ZkController Register node as live in ZooKeeper:/live_nodes/127.0.0.1:44147__fy%2Fse
   [junit4]   2> 1413883 INFO  (zkCallback-9165-thread-1) [    ] o.a.s.c.c.ZkStateReader Updated live nodes from ZooKeeper... (4) -> (5)
   [junit4]   2> 1413883 INFO  (zkCallback-9158-thread-1) [    ] o.a.s.c.c.ZkStateReader Updated live nodes from ZooKeeper... (4) -> (5)
   [junit4]   2> 1413883 INFO  (zkCallback-9115-thread-1) [    ] o.a.s.c.c.ZkStateReader Updated live nodes from ZooKeeper... (4) -> (5)
   [junit4]   2> 1413883 INFO  (zkCallback-9149-thread-1) [    ] o.a.s.c.c.ZkStateReader Updated live nodes from ZooKeeper... (4) -> (5)
   [junit4]   2> 1413883 INFO  (zkCallback-9127-thread-1) [    ] o.a.s.c.c.ZkStateReader Updated live nodes from ZooKeeper... (4) -> (5)
   [junit4]   2> 1413883 INFO  (zkCallback-9142-thread-1) [    ] o.a.s.c.c.ZkStateReader Updated live nodes from ZooKeeper... (4) -> (5)
   [junit4]   2> 1413883 INFO  (zkCallback-9180-thread-1) [    ] o.a.s.c.c.ZkStateReader Updated live nodes from ZooKeeper... (4) -> (5)
   [junit4]   2> 1413883 INFO  (zkCallback-9187-thread-1) [    ] o.a.s.c.c.ZkStateReader Updated live nodes from ZooKeeper... (4) -> (5)
   [junit4]   2> 1413883 INFO  (zkCallback-9108-thread-3) [    ] o.a.s.c.c.ZkStateReader Updated live nodes from ZooKeeper... (4) -> (5)
   [junit4]   2> 1413896 INFO  (closeThreadPool-9129-thread-1) [    ] o.a.s.c.c.ConnectionManager Waiting for client to connect to ZooKeeper
   [junit4]   2> 1413896 INFO  (zkCallback-9196-thread-1) [    ] o.a.s.c.c.ZkStateReader Updated live nodes from ZooKeeper... (4) -> (5)
   [junit4]   2> 1413897 INFO  (zkConnectionManagerCallback-9204-thread-1) [    ] o.a.s.c.c.ConnectionManager zkClient has connected
   [junit4]   2> 1413897 INFO  (closeThreadPool-9129-thread-1) [    ] o.a.s.c.c.ConnectionManager Client is connected to ZooKeeper
   [junit4]   2> 1413897 INFO  (closeThreadPool-9129-thread-1) [    ] o.a.s.c.c.ZkStateReader Updated live nodes from ZooKeeper... (0) -> (5)
   [junit4]   2> 1413898 INFO  (closeThreadPool-9129-thread-1) [    ] o.a.s.c.s.i.ZkClientClusterStateProvider Cluster at 127.0.0.1:36349/solr ready
   [junit4]   2> 1413906 INFO  (closeThreadPool-9129-thread-1) [    ] o.a.s.h.a.MetricsHistoryHandler No .system collection, keeping metrics history in memory.
   [junit4]   2> 1413916 INFO  (closeThreadPool-9129-thread-1) [    ] o.a.s.m.r.SolrJmxReporter JMX monitoring for 'solr.node' (registry 'solr.node') enabled at server: com.sun.jmx.mbeanserver.JmxMBeanServer@20641fb9
   [junit4]   2> 1413922 INFO  (closeThreadPool-9129-thread-1) [    ] o.a.s.m.r.SolrJmxReporter JMX monitoring for 'solr.jvm' (registry 'solr.jvm') enabled at server: com.sun.jmx.mbeanserver.JmxMBeanServer@20641fb9
   [junit4]   2> 1413922 INFO  (closeThreadPool-9129-thread-1) [    ] o.a.s.m.r.SolrJmxReporter JMX monitoring for 'solr.jetty' (registry 'solr.jetty') enabled at server: com.sun.jmx.mbeanserver.JmxMBeanServer@20641fb9
   [junit4]   2> 1413923 INFO  (closeThreadPool-9129-thread-1) [    ] o.a.s.c.CorePropertiesLocator Found 0 core definitions underneath /home/jenkins/workspace/Lucene-Solr-8.x-Linux/solr/build/solr-core/test/J1/temp/solr.cloud.NestedShardedAtomicUpdateTest_18047704CDCF82AD-001/shard-4-001/cores
   [junit4]   2> 1413953 INFO  (qtp466304847-23924) [n:127.0.0.1:34901__fy%2Fse    ] o.a.s.h.a.CollectionsHandler Invoked Collection Action :addreplica with params node=127.0.0.1:44037__fy%252Fse&action=ADDREPLICA&collection=collection1&shard=shard3&type=NRT&wt=javabin&version=2 and sendToOCPQueue=true
   [junit4]   2> 1413954 INFO  (qtp466304847-23925) [n:127.0.0.1:34901__fy%2Fse    ] o.a.s.h.a.CollectionsHandler Invoked Collection Action :addreplica with params node=127.0.0.1:44147__fy%252Fse&action=ADDREPLICA&collection=collection1&shard=shard1&type=NRT&wt=javabin&version=2 and sendToOCPQueue=true
   [junit4]   2> 1413954 INFO  (qtp466304847-24120) [n:127.0.0.1:34901__fy%2Fse    ] o.a.s.h.a.CollectionsHandler Invoked Collection Action :addreplica with params node=127.0.0.1:45697__fy%252Fse&action=ADDREPLICA&collection=collection1&shard=shard2&type=NRT&wt=javabin&version=2 and sendToOCPQueue=true
   [junit4]   2> 1413954 INFO  (qtp466304847-23926) [n:127.0.0.1:34901__fy%2Fse    ] o.a.s.h.a.CollectionsHandler Invoked Collection Action :addreplica with params node=127.0.0.1:35309__fy%252Fse&action=ADDREPLICA&collection=collection1&shard=shard4&type=NRT&wt=javabin&version=2 and sendToOCPQueue=true
   [junit4]   2> 1413955 INFO  (OverseerCollectionConfigSetProcessor-72365864093745156-127.0.0.1:34901__fy%2Fse-n_0000000000) [n:127.0.0.1:34901__fy%2Fse    ] o.a.s.c.OverseerTaskQueue Response ZK path: /overseer/collection-queue-work/qnr-0000000002 doesn't exist.  Requestor may have disconnected from ZooKeeper
   [junit4]   2> 1413955 INFO  (OverseerThreadFactory-8297-thread-3-processing-n:127.0.0.1:34901__fy%2Fse) [n:127.0.0.1:34901__fy%2Fse c:collection1 s:shard3  ] o.a.s.c.a.c.AddReplicaCmd Node Identified 127.0.0.1:44037__fy%2Fse for creating new replica of shard shard3 for collection collection1
   [junit4]   2> 1413955 INFO  (OverseerThreadFactory-8297-thread-3-processing-n:127.0.0.1:34901__fy%2Fse) [n:127.0.0.1:34901__fy%2Fse c:collection1 s:shard3  ] o.a.s.c.a.c.AddReplicaCmd Returning CreateReplica command.
   [junit4]   2> 1413956 INFO  (OverseerThreadFactory-8297-thread-4-processing-n:127.0.0.1:34901__fy%2Fse) [n:127.0.0.1:34901__fy%2Fse c:collection1 s:shard1  ] o.a.s.c.a.c.AddReplicaCmd Node Identified 127.0.0.1:44147__fy%2Fse for creating new replica of shard shard1 for collection collection1
   [junit4]   2> 1413956 INFO  (OverseerThreadFactory-8297-thread-2-processing-n:127.0.0.1:34901__fy%2Fse) [n:127.0.0.1:34901__fy%2Fse c:collection1 s:shard4  ] o.a.s.c.a.c.AddReplicaCmd Node Identified 127.0.0.1:35309__fy%2Fse for creating new replica of shard shard4 for collection collection1
   [junit4]   2> 1413956 INFO  (OverseerThreadFactory-8297-thread-5-processing-n:127.0.0.1:34901__fy%2Fse) [n:127.0.0.1:34901__fy%2Fse c:collection1 s:shard2  ] o.a.s.c.a.c.AddReplicaCmd Node Identified 127.0.0.1:45697__fy%2Fse for creating new replica of shard shard2 for collection collection1
   [junit4]   2> 1413959 INFO  (OverseerThreadFactory-8297-thread-4-processing-n:127.0.0.1:34901__fy%2Fse) [n:127.0.0.1:34901__fy%2Fse c:collection1 s:shard1  ] o.a.s.c.a.c.AddReplicaCmd Returning CreateReplica command.
   [junit4]   2> 1413959 INFO  (OverseerThreadFactory-8297-thread-5-processing-n:127.0.0.1:34901__fy%2Fse) [n:127.0.0.1:34901__fy%2Fse c:collection1 s:shard2  ] o.a.s.c.a.c.AddReplicaCmd Returning CreateReplica command.
   [junit4]   2> 1413959 INFO  (OverseerThreadFactory-8297-thread-2-processing-n:127.0.0.1:34901__fy%2Fse) [n:127.0.0.1:34901__fy%2Fse c:collection1 s:shard4  ] o.a.s.c.a.c.AddReplicaCmd Returning CreateReplica command.
   [junit4]   2> 1413961 INFO  (qtp1744303976-24001) [n:127.0.0.1:44037__fy%2Fse    x:collection1_shard3_replica_n1] o.a.s.h.a.CoreAdminOperation core create command qt=/admin/cores&collection.configName=conf1&name=collection1_shard3_replica_n1&action=CREATE&collection=collection1&shard=shard3&wt=javabin&version=2&replicaType=NRT
   [junit4]   2> 1413964 INFO  (qtp1155205384-24042) [n:127.0.0.1:35309__fy%2Fse    x:collection1_shard4_replica_n4] o.a.s.h.a.CoreAdminOperation core create command qt=/admin/cores&collection.configName=conf1&name=collection1_shard4_replica_n4&action=CREATE&collection=collection1&shard=shard4&wt=javabin&version=2&replicaType=NRT
   [junit4]   2> 1413964 INFO  (qtp1472072586-24065) [n:127.0.0.1:44147__fy%2Fse    x:collection1_shard1_replica_n2] o.a.s.h.a.CoreAdminOperation core create command qt=/admin/cores&collection.configName=conf1&name=collection1_shard1_replica_n2&action=CREATE&collection=collection1&shard=shard1&wt=javabin&version=2&replicaType=NRT
   [junit4]   2> 1413964 INFO  (qtp1501111088-23988) [n:127.0.0.1:45697__fy%2Fse    x:collection1_shard2_replica_n3] o.a.s.h.a.CoreAdminOperation core create command qt=/admin/cores&collection.configName=conf1&name=collection1_shard2_replica_n3&action=CREATE&collection=collection1&shard=shard2&wt=javabin&version=2&replicaType=NRT
   [junit4]   2> 1415200 INFO  (qtp1744303976-24001) [n:127.0.0.1:44037__fy%2Fse c:collection1 s:shard3  x:collection1_shard3_replica_n1] o.a.s.c.SolrConfig Using Lucene MatchVersion: 8.2.0
   [junit4]   2> 1415200 INFO  (qtp1501111088-23988) [n:127.0.0.1:45697__fy%2Fse c:collection1 s:shard2  x:collection1_shard2_replica_n3] o.a.s.c.SolrConfig Using Lucene MatchVersion: 8.2.0
   [junit4]   2> 1415200 INFO  (qtp1155205384-24042) [n:127.0.0.1:35309__fy%2Fse c:collection1 s:shard4  x:collection1_shard4_replica_n4] o.a.s.c.SolrConfig Using Lucene MatchVersion: 8.2.0
   [junit4]   2> 1415224 INFO  (qtp1472072586-24065) [n:127.0.0.1:44147__fy%2Fse c:collection1 s:shard1  x:collection1_shard1_replica_n2] o.a.s.c.SolrConfig Using Lucene MatchVersion: 8.2.0
   [junit4]   2> 1415231 INFO  (qtp1744303976-24001) [n:127.0.0.1:44037__fy%2Fse c:collection1 s:shard3  x:collection1_shard3_replica_n1] o.a.s.s.IndexSchema [collection1_shard3_replica_n1] Schema name=nested-docs
   [junit4]   2> 1415231 INFO  (qtp1155205384-24042) [n:127.0.0.1:35309__fy%2Fse c:collection1 s:shard4  x:collection1_shard4_replica_n4] o.a.s.s.IndexSchema [collection1_shard4_replica_n4] Schema name=nested-docs
   [junit4]   2> 1415231 INFO  (qtp1501111088-23988) [n:127.0.0.1:45697__fy%2Fse c:collection1 s:shard2  x:collection1_shard2_replica_n3] o.a.s.s.IndexSchema [collection1_shard2_replica_n3] Schema name=nested-docs
   [junit4]   2> 1415245 INFO  (qtp1744303976-24001) [n:127.0.0.1:44037__fy%2Fse c:collection1 s:shard3  x:collection1_shard3_replica_n1] o.a.s.s.IndexSchema Loaded schema nested-docs/1.6 with uniqueid field id
   [junit4]   2> 1415245 INFO  (qtp1744303976-24001) [n:127.0.0.1:44037__fy%2Fse c:collection1 s:shard3  x:collection1_shard3_replica_n1] o.a.s.c.CoreContainer Creating SolrCore 'collection1_shard3_replica_n1' using configuration from collection collection1, trusted=true
   [junit4]   2> 1415245 INFO  (qtp1501111088-23988) [n:127.0.0.1:45697__fy%2Fse c:collection1 s:shard2  x:collection1_shard2_replica_n3] o.a.s.s.IndexSchema Loaded schema nested-docs/1.6 with uniqueid field id
   [junit4]   2> 1415245 INFO  (qtp1501111088-23988) [n:127.0.0.1:45697__fy%2Fse c:collection1 s:shard2  x:collection1_shard2_replica_n3] o.a.s.c.CoreContainer Creating SolrCore 'collection1_shard2_replica_n3' using configuration from collection collection1, trusted=true
   [junit4]   2> 1415245 INFO  (qtp1155205384-24042) [n:127.0.0.1:35309__fy%2Fse c:collection1 s:shard4  x:collection1_shard4_replica_n4] o.a.s.s.IndexSchema Loaded schema nested-docs/1.6 with uniqueid field id
   [junit4]   2> 1415245 INFO  (qtp1155205384-24042) [n:127.0.0.1:35309__fy%2Fse c:collection1 s:shard4  x:collection1_shard4_replica_n4] o.a.s.c.CoreContainer Creating SolrCore 'collection1_shard4_replica_n4' using configuration from collection collection1, trust

[...truncated too long message...]

t4]   2> 1454745 INFO  (jetty-closer-12411-thread-1) [    ] o.a.s.m.SolrMetricManager Closing metric reporters for registry=solr.jetty, tag=null
   [junit4]   2> 1454745 INFO  (jetty-closer-12411-thread-1) [    ] o.a.s.m.r.SolrJmxReporter Closing reporter [org.apache.solr.metrics.reporters.SolrJmxReporter@1a1fc435: rootName = solr_37231, domain = solr.jetty, service url = null, agent id = null] for registry solr.jetty / com.codahale.metrics.MetricRegistry@5694e2ca
   [junit4]   2> 1454745 INFO  (jetty-closer-12411-thread-1) [    ] o.a.s.m.SolrMetricManager Closing metric reporters for registry=solr.cluster, tag=null
   [junit4]   2> 1454746 INFO  (closeThreadPool-12415-thread-1) [    ] o.a.s.c.Overseer Overseer (id=72365866563207174-127.0.0.1:37231_solr-n_0000000001) closing
   [junit4]   2> 1454746 INFO  (OverseerAutoScalingTriggerThread-72365866563207174-127.0.0.1:37231_solr-n_0000000001) [    ] o.a.s.c.a.OverseerTriggerThread OverseerTriggerThread woken up but we are closed, exiting.
   [junit4]   2> 1454746 INFO  (OverseerStateUpdate-72365866563207174-127.0.0.1:37231_solr-n_0000000001) [n:127.0.0.1:37231_solr    ] o.a.s.c.Overseer Overseer Loop exiting : 127.0.0.1:37231_solr
   [junit4]   2> 1454750 WARN  (NIOServerCxn.Factory:0.0.0.0/0.0.0.0:0) [    ] o.a.z.s.NIOServerCnxn Unable to read additional data from client sessionid 0x101185f4a5d000a, likely client has closed socket
   [junit4]   2> 1454754 INFO  (jetty-closer-12411-thread-1) [    ] o.a.s.c.Overseer Overseer (id=72365866563207174-127.0.0.1:37231_solr-n_0000000001) closing
   [junit4]   2> 1454754 INFO  (closeThreadPool-12415-thread-2) [    ] o.a.s.c.Overseer Overseer (id=72365866563207174-127.0.0.1:37231_solr-n_0000000001) closing
   [junit4]   2> 1454755 INFO  (jetty-closer-12411-thread-1) [    ] o.e.j.s.AbstractConnector Stopped ServerConnector@141e35a0{HTTP/1.1,[http/1.1, h2c]}{127.0.0.1:0}
   [junit4]   2> 1454755 INFO  (jetty-closer-12411-thread-1) [    ] o.e.j.s.h.ContextHandler Stopped o.e.j.s.ServletContextHandler@2fed185e{/solr,null,UNAVAILABLE}
   [junit4]   2> 1454755 INFO  (jetty-closer-12411-thread-1) [    ] o.e.j.s.session node0 Stopped scavenging
   [junit4]   2> 1454755 INFO  (SUITE-TestCloudRecovery2-seed#[18047704CDCF82AD]-worker) [    ] o.a.s.c.ZkTestServer Shutting down ZkTestServer.
   [junit4]   2> 1454756 WARN  (ZkTestServer Run Thread) [    ] o.a.s.c.ZkTestServer Watch limit violations: 
   [junit4]   2> Maximum concurrent create/delete watches above limit:
   [junit4]   2> 
   [junit4]   2> 	6	/solr/collections/collection1/terms/shard1
   [junit4]   2> 	5	/solr/aliases.json
   [junit4]   2> 	5	/solr/clusterprops.json
   [junit4]   2> 	2	/solr/security.json
   [junit4]   2> 	2	/solr/configs/config
   [junit4]   2> 
   [junit4]   2> Maximum concurrent data watches above limit:
   [junit4]   2> 
   [junit4]   2> 	11	/solr/collections/collection1/state.json
   [junit4]   2> 	5	/solr/clusterstate.json
   [junit4]   2> 	2	/solr/autoscaling.json
   [junit4]   2> 
   [junit4]   2> Maximum concurrent children watches above limit:
   [junit4]   2> 
   [junit4]   2> 	5	/solr/live_nodes
   [junit4]   2> 	5	/solr/collections
   [junit4]   2> 	2	/solr/overseer/queue
   [junit4]   2> 	2	/solr/autoscaling/events/.scheduled_maintenance
   [junit4]   2> 	2	/solr/autoscaling/events/.auto_add_replicas
   [junit4]   2> 	2	/solr/overseer/collection-queue-work
   [junit4]   2> 	2	/solr/overseer/queue-work
   [junit4]   2> 
   [junit4]   2> 1454757 INFO  (SUITE-TestCloudRecovery2-seed#[18047704CDCF82AD]-worker) [    ] o.a.s.c.ZkTestServer parse host and port list: 127.0.0.1:37359
   [junit4]   2> 1454757 INFO  (SUITE-TestCloudRecovery2-seed#[18047704CDCF82AD]-worker) [    ] o.a.s.c.ZkTestServer connecting to 127.0.0.1 37359
   [junit4]   2> NOTE: leaving temporary files on disk at: /home/jenkins/workspace/Lucene-Solr-8.x-Linux/solr/build/solr-core/test/J2/temp/solr.cloud.TestCloudRecovery2_18047704CDCF82AD-001
   [junit4]   2> Jun 04, 2019 12:35:36 AM com.carrotsearch.randomizedtesting.ThreadLeakControl checkThreadLeaks
   [junit4]   2> WARNING: Will linger awaiting termination of 6 leaked thread(s).
   [junit4]   2> NOTE: test params are: codec=CheapBastard, sim=Asserting(org.apache.lucene.search.similarities.AssertingSimilarity@224f8c3a), locale=ln-AO, timezone=America/Tegucigalpa
   [junit4]   2> NOTE: Linux 4.18.0-17-generic amd64/Oracle Corporation 13-ea (64-bit)/cpus=8,threads=1,free=122133344,total=518979584
   [junit4]   2> NOTE: All tests run in this JVM: [PhrasesIdentificationComponentTest, LeaderElectionTest, MetricUtilsTest, RegexBoostProcessorTest, OverseerTest, DistributedIntervalFacetingTest, TestRangeQuery, TestPointFields, NodeLostTriggerTest, TemplateUpdateProcessorTest, ClusterStateUpdateTest, DistributedQueryComponentCustomSortTest, RestartWhileUpdatingTest, TestDelegationWithHadoopAuth, DirectoryFactoryTest, TimeZoneUtilsTest, BadIndexSchemaTest, FastVectorHighlighterTest, CloudMLTQParserTest, TestBadConfig, TestTolerantUpdateProcessorCloud, TestCoreBackup, CheckHdfsIndexTest, TestFaceting, OutputWriterTest, TestCloudManagedSchema, SolrShardReporterTest, ConvertedLegacyTest, DistributedSpellCheckComponentTest, SignatureUpdateProcessorFactoryTest, TestSolrXml, TestCustomDocTransformer, DeleteReplicaTest, AuditLoggerPluginTest, CoreAdminCreateDiscoverTest, TestSubQueryTransformer, CdcrUpdateLogTest, ShowFileRequestHandlerTest, TestCollectionsAPIViaSolrCloudCluster, TestDynamicFieldResource, ZkNodePropsTest, IndexSchemaRuntimeFieldTest, TestFieldSortValues, TestCorePropertiesReload, TestFastOutputStream, TestRandomRequestDistribution, TestStressReorder, CollectionsAPISolrJTest, CurrencyRangeFacetCloudTest, PeerSyncWithLeaderTest, ChaosMonkeySafeLeaderTest, AssignTest, HighlighterTest, SplitShardTest, ForceLeaderTest, TestQuerySenderListener, ReplaceNodeNoTargetTest, HealthCheckHandlerTest, SolrCoreMetricManagerTest, DistributedFacetPivotSmallTest, SynonymTokenizerTest, TestSuggestSpellingConverter, V2ApiIntegrationTest, MBeansHandlerTest, TestPKIAuthenticationPlugin, CustomHighlightComponentTest, TestLRUCache, ClassificationUpdateProcessorIntegrationTest, PeerSyncWithBufferUpdatesTest, TestXmlQParser, BitVectorTest, SearchRateTriggerIntegrationTest, TriLevelCompositeIdRoutingTest, TestStreamBody, TriggerIntegrationTest, TestLegacyNumericUtils, DOMUtilTest, AutoAddReplicasPlanActionTest, TestDynamicLoading, IndexSizeTriggerTest, TestComponentsName, TestSerializedLuceneMatchVersion, TestJoin, RequestLoggingTest, TestManagedResource, TestJsonFacetsStatsParsing, TestCloudPseudoReturnFields, TestLegacyBM25SimilarityFactory, TestLeaderElectionWithEmptyReplica, TestReversedWildcardFilterFactory, TestBulkSchemaAPI, SolrIndexSplitterTest, MergeStrategyTest, DocValuesTest, TestSolrCloudWithKerberosAlt, MissingSegmentRecoveryTest, TestNestedUpdateProcessor, InfoHandlerTest, DocumentBuilderTest, SolrRequestParserTest, HdfsWriteToMultipleCollectionsTest, CdcrOpsAndBoundariesTest, TestRecovery, OverseerRolesTest, TestLuceneIndexBackCompat, PolyFieldTest, ActionThrottleTest, TestFieldCache, PropertiesRequestHandlerTest, TestSurroundQueryParser, TestSystemIdResolver, TestNumericRangeQuery32, UUIDFieldTest, DistributedFacetPivotLargeTest, ResponseLogComponentTest, TestConfigSetsAPIExclusivity, TestExpandComponent, TestApiFramework, TestNoOpRegenerator, DistribCursorPagingTest, AtomicUpdatesTest, TestMacroExpander, DateRangeFieldTest, TestSizeLimitedDistributedMap, TestAuthenticationFramework, TestDefaultStatsCache, DefaultValueUpdateProcessorTest, TestReloadDeadlock, TestLazyCores, RecoveryZkTest, TestSolrConfigHandlerCloud, TestPartialUpdateDeduplication, TestUninvertingReader, TestFieldCacheSortRandom, TestPullReplica, ExecutePlanActionTest, TestMiniSolrCloudClusterSSL, NestedAtomicUpdateTest, TestCollapseQParserPlugin, BaseCdcrDistributedZkTest, TestJavabinTupleStreamParser, DistribDocExpirationUpdateProcessorTest, HttpPartitionWithTlogReplicasTest, LeaderTragicEventTest, LeaderVoteWaitTimeoutTest, NodeMutatorTest, OutOfBoxZkACLAndCredentialsProvidersTest, OverriddenZkACLAndCredentialsProvidersTest, RoutingToNodesWithPropertiesTest, SSLMigrationTest, SaslZkACLProviderTest, ShardRoutingCustomTest, ShardRoutingTest, TestCloudDeleteByQuery, TestCloudRecovery2]
   [junit4] Completed [498/858 (2!)] on J2 in 6.76s, 1 test, 1 error <<< FAILURES!

[...truncated 44438 lines...]
[repro] Jenkins log URL: https://jenkins.thetaphi.de/job/Lucene-Solr-8.x-Linux/659/consoleText

[repro] Revision: 96f000334ccacc211a6a277cfa7d283c4f80823c

[repro] Ant options: "-Dargs=-XX:-UseCompressedOops -XX:+UseSerialGC"
[repro] Repro line:  ant test  -Dtestcase=NestedShardedAtomicUpdateTest -Dtests.method=test -Dtests.seed=18047704CDCF82AD -Dtests.multiplier=3 -Dtests.slow=true -Dtests.locale=hi-IN -Dtests.timezone=Africa/Freetown -Dtests.asserts=true -Dtests.file.encoding=UTF-8

[repro] Repro line:  ant test  -Dtestcase=TestCloudRecovery2 -Dtests.method=test -Dtests.seed=18047704CDCF82AD -Dtests.multiplier=3 -Dtests.slow=true -Dtests.locale=ln-AO -Dtests.timezone=America/Tegucigalpa -Dtests.asserts=true -Dtests.file.encoding=UTF-8

[repro] ant clean

[...truncated 6 lines...]
[repro] Test suites by module:
[repro]    solr/core
[repro]       TestCloudRecovery2
[repro]       NestedShardedAtomicUpdateTest
[repro] ant compile-test

[...truncated 3582 lines...]
[repro] ant test-nocompile -Dtests.dups=5 -Dtests.maxfailures=10 -Dtests.class="*.TestCloudRecovery2|*.NestedShardedAtomicUpdateTest" -Dtests.showOutput=onerror "-Dargs=-XX:-UseCompressedOops -XX:+UseSerialGC" -Dtests.seed=18047704CDCF82AD -Dtests.multiplier=3 -Dtests.slow=true -Dtests.locale=ln-AO -Dtests.timezone=America/Tegucigalpa -Dtests.asserts=true -Dtests.file.encoding=UTF-8

[...truncated 95 lines...]
[repro] Failures:
[repro]   0/5 failed: org.apache.solr.cloud.NestedShardedAtomicUpdateTest
[repro]   0/5 failed: org.apache.solr.cloud.TestCloudRecovery2
[repro] Exiting with code 0

[...truncated 43 lines...]