You are viewing a plain text version of this content. The canonical link for it is here.
Posted to yarn-dev@hadoop.apache.org by Apache Jenkins Server <je...@builds.apache.org> on 2015/01/07 01:40:31 UTC

Failed: YARN-1529 PreCommit Build #6260

Jira: https://issues.apache.org/jira/browse/YARN-1529
Build: https://builds.apache.org/job/PreCommit-YARN-Build/6260/

###################################################################################
########################## LAST 60 LINES OF THE CONSOLE ###########################
[...truncated 23 lines...]

======================================================================
======================================================================
    Testing patch for YARN-1529.
======================================================================
======================================================================


HEAD is now at 788ee35 HDFS-7564. NFS gateway dynamically reload UID/GID mapping file /etc/nfs.map. Contributed by Yongjun Zhang
Previous HEAD position was 788ee35... HDFS-7564. NFS gateway dynamically reload UID/GID mapping file /etc/nfs.map. Contributed by Yongjun Zhang
Switched to branch 'trunk'
Your branch is behind 'origin/trunk' by 3 commits, and can be fast-forwarded.
  (use "git pull" to update your local branch)
First, rewinding head to replay your work on top of it...
Fast-forwarded trunk to 788ee35e2bf0f3d445e03e6ea9bd02c40c8fdfe3.
YARN-1529 patch is being downloaded at Wed Jan  7 00:40:26 UTC 2015 from
http://issues.apache.org/jira/secure/attachment/12621292/YARN-1529.v03.patch
cp: cannot stat '/home/jenkins/buildSupport/lib/*': No such file or directory
The patch does not appear to apply with p0 to p2
PATCH APPLICATION FAILED




{color:red}-1 overall{color}.  Here are the results of testing the latest attachment 
  http://issues.apache.org/jira/secure/attachment/12621292/YARN-1529.v03.patch
  against trunk revision 788ee35.

    {color:red}-1 patch{color}.  The patch command could not apply the patch.

Console output: https://builds.apache.org/job/PreCommit-YARN-Build/6260//console

This message is automatically generated.


======================================================================
======================================================================
    Adding comment to Jira.
======================================================================
======================================================================


Comment added.
619db32f64d323c39ecf7fc83bf6048c528bb21b logged out


======================================================================
======================================================================
    Finished build.
======================================================================
======================================================================


Build step 'Execute shell' marked build as failure
Archiving artifacts
[description-setter] Could not determine description.
Recording test results
Email was triggered for: Failure
Sending email for trigger: Failure



###################################################################################
############################## FAILED TESTS (if any) ##############################
No tests ran.

Failed: YARN-2996 PreCommit Build #6274

Posted by Apache Jenkins Server <je...@builds.apache.org>.
Jira: https://issues.apache.org/jira/browse/YARN-2996
Build: https://builds.apache.org/job/PreCommit-YARN-Build/6274/

###################################################################################
########################## LAST 60 LINES OF THE CONSOLE ###########################
[...truncated 3328 lines...]
  http://issues.apache.org/jira/secure/attachment/12690673/YARN-2996.004.patch
  against trunk revision ef237bd.

    {color:green}+1 @author{color}.  The patch does not contain any @author tags.

    {color:red}-1 tests included{color}.  The patch doesn't appear to include any new or modified tests.
                        Please justify why no new tests are needed for this patch.
                        Also please list what manual steps were performed to verify this patch.

    {color:green}+1 javac{color}.  The applied patch does not increase the total number of javac compiler warnings.

    {color:green}+1 javadoc{color}.  There were no new javadoc warning messages.

    {color:green}+1 eclipse:eclipse{color}.  The patch built with eclipse:eclipse.

    {color:green}+1 findbugs{color}.  The patch does not introduce any new Findbugs (version 2.0.3) warnings.

    {color:green}+1 release audit{color}.  The applied patch does not increase the total number of release audit warnings.

    {color:red}-1 core tests{color}.  The patch failed these unit tests in hadoop-yarn-project/hadoop-yarn/hadoop-yarn-server/hadoop-yarn-server-resourcemanager:

                  org.apache.hadoop.yarn.server.resourcemanager.applicationsmanager.TestAMRestart

Test results: https://builds.apache.org/job/PreCommit-YARN-Build/6274//testReport/
Console output: https://builds.apache.org/job/PreCommit-YARN-Build/6274//console

This message is automatically generated.


======================================================================
======================================================================
    Adding comment to Jira.
======================================================================
======================================================================


Comment added.
b8576e0cc14ab6fbe1abc5c227e26d794297b58f logged out


======================================================================
======================================================================
    Finished build.
======================================================================
======================================================================


Build step 'Execute shell' marked build as failure
Archiving artifacts
Sending artifact delta relative to PreCommit-YARN-Build #6051
Archived 15 artifacts
Archive block size is 32768
Received 127 blocks and 4702505 bytes
Compression is 46.9%
Took 1.2 sec
[description-setter] Could not determine description.
Recording test results
Email was triggered for: Failure
Sending email for trigger: Failure



###################################################################################
############################## FAILED TESTS (if any) ##############################
1 tests failed.
REGRESSION:  org.apache.hadoop.yarn.server.resourcemanager.applicationsmanager.TestAMRestart.testShouldNotCountFailureToMaxAttemptRetry

Error Message:
AppAttempt state is not correct (timedout) expected:<ALLOCATED> but was:<SCHEDULED>

Stack Trace:
java.lang.AssertionError: AppAttempt state is not correct (timedout) expected:<ALLOCATED> but was:<SCHEDULED>
	at org.junit.Assert.fail(Assert.java:88)
	at org.junit.Assert.failNotEquals(Assert.java:743)
	at org.junit.Assert.assertEquals(Assert.java:118)
	at org.apache.hadoop.yarn.server.resourcemanager.MockAM.waitForState(MockAM.java:86)
	at org.apache.hadoop.yarn.server.resourcemanager.MockRM.sendAMLaunched(MockRM.java:495)
	at org.apache.hadoop.yarn.server.resourcemanager.MockRM.launchAM(MockRM.java:660)
	at org.apache.hadoop.yarn.server.resourcemanager.MockRM.launchAndRegisterAM(MockRM.java:667)
	at org.apache.hadoop.yarn.server.resourcemanager.MockRM.waitForNewAMToLaunchAndRegister(MockRM.java:192)
	at org.apache.hadoop.yarn.server.resourcemanager.applicationsmanager.TestAMRestart.testShouldNotCountFailureToMaxAttemptRetry(TestAMRestart.java:392)



Failed: YARN-1743 PreCommit Build #6273

Posted by Apache Jenkins Server <je...@builds.apache.org>.
Jira: https://issues.apache.org/jira/browse/YARN-1743
Build: https://builds.apache.org/job/PreCommit-YARN-Build/6273/

###################################################################################
########################## LAST 60 LINES OF THE CONSOLE ###########################
[...truncated 26 lines...]
    Testing patch for YARN-1743.
======================================================================
======================================================================


HEAD is now at e13a484 YARN-3010. Fixed findbugs warning in AbstractYarnScheduler. Contributed by Yi Liu
Previous HEAD position was e13a484... YARN-3010. Fixed findbugs warning in AbstractYarnScheduler. Contributed by Yi Liu
Switched to branch 'trunk'
Your branch is behind 'origin/trunk' by 3 commits, and can be fast-forwarded.
  (use "git pull" to update your local branch)
First, rewinding head to replay your work on top of it...
Fast-forwarded trunk to e13a484a2be64fb781c5eca5ae7056cbe194ac5e.
YARN-1743 patch is being downloaded at Wed Jan  7 23:00:31 UTC 2015 from
http://issues.apache.org/jira/secure/attachment/12654900/NodeManager.pdf
cp: cannot stat '/home/jenkins/buildSupport/lib/*': No such file or directory
patch: **** Only garbage was found in the patch input.
patch: **** Only garbage was found in the patch input.
patch: **** Only garbage was found in the patch input.
The patch does not appear to apply with p0 to p2
PATCH APPLICATION FAILED




{color:red}-1 overall{color}.  Here are the results of testing the latest attachment 
  http://issues.apache.org/jira/secure/attachment/12654900/NodeManager.pdf
  against trunk revision e13a484.

    {color:red}-1 patch{color}.  The patch command could not apply the patch.

Console output: https://builds.apache.org/job/PreCommit-YARN-Build/6273//console

This message is automatically generated.


======================================================================
======================================================================
    Adding comment to Jira.
======================================================================
======================================================================


Comment added.
4d2e2c8ccea17b6049942637e7d6fa24de0dad6e logged out


======================================================================
======================================================================
    Finished build.
======================================================================
======================================================================


Build step 'Execute shell' marked build as failure
Archiving artifacts
[description-setter] Could not determine description.
Recording test results
Email was triggered for: Failure
Sending email for trigger: Failure



###################################################################################
############################## FAILED TESTS (if any) ##############################
No tests ran.

Failed: YARN-3009 PreCommit Build #6272

Posted by Apache Jenkins Server <je...@builds.apache.org>.
Jira: https://issues.apache.org/jira/browse/YARN-3009
Build: https://builds.apache.org/job/PreCommit-YARN-Build/6272/

###################################################################################
########################## LAST 60 LINES OF THE CONSOLE ###########################
[...truncated 3000 lines...]


/bin/grep: /home/jenkins/jenkins-slave/workspace/PreCommit-YARN-Build@2/../patchprocess/patch: No such file or directory
cat: /tmp/tmp.modules.7444: No such file or directory
rm: cannot remove '/tmp/tmp.modules.7444': No such file or directory




{color:red}-1 overall{color}.  Here are the results of testing the latest attachment 
  http://issues.apache.org/jira/secure/attachment/12690592/YARN-3009.20150108-1.patch
  against trunk revision fe8d2bd.

    {color:green}+1 @author{color}.  The patch does not contain any @author tags.

    {color:green}+1 tests included{color}.  The patch appears to include 1 new or modified test files.

    {color:green}+1 javac{color}.  The applied patch does not increase the total number of javac compiler warnings.

    {color:green}+1 javadoc{color}.  There were no new javadoc warning messages.

    {color:red}-1 eclipse:eclipse{color}.  The patch failed to build with eclipse:eclipse.

    {color:green}+1 findbugs{color}.  The patch does not introduce any new Findbugs (version 2.0.3) warnings.

    {color:green}+1 release audit{color}.  The applied patch does not increase the total number of release audit warnings.

    {color:green}+1 core tests{color}.  The patch passed unit tests in .

Test results: https://builds.apache.org/job/PreCommit-YARN-Build/6272//testReport/
Console output: https://builds.apache.org/job/PreCommit-YARN-Build/6272//console

This message is automatically generated.


======================================================================
======================================================================
    Adding comment to Jira.
======================================================================
======================================================================


Comment added.
0727af84edfca2c746e4ade9d54944f0e1bf368a logged out


======================================================================
======================================================================
    Finished build.
======================================================================
======================================================================


Build step 'Execute shell' marked build as failure
Archiving artifacts
[description-setter] Could not determine description.
Recording test results
Email was triggered for: Failure
Sending email for trigger: Failure



###################################################################################
############################## FAILED TESTS (if any) ##############################
No tests ran.

Failed: YARN-2933 PreCommit Build #6271

Posted by Apache Jenkins Server <je...@builds.apache.org>.
Jira: https://issues.apache.org/jira/browse/YARN-2933
Build: https://builds.apache.org/job/PreCommit-YARN-Build/6271/

###################################################################################
########################## LAST 60 LINES OF THE CONSOLE ###########################
[...truncated 3296 lines...]


{color:red}-1 overall{color}.  Here are the results of testing the latest attachment 
  http://issues.apache.org/jira/secure/attachment/12690579/YARN-2933-5.patch
  against trunk revision 788ee35.

    {color:green}+1 @author{color}.  The patch does not contain any @author tags.

    {color:green}+1 tests included{color}.  The patch appears to include 1 new or modified test files.

    {color:green}+1 javac{color}.  The applied patch does not increase the total number of javac compiler warnings.

    {color:green}+1 javadoc{color}.  There were no new javadoc warning messages.

    {color:green}+1 eclipse:eclipse{color}.  The patch built with eclipse:eclipse.

    {color:red}-1 findbugs{color}.  The patch appears to introduce 1 new Findbugs (version 2.0.3) warnings.

    {color:green}+1 release audit{color}.  The applied patch does not increase the total number of release audit warnings.

    {color:green}+1 core tests{color}.  The patch passed unit tests in hadoop-yarn-project/hadoop-yarn/hadoop-yarn-server/hadoop-yarn-server-resourcemanager.

Test results: https://builds.apache.org/job/PreCommit-YARN-Build/6271//testReport/
Findbugs warnings: https://builds.apache.org/job/PreCommit-YARN-Build/6271//artifact/patchprocess/newPatchFindbugsWarningshadoop-yarn-server-resourcemanager.html
Console output: https://builds.apache.org/job/PreCommit-YARN-Build/6271//console

This message is automatically generated.


======================================================================
======================================================================
    Adding comment to Jira.
======================================================================
======================================================================


Comment added.
c2c8fd6ea07c2f0523a543bb039613bfcca12e9b logged out


======================================================================
======================================================================
    Finished build.
======================================================================
======================================================================


Build step 'Execute shell' marked build as failure
Archiving artifacts
Sending artifact delta relative to PreCommit-YARN-Build #6051
Archived 15 artifacts
Archive block size is 32768
Received 1 blocks and 6629902 bytes
Compression is 0.5%
Took 1.4 sec
[description-setter] Could not determine description.
Recording test results
Email was triggered for: Failure
Sending email for trigger: Failure



###################################################################################
############################## FAILED TESTS (if any) ##############################
All tests passed

Failed: YARN-2637 PreCommit Build #6270

Posted by Apache Jenkins Server <je...@builds.apache.org>.
Jira: https://issues.apache.org/jira/browse/YARN-2637
Build: https://builds.apache.org/job/PreCommit-YARN-Build/6270/

###################################################################################
########################## LAST 60 LINES OF THE CONSOLE ###########################
[...truncated 3313 lines...]



{color:red}-1 overall{color}.  Here are the results of testing the latest attachment 
  http://issues.apache.org/jira/secure/attachment/12690582/YARN-2637.30.patch
  against trunk revision 788ee35.

    {color:green}+1 @author{color}.  The patch does not contain any @author tags.

    {color:green}+1 tests included{color}.  The patch appears to include 8 new or modified test files.

    {color:green}+1 javac{color}.  The applied patch does not increase the total number of javac compiler warnings.

    {color:green}+1 javadoc{color}.  There were no new javadoc warning messages.

    {color:green}+1 eclipse:eclipse{color}.  The patch built with eclipse:eclipse.

    {color:green}+1 findbugs{color}.  The patch does not introduce any new Findbugs (version 2.0.3) warnings.

    {color:green}+1 release audit{color}.  The applied patch does not increase the total number of release audit warnings.

    {color:green}+1 core tests{color}.  The patch passed unit tests in hadoop-yarn-project/hadoop-yarn/hadoop-yarn-server/hadoop-yarn-server-resourcemanager.

Test results: https://builds.apache.org/job/PreCommit-YARN-Build/6270//testReport/
Console output: https://builds.apache.org/job/PreCommit-YARN-Build/6270//console

This message is automatically generated.


======================================================================
======================================================================
    Adding comment to Jira.
======================================================================
======================================================================


Comment added.
607600c65746714d66257a3c4dbeff7b952a4eb0 logged out


======================================================================
======================================================================
    Finished build.
======================================================================
======================================================================


Build step 'Execute shell' marked build as failure
Archiving artifacts
Sending artifact delta relative to PreCommit-YARN-Build #6051
Archived 15 artifacts
Archive block size is 32768
Received 126 blocks and 4734687 bytes
Compression is 46.6%
Took 2.4 sec
[description-setter] Could not determine description.
Recording test results
Email was triggered for: Failure
Sending email for trigger: Failure



###################################################################################
############################## FAILED TESTS (if any) ##############################
All tests passed

Failed: YARN-160 PreCommit Build #6269

Posted by Apache Jenkins Server <je...@builds.apache.org>.
Jira: https://issues.apache.org/jira/browse/YARN-160
Build: https://builds.apache.org/job/PreCommit-YARN-Build/6269/

###################################################################################
########################## LAST 60 LINES OF THE CONSOLE ###########################
[...truncated 3694 lines...]


{color:red}-1 overall{color}.  Here are the results of testing the latest attachment 
  http://issues.apache.org/jira/secure/attachment/12690562/apache-yarn-160.3.patch
  against trunk revision 788ee35.

    {color:green}+1 @author{color}.  The patch does not contain any @author tags.

    {color:green}+1 tests included{color}.  The patch appears to include 4 new or modified test files.

    {color:green}+1 javac{color}.  The applied patch does not increase the total number of javac compiler warnings.

    {color:green}+1 javadoc{color}.  There were no new javadoc warning messages.

    {color:green}+1 eclipse:eclipse{color}.  The patch built with eclipse:eclipse.

    {color:red}-1 findbugs{color}.  The patch appears to introduce 29 new Findbugs (version 2.0.3) warnings.

    {color:green}+1 release audit{color}.  The applied patch does not increase the total number of release audit warnings.

    {color:green}+1 core tests{color}.  The patch passed unit tests in hadoop-tools/hadoop-gridmix hadoop-yarn-project/hadoop-yarn/hadoop-yarn-api hadoop-yarn-project/hadoop-yarn/hadoop-yarn-common hadoop-yarn-project/hadoop-yarn/hadoop-yarn-server/hadoop-yarn-server-nodemanager.

Test results: https://builds.apache.org/job/PreCommit-YARN-Build/6269//testReport/
Findbugs warnings: https://builds.apache.org/job/PreCommit-YARN-Build/6269//artifact/patchprocess/newPatchFindbugsWarningshadoop-gridmix.html
Console output: https://builds.apache.org/job/PreCommit-YARN-Build/6269//console

This message is automatically generated.


======================================================================
======================================================================
    Adding comment to Jira.
======================================================================
======================================================================


Comment added.
0f6f547394ae755316f6b3a5ff08a75f1fa19063 logged out


======================================================================
======================================================================
    Finished build.
======================================================================
======================================================================


Build step 'Execute shell' marked build as failure
Archiving artifacts
Sending artifact delta relative to PreCommit-YARN-Build #6051
Archived 30 artifacts
Archive block size is 32768
Received 39 blocks and 8362360 bytes
Compression is 13.3%
Took 2.3 sec
[description-setter] Could not determine description.
Recording test results
Email was triggered for: Failure
Sending email for trigger: Failure



###################################################################################
############################## FAILED TESTS (if any) ##############################
All tests passed

Failed: YARN-2807 PreCommit Build #6268

Posted by Apache Jenkins Server <je...@builds.apache.org>.
Jira: https://issues.apache.org/jira/browse/YARN-2807
Build: https://builds.apache.org/job/PreCommit-YARN-Build/6268/

###################################################################################
########################## LAST 60 LINES OF THE CONSOLE ###########################
[...truncated 4167 lines...]
{color:red}-1 overall{color}.  Here are the results of testing the latest attachment 
  http://issues.apache.org/jira/secure/attachment/12690558/YARN-2807.3.patch
  against trunk revision 788ee35.

    {color:green}+1 @author{color}.  The patch does not contain any @author tags.

    {color:green}+0 tests included{color}.  The patch appears to be a documentation patch that doesn't require tests.

    {color:green}+1 javac{color}.  The applied patch does not increase the total number of javac compiler warnings.

    {color:green}+1 javadoc{color}.  There were no new javadoc warning messages.

    {color:green}+1 eclipse:eclipse{color}.  The patch built with eclipse:eclipse.

    {color:green}+1 findbugs{color}.  The patch does not introduce any new Findbugs (version 2.0.3) warnings.

    {color:green}+1 release audit{color}.  The applied patch does not increase the total number of release audit warnings.

    {color:red}-1 core tests{color}.  The patch failed these unit tests in hadoop-common-project/hadoop-common:

                  org.apache.hadoop.metrics2.impl.TestMetricsSystemImpl
                  org.apache.hadoop.ipc.TestCallQueueManager

Test results: https://builds.apache.org/job/PreCommit-YARN-Build/6268//testReport/
Console output: https://builds.apache.org/job/PreCommit-YARN-Build/6268//console

This message is automatically generated.


======================================================================
======================================================================
    Adding comment to Jira.
======================================================================
======================================================================


Comment added.
8e1c4eb2a857669cecc153132c9b84d760796b3e logged out


======================================================================
======================================================================
    Finished build.
======================================================================
======================================================================


Build step 'Execute shell' marked build as failure
Archiving artifacts
Sending artifact delta relative to PreCommit-YARN-Build #6051
Archived 15 artifacts
Archive block size is 32768
Received 129 blocks and 5154448 bytes
Compression is 45.1%
Took 1.6 sec
[description-setter] Could not determine description.
Recording test results
Email was triggered for: Failure
Sending email for trigger: Failure



###################################################################################
############################## FAILED TESTS (if any) ##############################
2 tests failed.
REGRESSION:  org.apache.hadoop.ipc.TestCallQueueManager.testSwapUnderContention

Error Message:
expected:<26559> but was:<26565>

Stack Trace:
java.lang.AssertionError: expected:<26559> but was:<26565>
	at org.junit.Assert.fail(Assert.java:88)
	at org.junit.Assert.failNotEquals(Assert.java:743)
	at org.junit.Assert.assertEquals(Assert.java:118)
	at org.junit.Assert.assertEquals(Assert.java:555)
	at org.junit.Assert.assertEquals(Assert.java:542)
	at org.apache.hadoop.ipc.TestCallQueueManager.testSwapUnderContention(TestCallQueueManager.java:220)


REGRESSION:  org.apache.hadoop.metrics2.impl.TestMetricsSystemImpl.testMultiThreadedPublish

Error Message:
Metric not collected!
Metric not collected!
Passed
Passed
Metric not collected!
Metric not collected!
Metric not collected!
Metric not collected!
Metric not collected!
Passed

Stack Trace:
java.lang.AssertionError: Metric not collected!
Metric not collected!
Passed
Passed
Metric not collected!
Metric not collected!
Metric not collected!
Metric not collected!
Metric not collected!
Passed
	at org.junit.Assert.fail(Assert.java:88)
	at org.junit.Assert.assertTrue(Assert.java:41)
	at org.apache.hadoop.metrics2.impl.TestMetricsSystemImpl.testMultiThreadedPublish(TestMetricsSystemImpl.java:235)



Failed: YARN-3006 PreCommit Build #6267

Posted by Apache Jenkins Server <je...@builds.apache.org>.
Jira: https://issues.apache.org/jira/browse/YARN-3006
Build: https://builds.apache.org/job/PreCommit-YARN-Build/6267/

###################################################################################
########################## LAST 60 LINES OF THE CONSOLE ###########################
[...truncated 4215 lines...]

{color:red}-1 overall{color}.  Here are the results of testing the latest attachment 
  http://issues.apache.org/jira/secure/attachment/12690518/YARN-3006.001.patch
  against trunk revision 788ee35.

    {color:green}+1 @author{color}.  The patch does not contain any @author tags.

    {color:red}-1 tests included{color}.  The patch doesn't appear to include any new or modified tests.
                        Please justify why no new tests are needed for this patch.
                        Also please list what manual steps were performed to verify this patch.

    {color:green}+1 javac{color}.  The applied patch does not increase the total number of javac compiler warnings.

    {color:green}+1 javadoc{color}.  There were no new javadoc warning messages.

    {color:green}+1 eclipse:eclipse{color}.  The patch built with eclipse:eclipse.

    {color:green}+1 findbugs{color}.  The patch does not introduce any new Findbugs (version 2.0.3) warnings.

    {color:green}+1 release audit{color}.  The applied patch does not increase the total number of release audit warnings.

    {color:green}+1 core tests{color}.  The patch passed unit tests in hadoop-common-project/hadoop-common.

Test results: https://builds.apache.org/job/PreCommit-YARN-Build/6267//testReport/
Console output: https://builds.apache.org/job/PreCommit-YARN-Build/6267//console

This message is automatically generated.


======================================================================
======================================================================
    Adding comment to Jira.
======================================================================
======================================================================


Comment added.
b0aace017c3c86fed36c303c75f3c94c326850ee logged out


======================================================================
======================================================================
    Finished build.
======================================================================
======================================================================


Build step 'Execute shell' marked build as failure
Archiving artifacts
Sending artifact delta relative to PreCommit-YARN-Build #6051
Archived 15 artifacts
Archive block size is 32768
Received 39 blocks and 8107730 bytes
Compression is 13.6%
Took 2.1 sec
[description-setter] Could not determine description.
Recording test results
Email was triggered for: Failure
Sending email for trigger: Failure



###################################################################################
############################## FAILED TESTS (if any) ##############################
All tests passed

Failed: YARN-2996 PreCommit Build #6266

Posted by Apache Jenkins Server <je...@builds.apache.org>.
Jira: https://issues.apache.org/jira/browse/YARN-2996
Build: https://builds.apache.org/job/PreCommit-YARN-Build/6266/

###################################################################################
########################## LAST 60 LINES OF THE CONSOLE ###########################
[...truncated 3308 lines...]
{color:red}-1 overall{color}.  Here are the results of testing the latest attachment 
  http://issues.apache.org/jira/secure/attachment/12690501/YARN-2996.003.patch
  against trunk revision 788ee35.

    {color:green}+1 @author{color}.  The patch does not contain any @author tags.

    {color:red}-1 tests included{color}.  The patch doesn't appear to include any new or modified tests.
                        Please justify why no new tests are needed for this patch.
                        Also please list what manual steps were performed to verify this patch.

    {color:green}+1 javac{color}.  The applied patch does not increase the total number of javac compiler warnings.

    {color:green}+1 javadoc{color}.  There were no new javadoc warning messages.

    {color:green}+1 eclipse:eclipse{color}.  The patch built with eclipse:eclipse.

    {color:red}-1 findbugs{color}.  The patch appears to introduce 1 new Findbugs (version 2.0.3) warnings.

    {color:green}+1 release audit{color}.  The applied patch does not increase the total number of release audit warnings.

    {color:green}+1 core tests{color}.  The patch passed unit tests in hadoop-yarn-project/hadoop-yarn/hadoop-yarn-server/hadoop-yarn-server-resourcemanager.

Test results: https://builds.apache.org/job/PreCommit-YARN-Build/6266//testReport/
Findbugs warnings: https://builds.apache.org/job/PreCommit-YARN-Build/6266//artifact/patchprocess/newPatchFindbugsWarningshadoop-yarn-server-resourcemanager.html
Console output: https://builds.apache.org/job/PreCommit-YARN-Build/6266//console

This message is automatically generated.


======================================================================
======================================================================
    Adding comment to Jira.
======================================================================
======================================================================


Comment added.
0eebb0d17fda1bb1d26a44f18af40cc9c4ba6f66 logged out


======================================================================
======================================================================
    Finished build.
======================================================================
======================================================================


Build step 'Execute shell' marked build as failure
Archiving artifacts
Sending artifact delta relative to PreCommit-YARN-Build #6051
Archived 15 artifacts
Archive block size is 32768
Received 127 blocks and 4739450 bytes
Compression is 46.8%
Took 1.8 sec
[description-setter] Could not determine description.
Recording test results
Email was triggered for: Failure
Sending email for trigger: Failure



###################################################################################
############################## FAILED TESTS (if any) ##############################
All tests passed

Failed: YARN-2807 PreCommit Build #6265

Posted by Apache Jenkins Server <je...@builds.apache.org>.
Jira: https://issues.apache.org/jira/browse/YARN-2807
Build: https://builds.apache.org/job/PreCommit-YARN-Build/6265/

###################################################################################
########################## LAST 60 LINES OF THE CONSOLE ###########################
[...truncated 4150 lines...]

{color:red}-1 overall{color}.  Here are the results of testing the latest attachment 
  http://issues.apache.org/jira/secure/attachment/12690300/YARN-2807.2.patch
  against trunk revision 788ee35.

    {color:green}+1 @author{color}.  The patch does not contain any @author tags.

    {color:green}+0 tests included{color}.  The patch appears to be a documentation patch that doesn't require tests.

    {color:green}+1 javac{color}.  The applied patch does not increase the total number of javac compiler warnings.

    {color:green}+1 javadoc{color}.  There were no new javadoc warning messages.

    {color:green}+1 eclipse:eclipse{color}.  The patch built with eclipse:eclipse.

    {color:green}+1 findbugs{color}.  The patch does not introduce any new Findbugs (version 2.0.3) warnings.

    {color:green}+1 release audit{color}.  The applied patch does not increase the total number of release audit warnings.

    {color:red}-1 core tests{color}.  The patch failed these unit tests in hadoop-common-project/hadoop-common:

                  org.apache.hadoop.security.ssl.TestReloadingX509TrustManager

Test results: https://builds.apache.org/job/PreCommit-YARN-Build/6265//testReport/
Console output: https://builds.apache.org/job/PreCommit-YARN-Build/6265//console

This message is automatically generated.


======================================================================
======================================================================
    Adding comment to Jira.
======================================================================
======================================================================


Comment added.
5ee8c63bb1fc8213e15c6d6dd4f61c8aae5fb1be logged out


======================================================================
======================================================================
    Finished build.
======================================================================
======================================================================


Build step 'Execute shell' marked build as failure
Archiving artifacts
Sending artifact delta relative to PreCommit-YARN-Build #6051
Archived 15 artifacts
Archive block size is 32768
Received 128 blocks and 5186426 bytes
Compression is 44.7%
Took 4.7 sec
[description-setter] Could not determine description.
Recording test results
Email was triggered for: Failure
Sending email for trigger: Failure



###################################################################################
############################## FAILED TESTS (if any) ##############################
1 tests failed.
FAILED:  org.apache.hadoop.security.ssl.TestReloadingX509TrustManager.testReload

Error Message:
expected:<2> but was:<1>

Stack Trace:
java.lang.AssertionError: expected:<2> but was:<1>
	at org.junit.Assert.fail(Assert.java:88)
	at org.junit.Assert.failNotEquals(Assert.java:743)
	at org.junit.Assert.assertEquals(Assert.java:118)
	at org.junit.Assert.assertEquals(Assert.java:555)
	at org.junit.Assert.assertEquals(Assert.java:542)
	at org.apache.hadoop.security.ssl.TestReloadingX509TrustManager.testReload(TestReloadingX509TrustManager.java:112)



Failed: YARN-2637 PreCommit Build #6264

Posted by Apache Jenkins Server <je...@builds.apache.org>.
Jira: https://issues.apache.org/jira/browse/YARN-2637
Build: https://builds.apache.org/job/PreCommit-YARN-Build/6264/

###################################################################################
########################## LAST 60 LINES OF THE CONSOLE ###########################
[...truncated 3314 lines...]


{color:red}-1 overall{color}.  Here are the results of testing the latest attachment 
  http://issues.apache.org/jira/secure/attachment/12690467/YARN-2637.29.patch
  against trunk revision 788ee35.

    {color:green}+1 @author{color}.  The patch does not contain any @author tags.

    {color:green}+1 tests included{color}.  The patch appears to include 8 new or modified test files.

    {color:green}+1 javac{color}.  The applied patch does not increase the total number of javac compiler warnings.

    {color:green}+1 javadoc{color}.  There were no new javadoc warning messages.

    {color:green}+1 eclipse:eclipse{color}.  The patch built with eclipse:eclipse.

    {color:red}-1 findbugs{color}.  The patch appears to introduce 1 new Findbugs (version 2.0.3) warnings.

    {color:green}+1 release audit{color}.  The applied patch does not increase the total number of release audit warnings.

    {color:green}+1 core tests{color}.  The patch passed unit tests in hadoop-yarn-project/hadoop-yarn/hadoop-yarn-server/hadoop-yarn-server-resourcemanager.

Test results: https://builds.apache.org/job/PreCommit-YARN-Build/6264//testReport/
Findbugs warnings: https://builds.apache.org/job/PreCommit-YARN-Build/6264//artifact/patchprocess/newPatchFindbugsWarningshadoop-yarn-server-resourcemanager.html
Console output: https://builds.apache.org/job/PreCommit-YARN-Build/6264//console

This message is automatically generated.


======================================================================
======================================================================
    Adding comment to Jira.
======================================================================
======================================================================


Comment added.
34ae6a842a80991cd0b4b1e438431a2cb29ea87d logged out


======================================================================
======================================================================
    Finished build.
======================================================================
======================================================================


Build step 'Execute shell' marked build as failure
Archiving artifacts
Sending artifact delta relative to PreCommit-YARN-Build #6051
Archived 15 artifacts
Archive block size is 32768
Received 126 blocks and 4740295 bytes
Compression is 46.6%
Took 1.2 sec
[description-setter] Could not determine description.
Recording test results
Email was triggered for: Failure
Sending email for trigger: Failure



###################################################################################
############################## FAILED TESTS (if any) ##############################
All tests passed

Failed: YARN-2428 PreCommit Build #6263

Posted by Apache Jenkins Server <je...@builds.apache.org>.
Jira: https://issues.apache.org/jira/browse/YARN-2428
Build: https://builds.apache.org/job/PreCommit-YARN-Build/6263/

###################################################################################
########################## LAST 60 LINES OF THE CONSOLE ###########################
[...truncated 3313 lines...]

{color:red}-1 overall{color}.  Here are the results of testing the latest attachment 
  http://issues.apache.org/jira/secure/attachment/12690461/YARN-2428.001.patch
  against trunk revision 788ee35.

    {color:green}+1 @author{color}.  The patch does not contain any @author tags.

    {color:red}-1 tests included{color}.  The patch doesn't appear to include any new or modified tests.
                        Please justify why no new tests are needed for this patch.
                        Also please list what manual steps were performed to verify this patch.

    {color:green}+1 javac{color}.  The applied patch does not increase the total number of javac compiler warnings.

    {color:green}+1 javadoc{color}.  There were no new javadoc warning messages.

    {color:green}+1 eclipse:eclipse{color}.  The patch built with eclipse:eclipse.

    {color:green}+1 findbugs{color}.  The patch does not introduce any new Findbugs (version 2.0.3) warnings.

    {color:green}+1 release audit{color}.  The applied patch does not increase the total number of release audit warnings.

    {color:green}+1 core tests{color}.  The patch passed unit tests in hadoop-yarn-project/hadoop-yarn/hadoop-yarn-server/hadoop-yarn-server-nodemanager.

Test results: https://builds.apache.org/job/PreCommit-YARN-Build/6263//testReport/
Console output: https://builds.apache.org/job/PreCommit-YARN-Build/6263//console

This message is automatically generated.


======================================================================
======================================================================
    Adding comment to Jira.
======================================================================
======================================================================


Comment added.
5adee6820bc155cc7d6e98460fce820b27f1af2f logged out


======================================================================
======================================================================
    Finished build.
======================================================================
======================================================================


Build step 'Execute shell' marked build as failure
Archiving artifacts
Sending artifact delta relative to PreCommit-YARN-Build #6051
Archived 15 artifacts
Archive block size is 32768
Received 33 blocks and 7704993 bytes
Compression is 12.3%
Took 1.7 sec
[description-setter] Could not determine description.
Recording test results
Email was triggered for: Failure
Sending email for trigger: Failure



###################################################################################
############################## FAILED TESTS (if any) ##############################
All tests passed

Failed: YARN-2213 PreCommit Build #6262

Posted by Apache Jenkins Server <je...@builds.apache.org>.
Jira: https://issues.apache.org/jira/browse/YARN-2213
Build: https://builds.apache.org/job/PreCommit-YARN-Build/6262/

###################################################################################
########################## LAST 60 LINES OF THE CONSOLE ###########################
[...truncated 3083 lines...]

{color:red}-1 overall{color}.  Here are the results of testing the latest attachment 
  http://issues.apache.org/jira/secure/attachment/12690459/YARN-2213.001.patch
  against trunk revision 788ee35.

    {color:green}+1 @author{color}.  The patch does not contain any @author tags.

    {color:red}-1 tests included{color}.  The patch doesn't appear to include any new or modified tests.
                        Please justify why no new tests are needed for this patch.
                        Also please list what manual steps were performed to verify this patch.

    {color:green}+1 javac{color}.  The applied patch does not increase the total number of javac compiler warnings.

    {color:green}+1 javadoc{color}.  There were no new javadoc warning messages.

    {color:green}+1 eclipse:eclipse{color}.  The patch built with eclipse:eclipse.

    {color:green}+1 findbugs{color}.  The patch does not introduce any new Findbugs (version 2.0.3) warnings.

    {color:green}+1 release audit{color}.  The applied patch does not increase the total number of release audit warnings.

    {color:green}+1 core tests{color}.  The patch passed unit tests in hadoop-yarn-project/hadoop-yarn/hadoop-yarn-server/hadoop-yarn-server-web-proxy.

Test results: https://builds.apache.org/job/PreCommit-YARN-Build/6262//testReport/
Console output: https://builds.apache.org/job/PreCommit-YARN-Build/6262//console

This message is automatically generated.


======================================================================
======================================================================
    Adding comment to Jira.
======================================================================
======================================================================


Comment added.
3adf7ea179fd6dba345f2df385f82cc10b0cefac logged out


======================================================================
======================================================================
    Finished build.
======================================================================
======================================================================


Build step 'Execute shell' marked build as failure
Archiving artifacts
Sending artifact delta relative to PreCommit-YARN-Build #6051
Archived 15 artifacts
Archive block size is 32768
Received 32 blocks and 7566358 bytes
Compression is 12.2%
Took 1.6 sec
[description-setter] Could not determine description.
Recording test results
Email was triggered for: Failure
Sending email for trigger: Failure



###################################################################################
############################## FAILED TESTS (if any) ##############################
All tests passed

Failed: YARN-2936 PreCommit Build #6261

Posted by Apache Jenkins Server <je...@builds.apache.org>.
Jira: https://issues.apache.org/jira/browse/YARN-2936
Build: https://builds.apache.org/job/PreCommit-YARN-Build/6261/

###################################################################################
########################## LAST 60 LINES OF THE CONSOLE ###########################
[...truncated 3195 lines...]



{color:red}-1 overall{color}.  Here are the results of testing the latest attachment 
  http://issues.apache.org/jira/secure/attachment/12690457/YARN-2936.006.patch
  against trunk revision 788ee35.

    {color:green}+1 @author{color}.  The patch does not contain any @author tags.

    {color:green}+1 tests included{color}.  The patch appears to include 1 new or modified test files.

    {color:green}+1 javac{color}.  The applied patch does not increase the total number of javac compiler warnings.

    {color:green}+1 javadoc{color}.  There were no new javadoc warning messages.

    {color:green}+1 eclipse:eclipse{color}.  The patch built with eclipse:eclipse.

    {color:green}+1 findbugs{color}.  The patch does not introduce any new Findbugs (version 2.0.3) warnings.

    {color:green}+1 release audit{color}.  The applied patch does not increase the total number of release audit warnings.

    {color:green}+1 core tests{color}.  The patch passed unit tests in hadoop-yarn-project/hadoop-yarn/hadoop-yarn-common.

Test results: https://builds.apache.org/job/PreCommit-YARN-Build/6261//testReport/
Console output: https://builds.apache.org/job/PreCommit-YARN-Build/6261//console

This message is automatically generated.


======================================================================
======================================================================
    Adding comment to Jira.
======================================================================
======================================================================


Comment added.
1ce90203d848f88931421b29af48b2d4fed3cd87 logged out


======================================================================
======================================================================
    Finished build.
======================================================================
======================================================================


Build step 'Execute shell' marked build as failure
Archiving artifacts
Sending artifact delta relative to PreCommit-YARN-Build #6051
Archived 15 artifacts
Archive block size is 32768
Received 128 blocks and 4667287 bytes
Compression is 47.3%
Took 1.3 sec
[description-setter] Could not determine description.
Recording test results
Email was triggered for: Failure
Sending email for trigger: Failure



###################################################################################
############################## FAILED TESTS (if any) ##############################
All tests passed