You are viewing a plain text version of this content. The canonical link for it is here.
Posted to dev@zookeeper.apache.org by Apache Jenkins Server <je...@builds.apache.org> on 2017/02/15 02:41:59 UTC

ZooKeeper_branch34_jdk7 - Build # 1407 - Still Failing

See https://builds.apache.org/job/ZooKeeper_branch34_jdk7/1407/

###################################################################################
########################## LAST 60 LINES OF THE CONSOLE ###########################
[...truncated 239770 lines...]
    [junit] 2017-02-15 02:41:55,810 [myid:] - INFO  [main:SessionTrackerImpl@225] - Shutting down
    [junit] 2017-02-15 02:41:55,810 [myid:] - INFO  [main:PrepRequestProcessor@764] - Shutting down
    [junit] 2017-02-15 02:41:55,810 [myid:] - INFO  [main:SyncRequestProcessor@208] - Shutting down
    [junit] 2017-02-15 02:41:55,811 [myid:] - INFO  [ProcessThread(sid:0 cport:11221)::PrepRequestProcessor@143] - PrepRequestProcessor exited loop!
    [junit] 2017-02-15 02:41:55,811 [myid:] - INFO  [SyncThread:0:SyncRequestProcessor@186] - SyncRequestProcessor exited!
    [junit] 2017-02-15 02:41:55,811 [myid:] - INFO  [main:FinalRequestProcessor@402] - shutdown of request processor complete
    [junit] 2017-02-15 02:41:55,811 [myid:] - INFO  [main:FourLetterWordMain@62] - connecting to 127.0.0.1 11221
    [junit] 2017-02-15 02:41:55,812 [myid:] - INFO  [main:JMXEnv@147] - ensureOnly:[]
    [junit] 2017-02-15 02:41:55,813 [myid:] - INFO  [main:ClientBase@445] - STARTING server
    [junit] 2017-02-15 02:41:55,814 [myid:] - INFO  [main:ClientBase@366] - CREATING server instance 127.0.0.1:11221
    [junit] 2017-02-15 02:41:55,814 [myid:] - INFO  [main:NIOServerCnxnFactory@89] - binding to port 0.0.0.0/0.0.0.0:11221
    [junit] 2017-02-15 02:41:55,814 [myid:] - INFO  [main:ClientBase@341] - STARTING server instance 127.0.0.1:11221
    [junit] 2017-02-15 02:41:55,814 [myid:] - INFO  [main:ZooKeeperServer@173] - Created server with tickTime 3000 minSessionTimeout 6000 maxSessionTimeout 60000 datadir /home/jenkins/jenkins-slave/workspace/ZooKeeper_branch34_jdk7/build/test/tmp/test7053325362153123348.junit.dir/version-2 snapdir /home/jenkins/jenkins-slave/workspace/ZooKeeper_branch34_jdk7/build/test/tmp/test7053325362153123348.junit.dir/version-2
    [junit] 2017-02-15 02:41:55,818 [myid:] - ERROR [main:ZooKeeperServer@472] - ZKShutdownHandler is not registered, so ZooKeeper server won't take any action on ERROR or SHUTDOWN server state changes
    [junit] 2017-02-15 02:41:55,818 [myid:] - INFO  [main:FourLetterWordMain@62] - connecting to 127.0.0.1 11221
    [junit] 2017-02-15 02:41:55,819 [myid:] - INFO  [NIOServerCxn.Factory:0.0.0.0/0.0.0.0:11221:NIOServerCnxnFactory@192] - Accepted socket connection from /127.0.0.1:44765
    [junit] 2017-02-15 02:41:55,819 [myid:] - INFO  [NIOServerCxn.Factory:0.0.0.0/0.0.0.0:11221:NIOServerCnxn@838] - Processing stat command from /127.0.0.1:44765
    [junit] 2017-02-15 02:41:55,820 [myid:] - INFO  [Thread-4:NIOServerCnxn$StatCommand@674] - Stat command output
    [junit] 2017-02-15 02:41:55,820 [myid:] - INFO  [Thread-4:NIOServerCnxn@1019] - Closed socket connection for client /127.0.0.1:44765 (no session established for client)
    [junit] 2017-02-15 02:41:55,820 [myid:] - INFO  [main:JMXEnv@230] - ensureParent:[InMemoryDataTree, StandaloneServer_port]
    [junit] 2017-02-15 02:41:55,823 [myid:] - INFO  [main:JMXEnv@247] - expect:InMemoryDataTree
    [junit] 2017-02-15 02:41:55,823 [myid:] - INFO  [main:JMXEnv@251] - found:InMemoryDataTree org.apache.ZooKeeperService:name0=StandaloneServer_port11221,name1=InMemoryDataTree
    [junit] 2017-02-15 02:41:55,823 [myid:] - INFO  [main:JMXEnv@247] - expect:StandaloneServer_port
    [junit] 2017-02-15 02:41:55,823 [myid:] - INFO  [main:JMXEnv@251] - found:StandaloneServer_port org.apache.ZooKeeperService:name0=StandaloneServer_port11221
    [junit] 2017-02-15 02:41:55,824 [myid:] - INFO  [main:JUnit4ZKTestRunner$LoggedInvokeMethod@58] - Memory used 35674
    [junit] 2017-02-15 02:41:55,824 [myid:] - INFO  [main:JUnit4ZKTestRunner$LoggedInvokeMethod@63] - Number of threads 20
    [junit] 2017-02-15 02:41:55,824 [myid:] - INFO  [main:JUnit4ZKTestRunner$LoggedInvokeMethod@78] - FINISHED TEST METHOD testQuota
    [junit] 2017-02-15 02:41:55,824 [myid:] - INFO  [main:ClientBase@522] - tearDown starting
    [junit] 2017-02-15 02:41:55,895 [myid:] - INFO  [main:ZooKeeper@684] - Session: 0x15a3fa5cfd70000 closed
    [junit] 2017-02-15 02:41:55,896 [myid:] - INFO  [main:ClientBase@492] - STOPPING server
    [junit] 2017-02-15 02:41:55,896 [myid:] - INFO  [main-EventThread:ClientCnxn$EventThread@519] - EventThread shut down for session: 0x15a3fa5cfd70000
    [junit] 2017-02-15 02:41:55,896 [myid:] - INFO  [NIOServerCxn.Factory:0.0.0.0/0.0.0.0:11221:NIOServerCnxnFactory@219] - NIOServerCnxn factory exited run method
    [junit] 2017-02-15 02:41:55,896 [myid:] - INFO  [main:ZooKeeperServer@505] - shutting down
    [junit] 2017-02-15 02:41:55,897 [myid:] - ERROR [main:ZooKeeperServer@472] - ZKShutdownHandler is not registered, so ZooKeeper server won't take any action on ERROR or SHUTDOWN server state changes
    [junit] 2017-02-15 02:41:55,897 [myid:] - INFO  [main:SessionTrackerImpl@225] - Shutting down
    [junit] 2017-02-15 02:41:55,897 [myid:] - INFO  [main:PrepRequestProcessor@764] - Shutting down
    [junit] 2017-02-15 02:41:55,897 [myid:] - INFO  [main:SyncRequestProcessor@208] - Shutting down
    [junit] 2017-02-15 02:41:55,898 [myid:] - INFO  [ProcessThread(sid:0 cport:11221)::PrepRequestProcessor@143] - PrepRequestProcessor exited loop!
    [junit] 2017-02-15 02:41:55,898 [myid:] - INFO  [SyncThread:0:SyncRequestProcessor@186] - SyncRequestProcessor exited!
    [junit] 2017-02-15 02:41:55,898 [myid:] - INFO  [main:FinalRequestProcessor@402] - shutdown of request processor complete
    [junit] 2017-02-15 02:41:55,899 [myid:] - INFO  [main:FourLetterWordMain@62] - connecting to 127.0.0.1 11221
    [junit] 2017-02-15 02:41:55,900 [myid:] - INFO  [main:JMXEnv@147] - ensureOnly:[]
    [junit] 2017-02-15 02:41:55,904 [myid:] - INFO  [main:ClientBase@547] - fdcount after test is: 90 at start it was 78
    [junit] 2017-02-15 02:41:55,904 [myid:] - INFO  [main:ClientBase@549] - sleeping for 20 secs
    [junit] 2017-02-15 02:41:55,905 [myid:] - INFO  [main:ZKTestCase$1@65] - SUCCEEDED testQuota
    [junit] 2017-02-15 02:41:55,905 [myid:] - INFO  [main:ZKTestCase$1@60] - FINISHED testQuota
    [junit] Tests run: 1, Failures: 0, Errors: 0, Skipped: 0, Time elapsed: 0.637 sec

fail.build.on.test.failure:

BUILD FAILED
/home/jenkins/jenkins-slave/workspace/ZooKeeper_branch34_jdk7/build.xml:1328: The following error occurred while executing this line:
/home/jenkins/jenkins-slave/workspace/ZooKeeper_branch34_jdk7/build.xml:1331: Tests failed!

Total time: 29 minutes 5 seconds
Build step 'Invoke Ant' marked build as failure
Recording test results
Email was triggered for: Failure - Any
Sending email for trigger: Failure - Any



###################################################################################
############################## FAILED TESTS (if any) ##############################
2 tests failed.
FAILED:  org.apache.zookeeper.server.quorum.auth.QuorumKerberosHostBasedAuthTest.testValidCredentials

Error Message:
waiting for server 0 being up

Stack Trace:
junit.framework.AssertionFailedError: waiting for server 0 being up
	at org.apache.zookeeper.server.quorum.auth.QuorumAuthTestBase.startQuorum(QuorumAuthTestBase.java:74)
	at org.apache.zookeeper.server.quorum.auth.QuorumKerberosHostBasedAuthTest.testValidCredentials(QuorumKerberosHostBasedAuthTest.java:125)
	at org.apache.zookeeper.JUnit4ZKTestRunner$LoggedInvokeMethod.evaluate(JUnit4ZKTestRunner.java:55)


FAILED:  org.apache.zookeeper.server.quorum.auth.QuorumKerberosHostBasedAuthTest.testConnectBadServer

Error Message:
waiting for server 1 being up

Stack Trace:
junit.framework.AssertionFailedError: waiting for server 1 being up
	at org.apache.zookeeper.server.quorum.auth.QuorumAuthTestBase.startQuorum(QuorumAuthTestBase.java:74)
	at org.apache.zookeeper.server.quorum.auth.QuorumKerberosHostBasedAuthTest.testConnectBadServer(QuorumKerberosHostBasedAuthTest.java:146)
	at org.apache.zookeeper.JUnit4ZKTestRunner$LoggedInvokeMethod.evaluate(JUnit4ZKTestRunner.java:55)



ZooKeeper_branch34_jdk7 - Build # 1420 - Still Failing

Posted by Apache Jenkins Server <je...@builds.apache.org>.
See https://builds.apache.org/job/ZooKeeper_branch34_jdk7/1420/

###################################################################################
########################## LAST 60 LINES OF THE CONSOLE ###########################
[...truncated 30.94 MB...]
    [junit] 2017-02-27 02:42:06,549 [myid:] - INFO  [main:SessionTrackerImpl@225] - Shutting down
    [junit] 2017-02-27 02:42:06,549 [myid:] - INFO  [main:PrepRequestProcessor@764] - Shutting down
    [junit] 2017-02-27 02:42:06,549 [myid:] - INFO  [main:SyncRequestProcessor@208] - Shutting down
    [junit] 2017-02-27 02:42:06,550 [myid:] - INFO  [ProcessThread(sid:0 cport:11221)::PrepRequestProcessor@143] - PrepRequestProcessor exited loop!
    [junit] 2017-02-27 02:42:06,550 [myid:] - INFO  [SyncThread:0:SyncRequestProcessor@186] - SyncRequestProcessor exited!
    [junit] 2017-02-27 02:42:06,550 [myid:] - INFO  [main:FinalRequestProcessor@402] - shutdown of request processor complete
    [junit] 2017-02-27 02:42:06,551 [myid:] - INFO  [main:FourLetterWordMain@62] - connecting to 127.0.0.1 11221
    [junit] 2017-02-27 02:42:06,551 [myid:] - INFO  [main:JMXEnv@147] - ensureOnly:[]
    [junit] 2017-02-27 02:42:06,553 [myid:] - INFO  [main:ClientBase@445] - STARTING server
    [junit] 2017-02-27 02:42:06,553 [myid:] - INFO  [main:ClientBase@366] - CREATING server instance 127.0.0.1:11221
    [junit] 2017-02-27 02:42:06,554 [myid:] - INFO  [main:NIOServerCnxnFactory@89] - binding to port 0.0.0.0/0.0.0.0:11221
    [junit] 2017-02-27 02:42:06,554 [myid:] - INFO  [main:ClientBase@341] - STARTING server instance 127.0.0.1:11221
    [junit] 2017-02-27 02:42:06,555 [myid:] - INFO  [main:ZooKeeperServer@173] - Created server with tickTime 3000 minSessionTimeout 6000 maxSessionTimeout 60000 datadir /home/jenkins/jenkins-slave/workspace/ZooKeeper_branch34_jdk7/build/test/tmp/test2402568933286793782.junit.dir/version-2 snapdir /home/jenkins/jenkins-slave/workspace/ZooKeeper_branch34_jdk7/build/test/tmp/test2402568933286793782.junit.dir/version-2
    [junit] 2017-02-27 02:42:06,559 [myid:] - ERROR [main:ZooKeeperServer@472] - ZKShutdownHandler is not registered, so ZooKeeper server won't take any action on ERROR or SHUTDOWN server state changes
    [junit] 2017-02-27 02:42:06,560 [myid:] - INFO  [main:FourLetterWordMain@62] - connecting to 127.0.0.1 11221
    [junit] 2017-02-27 02:42:06,560 [myid:] - INFO  [NIOServerCxn.Factory:0.0.0.0/0.0.0.0:11221:NIOServerCnxnFactory@192] - Accepted socket connection from /127.0.0.1:49197
    [junit] 2017-02-27 02:42:06,561 [myid:] - INFO  [NIOServerCxn.Factory:0.0.0.0/0.0.0.0:11221:NIOServerCnxn@838] - Processing stat command from /127.0.0.1:49197
    [junit] 2017-02-27 02:42:06,561 [myid:] - INFO  [Thread-4:NIOServerCnxn$StatCommand@674] - Stat command output
    [junit] 2017-02-27 02:42:06,562 [myid:] - INFO  [Thread-4:NIOServerCnxn@1019] - Closed socket connection for client /127.0.0.1:49197 (no session established for client)
    [junit] 2017-02-27 02:42:06,562 [myid:] - INFO  [main:JMXEnv@230] - ensureParent:[InMemoryDataTree, StandaloneServer_port]
    [junit] 2017-02-27 02:42:06,564 [myid:] - INFO  [main:JMXEnv@247] - expect:InMemoryDataTree
    [junit] 2017-02-27 02:42:06,564 [myid:] - INFO  [main:JMXEnv@251] - found:InMemoryDataTree org.apache.ZooKeeperService:name0=StandaloneServer_port11221,name1=InMemoryDataTree
    [junit] 2017-02-27 02:42:06,565 [myid:] - INFO  [main:JMXEnv@247] - expect:StandaloneServer_port
    [junit] 2017-02-27 02:42:06,565 [myid:] - INFO  [main:JMXEnv@251] - found:StandaloneServer_port org.apache.ZooKeeperService:name0=StandaloneServer_port11221
    [junit] 2017-02-27 02:42:06,565 [myid:] - INFO  [main:JUnit4ZKTestRunner$LoggedInvokeMethod@58] - Memory used 35676
    [junit] 2017-02-27 02:42:06,565 [myid:] - INFO  [main:JUnit4ZKTestRunner$LoggedInvokeMethod@63] - Number of threads 20
    [junit] 2017-02-27 02:42:06,565 [myid:] - INFO  [main:JUnit4ZKTestRunner$LoggedInvokeMethod@78] - FINISHED TEST METHOD testQuota
    [junit] 2017-02-27 02:42:06,566 [myid:] - INFO  [main:ClientBase@522] - tearDown starting
    [junit] 2017-02-27 02:42:06,629 [myid:] - INFO  [main:ZooKeeper@684] - Session: 0x15a7d7249bd0000 closed
    [junit] 2017-02-27 02:42:06,630 [myid:] - INFO  [main:ClientBase@492] - STOPPING server
    [junit] 2017-02-27 02:42:06,630 [myid:] - INFO  [main-EventThread:ClientCnxn$EventThread@519] - EventThread shut down for session: 0x15a7d7249bd0000
    [junit] 2017-02-27 02:42:06,630 [myid:] - INFO  [NIOServerCxn.Factory:0.0.0.0/0.0.0.0:11221:NIOServerCnxnFactory@219] - NIOServerCnxn factory exited run method
    [junit] 2017-02-27 02:42:06,630 [myid:] - INFO  [main:ZooKeeperServer@505] - shutting down
    [junit] 2017-02-27 02:42:06,630 [myid:] - ERROR [main:ZooKeeperServer@472] - ZKShutdownHandler is not registered, so ZooKeeper server won't take any action on ERROR or SHUTDOWN server state changes
    [junit] 2017-02-27 02:42:06,631 [myid:] - INFO  [main:SessionTrackerImpl@225] - Shutting down
    [junit] 2017-02-27 02:42:06,631 [myid:] - INFO  [main:PrepRequestProcessor@764] - Shutting down
    [junit] 2017-02-27 02:42:06,631 [myid:] - INFO  [main:SyncRequestProcessor@208] - Shutting down
    [junit] 2017-02-27 02:42:06,632 [myid:] - INFO  [ProcessThread(sid:0 cport:11221)::PrepRequestProcessor@143] - PrepRequestProcessor exited loop!
    [junit] 2017-02-27 02:42:06,632 [myid:] - INFO  [SyncThread:0:SyncRequestProcessor@186] - SyncRequestProcessor exited!
    [junit] 2017-02-27 02:42:06,632 [myid:] - INFO  [main:FinalRequestProcessor@402] - shutdown of request processor complete
    [junit] 2017-02-27 02:42:06,633 [myid:] - INFO  [main:FourLetterWordMain@62] - connecting to 127.0.0.1 11221
    [junit] 2017-02-27 02:42:06,634 [myid:] - INFO  [main:JMXEnv@147] - ensureOnly:[]
    [junit] 2017-02-27 02:42:06,638 [myid:] - INFO  [main:ClientBase@547] - fdcount after test is: 90 at start it was 78
    [junit] 2017-02-27 02:42:06,638 [myid:] - INFO  [main:ClientBase@549] - sleeping for 20 secs
    [junit] 2017-02-27 02:42:06,639 [myid:] - INFO  [main:ZKTestCase$1@65] - SUCCEEDED testQuota
    [junit] 2017-02-27 02:42:06,640 [myid:] - INFO  [main:ZKTestCase$1@60] - FINISHED testQuota
    [junit] Tests run: 1, Failures: 0, Errors: 0, Skipped: 0, Time elapsed: 0.552 sec

fail.build.on.test.failure:

BUILD FAILED
/home/jenkins/jenkins-slave/workspace/ZooKeeper_branch34_jdk7/build.xml:1328: The following error occurred while executing this line:
/home/jenkins/jenkins-slave/workspace/ZooKeeper_branch34_jdk7/build.xml:1331: Tests failed!

Total time: 29 minutes 28 seconds
Build step 'Invoke Ant' marked build as failure
Recording test results
Email was triggered for: Failure - Any
Sending email for trigger: Failure - Any



###################################################################################
############################## FAILED TESTS (if any) ##############################
3 tests failed.
FAILED:  org.apache.zookeeper.server.quorum.auth.QuorumKerberosHostBasedAuthTest.testValidCredentials

Error Message:
waiting for server 0 being up

Stack Trace:
junit.framework.AssertionFailedError: waiting for server 0 being up
	at org.apache.zookeeper.server.quorum.auth.QuorumAuthTestBase.startQuorum(QuorumAuthTestBase.java:74)
	at org.apache.zookeeper.server.quorum.auth.QuorumKerberosHostBasedAuthTest.testValidCredentials(QuorumKerberosHostBasedAuthTest.java:125)
	at org.apache.zookeeper.JUnit4ZKTestRunner$LoggedInvokeMethod.evaluate(JUnit4ZKTestRunner.java:55)


FAILED:  org.apache.zookeeper.server.quorum.auth.QuorumKerberosAuthTest.testValidCredentials

Error Message:
waiting for server 0 being up

Stack Trace:
junit.framework.AssertionFailedError: waiting for server 0 being up
	at org.apache.zookeeper.server.quorum.auth.QuorumAuthTestBase.startQuorum(QuorumAuthTestBase.java:74)
	at org.apache.zookeeper.server.quorum.auth.QuorumKerberosAuthTest.testValidCredentials(QuorumKerberosAuthTest.java:101)
	at org.apache.zookeeper.JUnit4ZKTestRunner$LoggedInvokeMethod.evaluate(JUnit4ZKTestRunner.java:55)


FAILED:  org.apache.zookeeper.server.quorum.auth.QuorumKerberosHostBasedAuthTest.testConnectBadServer

Error Message:
waiting for server 2 being up

Stack Trace:
junit.framework.AssertionFailedError: waiting for server 2 being up
	at org.apache.zookeeper.server.quorum.auth.QuorumAuthTestBase.startQuorum(QuorumAuthTestBase.java:74)
	at org.apache.zookeeper.server.quorum.auth.QuorumKerberosHostBasedAuthTest.testConnectBadServer(QuorumKerberosHostBasedAuthTest.java:146)
	at org.apache.zookeeper.JUnit4ZKTestRunner$LoggedInvokeMethod.evaluate(JUnit4ZKTestRunner.java:55)



ZooKeeper_branch34_jdk7 - Build # 1419 - Still Failing

Posted by Apache Jenkins Server <je...@builds.apache.org>.
See https://builds.apache.org/job/ZooKeeper_branch34_jdk7/1419/

###################################################################################
########################## LAST 60 LINES OF THE CONSOLE ###########################
[...truncated 31.15 MB...]
    [junit] 2017-02-26 02:41:50,425 [myid:] - INFO  [main:SessionTrackerImpl@225] - Shutting down
    [junit] 2017-02-26 02:41:50,426 [myid:] - INFO  [main:PrepRequestProcessor@764] - Shutting down
    [junit] 2017-02-26 02:41:50,426 [myid:] - INFO  [main:SyncRequestProcessor@208] - Shutting down
    [junit] 2017-02-26 02:41:50,426 [myid:] - INFO  [ProcessThread(sid:0 cport:11221)::PrepRequestProcessor@143] - PrepRequestProcessor exited loop!
    [junit] 2017-02-26 02:41:50,426 [myid:] - INFO  [SyncThread:0:SyncRequestProcessor@186] - SyncRequestProcessor exited!
    [junit] 2017-02-26 02:41:50,427 [myid:] - INFO  [main:FinalRequestProcessor@402] - shutdown of request processor complete
    [junit] 2017-02-26 02:41:50,427 [myid:] - INFO  [main:FourLetterWordMain@62] - connecting to 127.0.0.1 11221
    [junit] 2017-02-26 02:41:50,428 [myid:] - INFO  [main:JMXEnv@147] - ensureOnly:[]
    [junit] 2017-02-26 02:41:50,429 [myid:] - INFO  [main:ClientBase@445] - STARTING server
    [junit] 2017-02-26 02:41:50,429 [myid:] - INFO  [main:ClientBase@366] - CREATING server instance 127.0.0.1:11221
    [junit] 2017-02-26 02:41:50,430 [myid:] - INFO  [main:NIOServerCnxnFactory@89] - binding to port 0.0.0.0/0.0.0.0:11221
    [junit] 2017-02-26 02:41:50,430 [myid:] - INFO  [main:ClientBase@341] - STARTING server instance 127.0.0.1:11221
    [junit] 2017-02-26 02:41:50,430 [myid:] - INFO  [main:ZooKeeperServer@173] - Created server with tickTime 3000 minSessionTimeout 6000 maxSessionTimeout 60000 datadir /home/jenkins/jenkins-slave/workspace/ZooKeeper_branch34_jdk7/build/test/tmp/test1808746721982430798.junit.dir/version-2 snapdir /home/jenkins/jenkins-slave/workspace/ZooKeeper_branch34_jdk7/build/test/tmp/test1808746721982430798.junit.dir/version-2
    [junit] 2017-02-26 02:41:50,435 [myid:] - ERROR [main:ZooKeeperServer@472] - ZKShutdownHandler is not registered, so ZooKeeper server won't take any action on ERROR or SHUTDOWN server state changes
    [junit] 2017-02-26 02:41:50,435 [myid:] - INFO  [main:FourLetterWordMain@62] - connecting to 127.0.0.1 11221
    [junit] 2017-02-26 02:41:50,436 [myid:] - INFO  [NIOServerCxn.Factory:0.0.0.0/0.0.0.0:11221:NIOServerCnxnFactory@192] - Accepted socket connection from /127.0.0.1:34376
    [junit] 2017-02-26 02:41:50,436 [myid:] - INFO  [NIOServerCxn.Factory:0.0.0.0/0.0.0.0:11221:NIOServerCnxn@838] - Processing stat command from /127.0.0.1:34376
    [junit] 2017-02-26 02:41:50,437 [myid:] - INFO  [Thread-4:NIOServerCnxn$StatCommand@674] - Stat command output
    [junit] 2017-02-26 02:41:50,437 [myid:] - INFO  [Thread-4:NIOServerCnxn@1019] - Closed socket connection for client /127.0.0.1:34376 (no session established for client)
    [junit] 2017-02-26 02:41:50,437 [myid:] - INFO  [main:JMXEnv@230] - ensureParent:[InMemoryDataTree, StandaloneServer_port]
    [junit] 2017-02-26 02:41:50,439 [myid:] - INFO  [main:JMXEnv@247] - expect:InMemoryDataTree
    [junit] 2017-02-26 02:41:50,440 [myid:] - INFO  [main:JMXEnv@251] - found:InMemoryDataTree org.apache.ZooKeeperService:name0=StandaloneServer_port11221,name1=InMemoryDataTree
    [junit] 2017-02-26 02:41:50,440 [myid:] - INFO  [main:JMXEnv@247] - expect:StandaloneServer_port
    [junit] 2017-02-26 02:41:50,440 [myid:] - INFO  [main:JMXEnv@251] - found:StandaloneServer_port org.apache.ZooKeeperService:name0=StandaloneServer_port11221
    [junit] 2017-02-26 02:41:50,441 [myid:] - INFO  [main:JUnit4ZKTestRunner$LoggedInvokeMethod@58] - Memory used 35676
    [junit] 2017-02-26 02:41:50,441 [myid:] - INFO  [main:JUnit4ZKTestRunner$LoggedInvokeMethod@63] - Number of threads 20
    [junit] 2017-02-26 02:41:50,441 [myid:] - INFO  [main:JUnit4ZKTestRunner$LoggedInvokeMethod@78] - FINISHED TEST METHOD testQuota
    [junit] 2017-02-26 02:41:50,441 [myid:] - INFO  [main:ClientBase@522] - tearDown starting
    [junit] 2017-02-26 02:41:50,507 [myid:] - INFO  [main:ZooKeeper@684] - Session: 0x15a784baeb70000 closed
    [junit] 2017-02-26 02:41:50,507 [myid:] - INFO  [main:ClientBase@492] - STOPPING server
    [junit] 2017-02-26 02:41:50,508 [myid:] - INFO  [main-EventThread:ClientCnxn$EventThread@519] - EventThread shut down for session: 0x15a784baeb70000
    [junit] 2017-02-26 02:41:50,508 [myid:] - INFO  [NIOServerCxn.Factory:0.0.0.0/0.0.0.0:11221:NIOServerCnxnFactory@219] - NIOServerCnxn factory exited run method
    [junit] 2017-02-26 02:41:50,508 [myid:] - INFO  [main:ZooKeeperServer@505] - shutting down
    [junit] 2017-02-26 02:41:50,508 [myid:] - ERROR [main:ZooKeeperServer@472] - ZKShutdownHandler is not registered, so ZooKeeper server won't take any action on ERROR or SHUTDOWN server state changes
    [junit] 2017-02-26 02:41:50,509 [myid:] - INFO  [main:SessionTrackerImpl@225] - Shutting down
    [junit] 2017-02-26 02:41:50,509 [myid:] - INFO  [main:PrepRequestProcessor@764] - Shutting down
    [junit] 2017-02-26 02:41:50,509 [myid:] - INFO  [main:SyncRequestProcessor@208] - Shutting down
    [junit] 2017-02-26 02:41:50,509 [myid:] - INFO  [ProcessThread(sid:0 cport:11221)::PrepRequestProcessor@143] - PrepRequestProcessor exited loop!
    [junit] 2017-02-26 02:41:50,509 [myid:] - INFO  [SyncThread:0:SyncRequestProcessor@186] - SyncRequestProcessor exited!
    [junit] 2017-02-26 02:41:50,510 [myid:] - INFO  [main:FinalRequestProcessor@402] - shutdown of request processor complete
    [junit] 2017-02-26 02:41:50,510 [myid:] - INFO  [main:FourLetterWordMain@62] - connecting to 127.0.0.1 11221
    [junit] 2017-02-26 02:41:50,511 [myid:] - INFO  [main:JMXEnv@147] - ensureOnly:[]
    [junit] 2017-02-26 02:41:50,515 [myid:] - INFO  [main:ClientBase@547] - fdcount after test is: 90 at start it was 78
    [junit] 2017-02-26 02:41:50,516 [myid:] - INFO  [main:ClientBase@549] - sleeping for 20 secs
    [junit] 2017-02-26 02:41:50,517 [myid:] - INFO  [main:ZKTestCase$1@65] - SUCCEEDED testQuota
    [junit] 2017-02-26 02:41:50,517 [myid:] - INFO  [main:ZKTestCase$1@60] - FINISHED testQuota
    [junit] Tests run: 1, Failures: 0, Errors: 0, Skipped: 0, Time elapsed: 0.559 sec

fail.build.on.test.failure:

BUILD FAILED
/home/jenkins/jenkins-slave/workspace/ZooKeeper_branch34_jdk7/build.xml:1328: The following error occurred while executing this line:
/home/jenkins/jenkins-slave/workspace/ZooKeeper_branch34_jdk7/build.xml:1331: Tests failed!

Total time: 29 minutes 10 seconds
Build step 'Invoke Ant' marked build as failure
Recording test results
Email was triggered for: Failure - Any
Sending email for trigger: Failure - Any



###################################################################################
############################## FAILED TESTS (if any) ##############################
2 tests failed.
FAILED:  org.apache.zookeeper.server.quorum.auth.QuorumKerberosAuthTest.testValidCredentials

Error Message:
waiting for server 0 being up

Stack Trace:
junit.framework.AssertionFailedError: waiting for server 0 being up
	at org.apache.zookeeper.server.quorum.auth.QuorumAuthTestBase.startQuorum(QuorumAuthTestBase.java:74)
	at org.apache.zookeeper.server.quorum.auth.QuorumKerberosAuthTest.testValidCredentials(QuorumKerberosAuthTest.java:101)
	at org.apache.zookeeper.JUnit4ZKTestRunner$LoggedInvokeMethod.evaluate(JUnit4ZKTestRunner.java:55)


FAILED:  org.apache.zookeeper.server.quorum.auth.QuorumKerberosHostBasedAuthTest.testConnectBadServer

Error Message:
waiting for server 0 being up

Stack Trace:
junit.framework.AssertionFailedError: waiting for server 0 being up
	at org.apache.zookeeper.server.quorum.auth.QuorumAuthTestBase.startQuorum(QuorumAuthTestBase.java:74)
	at org.apache.zookeeper.server.quorum.auth.QuorumKerberosHostBasedAuthTest.testConnectBadServer(QuorumKerberosHostBasedAuthTest.java:146)
	at org.apache.zookeeper.JUnit4ZKTestRunner$LoggedInvokeMethod.evaluate(JUnit4ZKTestRunner.java:55)



ZooKeeper_branch34_jdk7 - Build # 1418 - Still Failing

Posted by Apache Jenkins Server <je...@builds.apache.org>.
See https://builds.apache.org/job/ZooKeeper_branch34_jdk7/1418/

###################################################################################
########################## LAST 60 LINES OF THE CONSOLE ###########################
[...truncated 31.60 MB...]
    [junit] 2017-02-25 02:42:08,621 [myid:] - INFO  [main:SessionTrackerImpl@225] - Shutting down
    [junit] 2017-02-25 02:42:08,621 [myid:] - INFO  [main:PrepRequestProcessor@764] - Shutting down
    [junit] 2017-02-25 02:42:08,621 [myid:] - INFO  [main:SyncRequestProcessor@208] - Shutting down
    [junit] 2017-02-25 02:42:08,622 [myid:] - INFO  [ProcessThread(sid:0 cport:11221)::PrepRequestProcessor@143] - PrepRequestProcessor exited loop!
    [junit] 2017-02-25 02:42:08,622 [myid:] - INFO  [SyncThread:0:SyncRequestProcessor@186] - SyncRequestProcessor exited!
    [junit] 2017-02-25 02:42:08,622 [myid:] - INFO  [main:FinalRequestProcessor@402] - shutdown of request processor complete
    [junit] 2017-02-25 02:42:08,623 [myid:] - INFO  [main:FourLetterWordMain@62] - connecting to 127.0.0.1 11221
    [junit] 2017-02-25 02:42:08,623 [myid:] - INFO  [main:JMXEnv@147] - ensureOnly:[]
    [junit] 2017-02-25 02:42:08,625 [myid:] - INFO  [main:ClientBase@445] - STARTING server
    [junit] 2017-02-25 02:42:08,625 [myid:] - INFO  [main:ClientBase@366] - CREATING server instance 127.0.0.1:11221
    [junit] 2017-02-25 02:42:08,626 [myid:] - INFO  [main:NIOServerCnxnFactory@89] - binding to port 0.0.0.0/0.0.0.0:11221
    [junit] 2017-02-25 02:42:08,626 [myid:] - INFO  [main:ClientBase@341] - STARTING server instance 127.0.0.1:11221
    [junit] 2017-02-25 02:42:08,627 [myid:] - INFO  [main:ZooKeeperServer@173] - Created server with tickTime 3000 minSessionTimeout 6000 maxSessionTimeout 60000 datadir /home/jenkins/jenkins-slave/workspace/ZooKeeper_branch34_jdk7/build/test/tmp/test825113098905741303.junit.dir/version-2 snapdir /home/jenkins/jenkins-slave/workspace/ZooKeeper_branch34_jdk7/build/test/tmp/test825113098905741303.junit.dir/version-2
    [junit] 2017-02-25 02:42:08,631 [myid:] - ERROR [main:ZooKeeperServer@472] - ZKShutdownHandler is not registered, so ZooKeeper server won't take any action on ERROR or SHUTDOWN server state changes
    [junit] 2017-02-25 02:42:08,632 [myid:] - INFO  [main:FourLetterWordMain@62] - connecting to 127.0.0.1 11221
    [junit] 2017-02-25 02:42:08,632 [myid:] - INFO  [NIOServerCxn.Factory:0.0.0.0/0.0.0.0:11221:NIOServerCnxnFactory@192] - Accepted socket connection from /127.0.0.1:60228
    [junit] 2017-02-25 02:42:08,632 [myid:] - INFO  [NIOServerCxn.Factory:0.0.0.0/0.0.0.0:11221:NIOServerCnxn@838] - Processing stat command from /127.0.0.1:60228
    [junit] 2017-02-25 02:42:08,633 [myid:] - INFO  [Thread-4:NIOServerCnxn$StatCommand@674] - Stat command output
    [junit] 2017-02-25 02:42:08,633 [myid:] - INFO  [Thread-4:NIOServerCnxn@1019] - Closed socket connection for client /127.0.0.1:60228 (no session established for client)
    [junit] 2017-02-25 02:42:08,634 [myid:] - INFO  [main:JMXEnv@230] - ensureParent:[InMemoryDataTree, StandaloneServer_port]
    [junit] 2017-02-25 02:42:08,636 [myid:] - INFO  [main:JMXEnv@247] - expect:InMemoryDataTree
    [junit] 2017-02-25 02:42:08,636 [myid:] - INFO  [main:JMXEnv@251] - found:InMemoryDataTree org.apache.ZooKeeperService:name0=StandaloneServer_port11221,name1=InMemoryDataTree
    [junit] 2017-02-25 02:42:08,636 [myid:] - INFO  [main:JMXEnv@247] - expect:StandaloneServer_port
    [junit] 2017-02-25 02:42:08,636 [myid:] - INFO  [main:JMXEnv@251] - found:StandaloneServer_port org.apache.ZooKeeperService:name0=StandaloneServer_port11221
    [junit] 2017-02-25 02:42:08,636 [myid:] - INFO  [main:JUnit4ZKTestRunner$LoggedInvokeMethod@58] - Memory used 35676
    [junit] 2017-02-25 02:42:08,637 [myid:] - INFO  [main:JUnit4ZKTestRunner$LoggedInvokeMethod@63] - Number of threads 20
    [junit] 2017-02-25 02:42:08,637 [myid:] - INFO  [main:JUnit4ZKTestRunner$LoggedInvokeMethod@78] - FINISHED TEST METHOD testQuota
    [junit] 2017-02-25 02:42:08,637 [myid:] - INFO  [main:ClientBase@522] - tearDown starting
    [junit] 2017-02-25 02:42:08,702 [myid:] - INFO  [main:ZooKeeper@684] - Session: 0x15a732599dc0000 closed
    [junit] 2017-02-25 02:42:08,702 [myid:] - INFO  [main:ClientBase@492] - STOPPING server
    [junit] 2017-02-25 02:42:08,702 [myid:] - INFO  [main-EventThread:ClientCnxn$EventThread@519] - EventThread shut down for session: 0x15a732599dc0000
    [junit] 2017-02-25 02:42:08,702 [myid:] - INFO  [NIOServerCxn.Factory:0.0.0.0/0.0.0.0:11221:NIOServerCnxnFactory@219] - NIOServerCnxn factory exited run method
    [junit] 2017-02-25 02:42:08,703 [myid:] - INFO  [main:ZooKeeperServer@505] - shutting down
    [junit] 2017-02-25 02:42:08,703 [myid:] - ERROR [main:ZooKeeperServer@472] - ZKShutdownHandler is not registered, so ZooKeeper server won't take any action on ERROR or SHUTDOWN server state changes
    [junit] 2017-02-25 02:42:08,703 [myid:] - INFO  [main:SessionTrackerImpl@225] - Shutting down
    [junit] 2017-02-25 02:42:08,703 [myid:] - INFO  [main:PrepRequestProcessor@764] - Shutting down
    [junit] 2017-02-25 02:42:08,703 [myid:] - INFO  [main:SyncRequestProcessor@208] - Shutting down
    [junit] 2017-02-25 02:42:08,704 [myid:] - INFO  [ProcessThread(sid:0 cport:11221)::PrepRequestProcessor@143] - PrepRequestProcessor exited loop!
    [junit] 2017-02-25 02:42:08,704 [myid:] - INFO  [SyncThread:0:SyncRequestProcessor@186] - SyncRequestProcessor exited!
    [junit] 2017-02-25 02:42:08,704 [myid:] - INFO  [main:FinalRequestProcessor@402] - shutdown of request processor complete
    [junit] 2017-02-25 02:42:08,705 [myid:] - INFO  [main:FourLetterWordMain@62] - connecting to 127.0.0.1 11221
    [junit] 2017-02-25 02:42:08,705 [myid:] - INFO  [main:JMXEnv@147] - ensureOnly:[]
    [junit] 2017-02-25 02:42:08,709 [myid:] - INFO  [main:ClientBase@547] - fdcount after test is: 90 at start it was 78
    [junit] 2017-02-25 02:42:08,709 [myid:] - INFO  [main:ClientBase@549] - sleeping for 20 secs
    [junit] 2017-02-25 02:42:08,709 [myid:] - INFO  [main:ZKTestCase$1@65] - SUCCEEDED testQuota
    [junit] 2017-02-25 02:42:08,710 [myid:] - INFO  [main:ZKTestCase$1@60] - FINISHED testQuota
    [junit] Tests run: 1, Failures: 0, Errors: 0, Skipped: 0, Time elapsed: 0.568 sec

fail.build.on.test.failure:

BUILD FAILED
/home/jenkins/jenkins-slave/workspace/ZooKeeper_branch34_jdk7/build.xml:1328: The following error occurred while executing this line:
/home/jenkins/jenkins-slave/workspace/ZooKeeper_branch34_jdk7/build.xml:1331: Tests failed!

Total time: 30 minutes 0 seconds
Build step 'Invoke Ant' marked build as failure
Recording test results
Email was triggered for: Failure - Any
Sending email for trigger: Failure - Any



###################################################################################
############################## FAILED TESTS (if any) ##############################
4 tests failed.
FAILED:  org.apache.zookeeper.test.ReadOnlyModeTest.testSessionEstablishment

Error Message:
KeeperErrorCode = ConnectionLoss for /test

Stack Trace:
org.apache.zookeeper.KeeperException$ConnectionLossException: KeeperErrorCode = ConnectionLoss for /test
	at org.apache.zookeeper.KeeperException.create(KeeperException.java:99)
	at org.apache.zookeeper.KeeperException.create(KeeperException.java:51)
	at org.apache.zookeeper.ZooKeeper.create(ZooKeeper.java:783)
	at org.apache.zookeeper.test.ReadOnlyModeTest.testSessionEstablishment(ReadOnlyModeTest.java:216)
	at org.apache.zookeeper.JUnit4ZKTestRunner$LoggedInvokeMethod.evaluate(JUnit4ZKTestRunner.java:55)


FAILED:  org.apache.zookeeper.server.quorum.auth.QuorumKerberosAuthTest.testValidCredentials

Error Message:
waiting for server 0 being up

Stack Trace:
junit.framework.AssertionFailedError: waiting for server 0 being up
	at org.apache.zookeeper.server.quorum.auth.QuorumAuthTestBase.startQuorum(QuorumAuthTestBase.java:74)
	at org.apache.zookeeper.server.quorum.auth.QuorumKerberosAuthTest.testValidCredentials(QuorumKerberosAuthTest.java:101)
	at org.apache.zookeeper.JUnit4ZKTestRunner$LoggedInvokeMethod.evaluate(JUnit4ZKTestRunner.java:55)


FAILED:  org.apache.zookeeper.server.quorum.auth.QuorumKerberosHostBasedAuthTest.testValidCredentials

Error Message:
waiting for server 0 being up

Stack Trace:
junit.framework.AssertionFailedError: waiting for server 0 being up
	at org.apache.zookeeper.server.quorum.auth.QuorumAuthTestBase.startQuorum(QuorumAuthTestBase.java:74)
	at org.apache.zookeeper.server.quorum.auth.QuorumKerberosHostBasedAuthTest.testValidCredentials(QuorumKerberosHostBasedAuthTest.java:125)
	at org.apache.zookeeper.JUnit4ZKTestRunner$LoggedInvokeMethod.evaluate(JUnit4ZKTestRunner.java:55)


FAILED:  org.apache.zookeeper.server.quorum.auth.QuorumKerberosHostBasedAuthTest.testConnectBadServer

Error Message:
waiting for server 0 being up

Stack Trace:
junit.framework.AssertionFailedError: waiting for server 0 being up
	at org.apache.zookeeper.server.quorum.auth.QuorumAuthTestBase.startQuorum(QuorumAuthTestBase.java:74)
	at org.apache.zookeeper.server.quorum.auth.QuorumKerberosHostBasedAuthTest.testConnectBadServer(QuorumKerberosHostBasedAuthTest.java:146)
	at org.apache.zookeeper.JUnit4ZKTestRunner$LoggedInvokeMethod.evaluate(JUnit4ZKTestRunner.java:55)



ZooKeeper_branch34_jdk7 - Build # 1417 - Still Failing

Posted by Apache Jenkins Server <je...@builds.apache.org>.
See https://builds.apache.org/job/ZooKeeper_branch34_jdk7/1417/

###################################################################################
########################## LAST 60 LINES OF THE CONSOLE ###########################
[...truncated 31.45 MB...]
    [junit] 2017-02-24 03:18:48,202 [myid:] - INFO  [main:SessionTrackerImpl@225] - Shutting down
    [junit] 2017-02-24 03:18:48,202 [myid:] - INFO  [main:PrepRequestProcessor@764] - Shutting down
    [junit] 2017-02-24 03:18:48,202 [myid:] - INFO  [main:SyncRequestProcessor@208] - Shutting down
    [junit] 2017-02-24 03:18:48,203 [myid:] - INFO  [ProcessThread(sid:0 cport:11221)::PrepRequestProcessor@143] - PrepRequestProcessor exited loop!
    [junit] 2017-02-24 03:18:48,203 [myid:] - INFO  [SyncThread:0:SyncRequestProcessor@186] - SyncRequestProcessor exited!
    [junit] 2017-02-24 03:18:48,203 [myid:] - INFO  [main:FinalRequestProcessor@402] - shutdown of request processor complete
    [junit] 2017-02-24 03:18:48,204 [myid:] - INFO  [main:FourLetterWordMain@62] - connecting to 127.0.0.1 11221
    [junit] 2017-02-24 03:18:48,205 [myid:] - INFO  [main:JMXEnv@147] - ensureOnly:[]
    [junit] 2017-02-24 03:18:48,206 [myid:] - INFO  [main:ClientBase@445] - STARTING server
    [junit] 2017-02-24 03:18:48,207 [myid:] - INFO  [main:ClientBase@366] - CREATING server instance 127.0.0.1:11221
    [junit] 2017-02-24 03:18:48,207 [myid:] - INFO  [main:NIOServerCnxnFactory@89] - binding to port 0.0.0.0/0.0.0.0:11221
    [junit] 2017-02-24 03:18:48,207 [myid:] - INFO  [main:ClientBase@341] - STARTING server instance 127.0.0.1:11221
    [junit] 2017-02-24 03:18:48,208 [myid:] - INFO  [main:ZooKeeperServer@173] - Created server with tickTime 3000 minSessionTimeout 6000 maxSessionTimeout 60000 datadir /home/jenkins/jenkins-slave/workspace/ZooKeeper_branch34_jdk7/build/test/tmp/test8154036818694650824.junit.dir/version-2 snapdir /home/jenkins/jenkins-slave/workspace/ZooKeeper_branch34_jdk7/build/test/tmp/test8154036818694650824.junit.dir/version-2
    [junit] 2017-02-24 03:18:48,213 [myid:] - ERROR [main:ZooKeeperServer@472] - ZKShutdownHandler is not registered, so ZooKeeper server won't take any action on ERROR or SHUTDOWN server state changes
    [junit] 2017-02-24 03:18:48,213 [myid:] - INFO  [main:FourLetterWordMain@62] - connecting to 127.0.0.1 11221
    [junit] 2017-02-24 03:18:48,214 [myid:] - INFO  [NIOServerCxn.Factory:0.0.0.0/0.0.0.0:11221:NIOServerCnxnFactory@192] - Accepted socket connection from /127.0.0.1:42378
    [junit] 2017-02-24 03:18:48,214 [myid:] - INFO  [NIOServerCxn.Factory:0.0.0.0/0.0.0.0:11221:NIOServerCnxn@838] - Processing stat command from /127.0.0.1:42378
    [junit] 2017-02-24 03:18:48,215 [myid:] - INFO  [Thread-4:NIOServerCnxn$StatCommand@674] - Stat command output
    [junit] 2017-02-24 03:18:48,215 [myid:] - INFO  [Thread-4:NIOServerCnxn@1019] - Closed socket connection for client /127.0.0.1:42378 (no session established for client)
    [junit] 2017-02-24 03:18:48,215 [myid:] - INFO  [main:JMXEnv@230] - ensureParent:[InMemoryDataTree, StandaloneServer_port]
    [junit] 2017-02-24 03:18:48,218 [myid:] - INFO  [main:JMXEnv@247] - expect:InMemoryDataTree
    [junit] 2017-02-24 03:18:48,218 [myid:] - INFO  [main:JMXEnv@251] - found:InMemoryDataTree org.apache.ZooKeeperService:name0=StandaloneServer_port11221,name1=InMemoryDataTree
    [junit] 2017-02-24 03:18:48,218 [myid:] - INFO  [main:JMXEnv@247] - expect:StandaloneServer_port
    [junit] 2017-02-24 03:18:48,218 [myid:] - INFO  [main:JMXEnv@251] - found:StandaloneServer_port org.apache.ZooKeeperService:name0=StandaloneServer_port11221
    [junit] 2017-02-24 03:18:48,219 [myid:] - INFO  [main:JUnit4ZKTestRunner$LoggedInvokeMethod@58] - Memory used 35675
    [junit] 2017-02-24 03:18:48,219 [myid:] - INFO  [main:JUnit4ZKTestRunner$LoggedInvokeMethod@63] - Number of threads 20
    [junit] 2017-02-24 03:18:48,219 [myid:] - INFO  [main:JUnit4ZKTestRunner$LoggedInvokeMethod@78] - FINISHED TEST METHOD testQuota
    [junit] 2017-02-24 03:18:48,219 [myid:] - INFO  [main:ClientBase@522] - tearDown starting
    [junit] 2017-02-24 03:18:48,284 [myid:] - INFO  [main:ZooKeeper@684] - Session: 0x15a6e20cd7e0000 closed
    [junit] 2017-02-24 03:18:48,284 [myid:] - INFO  [main:ClientBase@492] - STOPPING server
    [junit] 2017-02-24 03:18:48,284 [myid:] - INFO  [main-EventThread:ClientCnxn$EventThread@519] - EventThread shut down for session: 0x15a6e20cd7e0000
    [junit] 2017-02-24 03:18:48,284 [myid:] - INFO  [NIOServerCxn.Factory:0.0.0.0/0.0.0.0:11221:NIOServerCnxnFactory@219] - NIOServerCnxn factory exited run method
    [junit] 2017-02-24 03:18:48,285 [myid:] - INFO  [main:ZooKeeperServer@505] - shutting down
    [junit] 2017-02-24 03:18:48,285 [myid:] - ERROR [main:ZooKeeperServer@472] - ZKShutdownHandler is not registered, so ZooKeeper server won't take any action on ERROR or SHUTDOWN server state changes
    [junit] 2017-02-24 03:18:48,285 [myid:] - INFO  [main:SessionTrackerImpl@225] - Shutting down
    [junit] 2017-02-24 03:18:48,285 [myid:] - INFO  [main:PrepRequestProcessor@764] - Shutting down
    [junit] 2017-02-24 03:18:48,285 [myid:] - INFO  [main:SyncRequestProcessor@208] - Shutting down
    [junit] 2017-02-24 03:18:48,286 [myid:] - INFO  [ProcessThread(sid:0 cport:11221)::PrepRequestProcessor@143] - PrepRequestProcessor exited loop!
    [junit] 2017-02-24 03:18:48,286 [myid:] - INFO  [SyncThread:0:SyncRequestProcessor@186] - SyncRequestProcessor exited!
    [junit] 2017-02-24 03:18:48,286 [myid:] - INFO  [main:FinalRequestProcessor@402] - shutdown of request processor complete
    [junit] 2017-02-24 03:18:48,287 [myid:] - INFO  [main:FourLetterWordMain@62] - connecting to 127.0.0.1 11221
    [junit] 2017-02-24 03:18:48,288 [myid:] - INFO  [main:JMXEnv@147] - ensureOnly:[]
    [junit] 2017-02-24 03:18:48,292 [myid:] - INFO  [main:ClientBase@547] - fdcount after test is: 90 at start it was 78
    [junit] 2017-02-24 03:18:48,293 [myid:] - INFO  [main:ClientBase@549] - sleeping for 20 secs
    [junit] 2017-02-24 03:18:48,293 [myid:] - INFO  [main:ZKTestCase$1@65] - SUCCEEDED testQuota
    [junit] 2017-02-24 03:18:48,294 [myid:] - INFO  [main:ZKTestCase$1@60] - FINISHED testQuota
    [junit] Tests run: 1, Failures: 0, Errors: 0, Skipped: 0, Time elapsed: 0.687 sec

fail.build.on.test.failure:

BUILD FAILED
/home/jenkins/jenkins-slave/workspace/ZooKeeper_branch34_jdk7/build.xml:1328: The following error occurred while executing this line:
/home/jenkins/jenkins-slave/workspace/ZooKeeper_branch34_jdk7/build.xml:1331: Tests failed!

Total time: 40 minutes 38 seconds
Build step 'Invoke Ant' marked build as failure
Recording test results
Email was triggered for: Failure - Any
Sending email for trigger: Failure - Any



###################################################################################
############################## FAILED TESTS (if any) ##############################
4 tests failed.
FAILED:  org.apache.zookeeper.test.FollowerTest.testNoLogBeforeLeaderEstablishment

Error Message:
Not following

Stack Trace:
junit.framework.AssertionFailedError: Not following
	at org.apache.zookeeper.test.FollowerTest.testNoLogBeforeLeaderEstablishment(FollowerTest.java:181)
	at org.apache.zookeeper.JUnit4ZKTestRunner$LoggedInvokeMethod.evaluate(JUnit4ZKTestRunner.java:55)


FAILED:  org.apache.zookeeper.server.quorum.auth.QuorumKerberosAuthTest.testValidCredentials

Error Message:
waiting for server 2 being up

Stack Trace:
junit.framework.AssertionFailedError: waiting for server 2 being up
	at org.apache.zookeeper.server.quorum.auth.QuorumAuthTestBase.startQuorum(QuorumAuthTestBase.java:74)
	at org.apache.zookeeper.server.quorum.auth.QuorumKerberosAuthTest.testValidCredentials(QuorumKerberosAuthTest.java:101)
	at org.apache.zookeeper.JUnit4ZKTestRunner$LoggedInvokeMethod.evaluate(JUnit4ZKTestRunner.java:55)


FAILED:  org.apache.zookeeper.server.quorum.auth.QuorumKerberosHostBasedAuthTest.testValidCredentials

Error Message:
waiting for server 1 being up

Stack Trace:
junit.framework.AssertionFailedError: waiting for server 1 being up
	at org.apache.zookeeper.server.quorum.auth.QuorumAuthTestBase.startQuorum(QuorumAuthTestBase.java:74)
	at org.apache.zookeeper.server.quorum.auth.QuorumKerberosHostBasedAuthTest.testValidCredentials(QuorumKerberosHostBasedAuthTest.java:125)
	at org.apache.zookeeper.JUnit4ZKTestRunner$LoggedInvokeMethod.evaluate(JUnit4ZKTestRunner.java:55)


FAILED:  org.apache.zookeeper.server.quorum.auth.QuorumKerberosHostBasedAuthTest.testConnectBadServer

Error Message:
waiting for server 1 being up

Stack Trace:
junit.framework.AssertionFailedError: waiting for server 1 being up
	at org.apache.zookeeper.server.quorum.auth.QuorumAuthTestBase.startQuorum(QuorumAuthTestBase.java:74)
	at org.apache.zookeeper.server.quorum.auth.QuorumKerberosHostBasedAuthTest.testConnectBadServer(QuorumKerberosHostBasedAuthTest.java:146)
	at org.apache.zookeeper.JUnit4ZKTestRunner$LoggedInvokeMethod.evaluate(JUnit4ZKTestRunner.java:55)



ZooKeeper_branch34_jdk7 - Build # 1416 - Still Failing

Posted by Apache Jenkins Server <je...@builds.apache.org>.
See https://builds.apache.org/job/ZooKeeper_branch34_jdk7/1416/

###################################################################################
########################## LAST 60 LINES OF THE CONSOLE ###########################
[...truncated 31.17 MB...]
    [junit] 2017-02-23 02:42:30,176 [myid:] - INFO  [main:SessionTrackerImpl@225] - Shutting down
    [junit] 2017-02-23 02:42:30,176 [myid:] - INFO  [main:PrepRequestProcessor@764] - Shutting down
    [junit] 2017-02-23 02:42:30,176 [myid:] - INFO  [main:SyncRequestProcessor@208] - Shutting down
    [junit] 2017-02-23 02:42:30,177 [myid:] - INFO  [ProcessThread(sid:0 cport:11221)::PrepRequestProcessor@143] - PrepRequestProcessor exited loop!
    [junit] 2017-02-23 02:42:30,177 [myid:] - INFO  [SyncThread:0:SyncRequestProcessor@186] - SyncRequestProcessor exited!
    [junit] 2017-02-23 02:42:30,177 [myid:] - INFO  [main:FinalRequestProcessor@402] - shutdown of request processor complete
    [junit] 2017-02-23 02:42:30,178 [myid:] - INFO  [main:FourLetterWordMain@62] - connecting to 127.0.0.1 11221
    [junit] 2017-02-23 02:42:30,178 [myid:] - INFO  [main:JMXEnv@147] - ensureOnly:[]
    [junit] 2017-02-23 02:42:30,179 [myid:] - INFO  [main:ClientBase@445] - STARTING server
    [junit] 2017-02-23 02:42:30,180 [myid:] - INFO  [main:ClientBase@366] - CREATING server instance 127.0.0.1:11221
    [junit] 2017-02-23 02:42:30,180 [myid:] - INFO  [main:NIOServerCnxnFactory@89] - binding to port 0.0.0.0/0.0.0.0:11221
    [junit] 2017-02-23 02:42:30,180 [myid:] - INFO  [main:ClientBase@341] - STARTING server instance 127.0.0.1:11221
    [junit] 2017-02-23 02:42:30,181 [myid:] - INFO  [main:ZooKeeperServer@173] - Created server with tickTime 3000 minSessionTimeout 6000 maxSessionTimeout 60000 datadir /home/jenkins/jenkins-slave/workspace/ZooKeeper_branch34_jdk7/build/test/tmp/test669065517919943617.junit.dir/version-2 snapdir /home/jenkins/jenkins-slave/workspace/ZooKeeper_branch34_jdk7/build/test/tmp/test669065517919943617.junit.dir/version-2
    [junit] 2017-02-23 02:42:30,184 [myid:] - ERROR [main:ZooKeeperServer@472] - ZKShutdownHandler is not registered, so ZooKeeper server won't take any action on ERROR or SHUTDOWN server state changes
    [junit] 2017-02-23 02:42:30,184 [myid:] - INFO  [main:FourLetterWordMain@62] - connecting to 127.0.0.1 11221
    [junit] 2017-02-23 02:42:30,185 [myid:] - INFO  [NIOServerCxn.Factory:0.0.0.0/0.0.0.0:11221:NIOServerCnxnFactory@192] - Accepted socket connection from /127.0.0.1:36486
    [junit] 2017-02-23 02:42:30,185 [myid:] - INFO  [NIOServerCxn.Factory:0.0.0.0/0.0.0.0:11221:NIOServerCnxn@838] - Processing stat command from /127.0.0.1:36486
    [junit] 2017-02-23 02:42:30,186 [myid:] - INFO  [Thread-4:NIOServerCnxn$StatCommand@674] - Stat command output
    [junit] 2017-02-23 02:42:30,186 [myid:] - INFO  [Thread-4:NIOServerCnxn@1019] - Closed socket connection for client /127.0.0.1:36486 (no session established for client)
    [junit] 2017-02-23 02:42:30,186 [myid:] - INFO  [main:JMXEnv@230] - ensureParent:[InMemoryDataTree, StandaloneServer_port]
    [junit] 2017-02-23 02:42:30,188 [myid:] - INFO  [main:JMXEnv@247] - expect:InMemoryDataTree
    [junit] 2017-02-23 02:42:30,188 [myid:] - INFO  [main:JMXEnv@251] - found:InMemoryDataTree org.apache.ZooKeeperService:name0=StandaloneServer_port11221,name1=InMemoryDataTree
    [junit] 2017-02-23 02:42:30,188 [myid:] - INFO  [main:JMXEnv@247] - expect:StandaloneServer_port
    [junit] 2017-02-23 02:42:30,188 [myid:] - INFO  [main:JMXEnv@251] - found:StandaloneServer_port org.apache.ZooKeeperService:name0=StandaloneServer_port11221
    [junit] 2017-02-23 02:42:30,189 [myid:] - INFO  [main:JUnit4ZKTestRunner$LoggedInvokeMethod@58] - Memory used 35676
    [junit] 2017-02-23 02:42:30,189 [myid:] - INFO  [main:JUnit4ZKTestRunner$LoggedInvokeMethod@63] - Number of threads 20
    [junit] 2017-02-23 02:42:30,189 [myid:] - INFO  [main:JUnit4ZKTestRunner$LoggedInvokeMethod@78] - FINISHED TEST METHOD testQuota
    [junit] 2017-02-23 02:42:30,189 [myid:] - INFO  [main:ClientBase@522] - tearDown starting
    [junit] 2017-02-23 02:42:30,256 [myid:] - INFO  [main:ZooKeeper@684] - Session: 0x15a68d936080000 closed
    [junit] 2017-02-23 02:42:30,257 [myid:] - INFO  [main:ClientBase@492] - STOPPING server
    [junit] 2017-02-23 02:42:30,257 [myid:] - INFO  [main-EventThread:ClientCnxn$EventThread@519] - EventThread shut down for session: 0x15a68d936080000
    [junit] 2017-02-23 02:42:30,257 [myid:] - INFO  [NIOServerCxn.Factory:0.0.0.0/0.0.0.0:11221:NIOServerCnxnFactory@219] - NIOServerCnxn factory exited run method
    [junit] 2017-02-23 02:42:30,257 [myid:] - INFO  [main:ZooKeeperServer@505] - shutting down
    [junit] 2017-02-23 02:42:30,257 [myid:] - ERROR [main:ZooKeeperServer@472] - ZKShutdownHandler is not registered, so ZooKeeper server won't take any action on ERROR or SHUTDOWN server state changes
    [junit] 2017-02-23 02:42:30,258 [myid:] - INFO  [main:SessionTrackerImpl@225] - Shutting down
    [junit] 2017-02-23 02:42:30,258 [myid:] - INFO  [main:PrepRequestProcessor@764] - Shutting down
    [junit] 2017-02-23 02:42:30,258 [myid:] - INFO  [main:SyncRequestProcessor@208] - Shutting down
    [junit] 2017-02-23 02:42:30,259 [myid:] - INFO  [ProcessThread(sid:0 cport:11221)::PrepRequestProcessor@143] - PrepRequestProcessor exited loop!
    [junit] 2017-02-23 02:42:30,259 [myid:] - INFO  [SyncThread:0:SyncRequestProcessor@186] - SyncRequestProcessor exited!
    [junit] 2017-02-23 02:42:30,259 [myid:] - INFO  [main:FinalRequestProcessor@402] - shutdown of request processor complete
    [junit] 2017-02-23 02:42:30,260 [myid:] - INFO  [main:FourLetterWordMain@62] - connecting to 127.0.0.1 11221
    [junit] 2017-02-23 02:42:30,261 [myid:] - INFO  [main:JMXEnv@147] - ensureOnly:[]
    [junit] 2017-02-23 02:42:30,265 [myid:] - INFO  [main:ClientBase@547] - fdcount after test is: 90 at start it was 78
    [junit] 2017-02-23 02:42:30,265 [myid:] - INFO  [main:ClientBase@549] - sleeping for 20 secs
    [junit] 2017-02-23 02:42:30,266 [myid:] - INFO  [main:ZKTestCase$1@65] - SUCCEEDED testQuota
    [junit] 2017-02-23 02:42:30,266 [myid:] - INFO  [main:ZKTestCase$1@60] - FINISHED testQuota
    [junit] Tests run: 1, Failures: 0, Errors: 0, Skipped: 0, Time elapsed: 0.597 sec

fail.build.on.test.failure:

BUILD FAILED
/home/jenkins/jenkins-slave/workspace/ZooKeeper_branch34_jdk7/build.xml:1328: The following error occurred while executing this line:
/home/jenkins/jenkins-slave/workspace/ZooKeeper_branch34_jdk7/build.xml:1331: Tests failed!

Total time: 29 minutes 32 seconds
Build step 'Invoke Ant' marked build as failure
Recording test results
Email was triggered for: Failure - Any
Sending email for trigger: Failure - Any



###################################################################################
############################## FAILED TESTS (if any) ##############################
3 tests failed.
FAILED:  org.apache.zookeeper.server.quorum.auth.QuorumKerberosAuthTest.testValidCredentials

Error Message:
waiting for server 0 being up

Stack Trace:
junit.framework.AssertionFailedError: waiting for server 0 being up
	at org.apache.zookeeper.server.quorum.auth.QuorumAuthTestBase.startQuorum(QuorumAuthTestBase.java:74)
	at org.apache.zookeeper.server.quorum.auth.QuorumKerberosAuthTest.testValidCredentials(QuorumKerberosAuthTest.java:101)
	at org.apache.zookeeper.JUnit4ZKTestRunner$LoggedInvokeMethod.evaluate(JUnit4ZKTestRunner.java:55)


FAILED:  org.apache.zookeeper.server.quorum.auth.QuorumKerberosHostBasedAuthTest.testValidCredentials

Error Message:
waiting for server 0 being up

Stack Trace:
junit.framework.AssertionFailedError: waiting for server 0 being up
	at org.apache.zookeeper.server.quorum.auth.QuorumAuthTestBase.startQuorum(QuorumAuthTestBase.java:74)
	at org.apache.zookeeper.server.quorum.auth.QuorumKerberosHostBasedAuthTest.testValidCredentials(QuorumKerberosHostBasedAuthTest.java:125)
	at org.apache.zookeeper.JUnit4ZKTestRunner$LoggedInvokeMethod.evaluate(JUnit4ZKTestRunner.java:55)


FAILED:  org.apache.zookeeper.server.quorum.auth.QuorumKerberosHostBasedAuthTest.testConnectBadServer

Error Message:
waiting for server 2 being up

Stack Trace:
junit.framework.AssertionFailedError: waiting for server 2 being up
	at org.apache.zookeeper.server.quorum.auth.QuorumAuthTestBase.startQuorum(QuorumAuthTestBase.java:74)
	at org.apache.zookeeper.server.quorum.auth.QuorumKerberosHostBasedAuthTest.testConnectBadServer(QuorumKerberosHostBasedAuthTest.java:146)
	at org.apache.zookeeper.JUnit4ZKTestRunner$LoggedInvokeMethod.evaluate(JUnit4ZKTestRunner.java:55)



ZooKeeper_branch34_jdk7 - Build # 1415 - Still Failing

Posted by Apache Jenkins Server <je...@builds.apache.org>.
See https://builds.apache.org/job/ZooKeeper_branch34_jdk7/1415/

###################################################################################
########################## LAST 60 LINES OF THE CONSOLE ###########################
[...truncated 31.34 MB...]
    [junit] 2017-02-22 02:42:03,073 [myid:] - INFO  [main:SessionTrackerImpl@225] - Shutting down
    [junit] 2017-02-22 02:42:03,074 [myid:] - INFO  [main:PrepRequestProcessor@764] - Shutting down
    [junit] 2017-02-22 02:42:03,074 [myid:] - INFO  [main:SyncRequestProcessor@208] - Shutting down
    [junit] 2017-02-22 02:42:03,074 [myid:] - INFO  [ProcessThread(sid:0 cport:11221)::PrepRequestProcessor@143] - PrepRequestProcessor exited loop!
    [junit] 2017-02-22 02:42:03,075 [myid:] - INFO  [SyncThread:0:SyncRequestProcessor@186] - SyncRequestProcessor exited!
    [junit] 2017-02-22 02:42:03,075 [myid:] - INFO  [main:FinalRequestProcessor@402] - shutdown of request processor complete
    [junit] 2017-02-22 02:42:03,076 [myid:] - INFO  [main:FourLetterWordMain@62] - connecting to 127.0.0.1 11221
    [junit] 2017-02-22 02:42:03,076 [myid:] - INFO  [main:JMXEnv@147] - ensureOnly:[]
    [junit] 2017-02-22 02:42:03,078 [myid:] - INFO  [main:ClientBase@445] - STARTING server
    [junit] 2017-02-22 02:42:03,078 [myid:] - INFO  [main:ClientBase@366] - CREATING server instance 127.0.0.1:11221
    [junit] 2017-02-22 02:42:03,079 [myid:] - INFO  [main:NIOServerCnxnFactory@89] - binding to port 0.0.0.0/0.0.0.0:11221
    [junit] 2017-02-22 02:42:03,079 [myid:] - INFO  [main:ClientBase@341] - STARTING server instance 127.0.0.1:11221
    [junit] 2017-02-22 02:42:03,079 [myid:] - INFO  [main:ZooKeeperServer@173] - Created server with tickTime 3000 minSessionTimeout 6000 maxSessionTimeout 60000 datadir /home/jenkins/jenkins-slave/workspace/ZooKeeper_branch34_jdk7/build/test/tmp/test2691973495394559611.junit.dir/version-2 snapdir /home/jenkins/jenkins-slave/workspace/ZooKeeper_branch34_jdk7/build/test/tmp/test2691973495394559611.junit.dir/version-2
    [junit] 2017-02-22 02:42:03,084 [myid:] - ERROR [main:ZooKeeperServer@472] - ZKShutdownHandler is not registered, so ZooKeeper server won't take any action on ERROR or SHUTDOWN server state changes
    [junit] 2017-02-22 02:42:03,084 [myid:] - INFO  [main:FourLetterWordMain@62] - connecting to 127.0.0.1 11221
    [junit] 2017-02-22 02:42:03,084 [myid:] - INFO  [NIOServerCxn.Factory:0.0.0.0/0.0.0.0:11221:NIOServerCnxnFactory@192] - Accepted socket connection from /127.0.0.1:36344
    [junit] 2017-02-22 02:42:03,085 [myid:] - INFO  [NIOServerCxn.Factory:0.0.0.0/0.0.0.0:11221:NIOServerCnxn@838] - Processing stat command from /127.0.0.1:36344
    [junit] 2017-02-22 02:42:03,086 [myid:] - INFO  [Thread-4:NIOServerCnxn$StatCommand@674] - Stat command output
    [junit] 2017-02-22 02:42:03,086 [myid:] - INFO  [Thread-4:NIOServerCnxn@1019] - Closed socket connection for client /127.0.0.1:36344 (no session established for client)
    [junit] 2017-02-22 02:42:03,086 [myid:] - INFO  [main:JMXEnv@230] - ensureParent:[InMemoryDataTree, StandaloneServer_port]
    [junit] 2017-02-22 02:42:03,089 [myid:] - INFO  [main:JMXEnv@247] - expect:InMemoryDataTree
    [junit] 2017-02-22 02:42:03,089 [myid:] - INFO  [main:JMXEnv@251] - found:InMemoryDataTree org.apache.ZooKeeperService:name0=StandaloneServer_port11221,name1=InMemoryDataTree
    [junit] 2017-02-22 02:42:03,089 [myid:] - INFO  [main:JMXEnv@247] - expect:StandaloneServer_port
    [junit] 2017-02-22 02:42:03,089 [myid:] - INFO  [main:JMXEnv@251] - found:StandaloneServer_port org.apache.ZooKeeperService:name0=StandaloneServer_port11221
    [junit] 2017-02-22 02:42:03,090 [myid:] - INFO  [main:JUnit4ZKTestRunner$LoggedInvokeMethod@58] - Memory used 35675
    [junit] 2017-02-22 02:42:03,090 [myid:] - INFO  [main:JUnit4ZKTestRunner$LoggedInvokeMethod@63] - Number of threads 20
    [junit] 2017-02-22 02:42:03,090 [myid:] - INFO  [main:JUnit4ZKTestRunner$LoggedInvokeMethod@78] - FINISHED TEST METHOD testQuota
    [junit] 2017-02-22 02:42:03,090 [myid:] - INFO  [main:ClientBase@522] - tearDown starting
    [junit] 2017-02-22 02:42:03,154 [myid:] - INFO  [main:ZooKeeper@684] - Session: 0x15a63b270280000 closed
    [junit] 2017-02-22 02:42:03,154 [myid:] - INFO  [main:ClientBase@492] - STOPPING server
    [junit] 2017-02-22 02:42:03,155 [myid:] - INFO  [main-EventThread:ClientCnxn$EventThread@519] - EventThread shut down for session: 0x15a63b270280000
    [junit] 2017-02-22 02:42:03,155 [myid:] - INFO  [NIOServerCxn.Factory:0.0.0.0/0.0.0.0:11221:NIOServerCnxnFactory@219] - NIOServerCnxn factory exited run method
    [junit] 2017-02-22 02:42:03,155 [myid:] - INFO  [main:ZooKeeperServer@505] - shutting down
    [junit] 2017-02-22 02:42:03,155 [myid:] - ERROR [main:ZooKeeperServer@472] - ZKShutdownHandler is not registered, so ZooKeeper server won't take any action on ERROR or SHUTDOWN server state changes
    [junit] 2017-02-22 02:42:03,156 [myid:] - INFO  [main:SessionTrackerImpl@225] - Shutting down
    [junit] 2017-02-22 02:42:03,156 [myid:] - INFO  [main:PrepRequestProcessor@764] - Shutting down
    [junit] 2017-02-22 02:42:03,156 [myid:] - INFO  [main:SyncRequestProcessor@208] - Shutting down
    [junit] 2017-02-22 02:42:03,157 [myid:] - INFO  [ProcessThread(sid:0 cport:11221)::PrepRequestProcessor@143] - PrepRequestProcessor exited loop!
    [junit] 2017-02-22 02:42:03,157 [myid:] - INFO  [SyncThread:0:SyncRequestProcessor@186] - SyncRequestProcessor exited!
    [junit] 2017-02-22 02:42:03,157 [myid:] - INFO  [main:FinalRequestProcessor@402] - shutdown of request processor complete
    [junit] 2017-02-22 02:42:03,158 [myid:] - INFO  [main:FourLetterWordMain@62] - connecting to 127.0.0.1 11221
    [junit] 2017-02-22 02:42:03,158 [myid:] - INFO  [main:JMXEnv@147] - ensureOnly:[]
    [junit] 2017-02-22 02:42:03,163 [myid:] - INFO  [main:ClientBase@547] - fdcount after test is: 90 at start it was 78
    [junit] 2017-02-22 02:42:03,163 [myid:] - INFO  [main:ClientBase@549] - sleeping for 20 secs
    [junit] 2017-02-22 02:42:03,164 [myid:] - INFO  [main:ZKTestCase$1@65] - SUCCEEDED testQuota
    [junit] 2017-02-22 02:42:03,164 [myid:] - INFO  [main:ZKTestCase$1@60] - FINISHED testQuota
    [junit] Tests run: 1, Failures: 0, Errors: 0, Skipped: 0, Time elapsed: 0.553 sec

fail.build.on.test.failure:

BUILD FAILED
/home/jenkins/jenkins-slave/workspace/ZooKeeper_branch34_jdk7/build.xml:1328: The following error occurred while executing this line:
/home/jenkins/jenkins-slave/workspace/ZooKeeper_branch34_jdk7/build.xml:1331: Tests failed!

Total time: 29 minutes 24 seconds
Build step 'Invoke Ant' marked build as failure
Recording test results
Email was triggered for: Failure - Any
Sending email for trigger: Failure - Any



###################################################################################
############################## FAILED TESTS (if any) ##############################
2 tests failed.
FAILED:  org.apache.zookeeper.server.quorum.auth.QuorumKerberosHostBasedAuthTest.testValidCredentials

Error Message:
waiting for server 0 being up

Stack Trace:
junit.framework.AssertionFailedError: waiting for server 0 being up
	at org.apache.zookeeper.server.quorum.auth.QuorumAuthTestBase.startQuorum(QuorumAuthTestBase.java:74)
	at org.apache.zookeeper.server.quorum.auth.QuorumKerberosHostBasedAuthTest.testValidCredentials(QuorumKerberosHostBasedAuthTest.java:125)
	at org.apache.zookeeper.JUnit4ZKTestRunner$LoggedInvokeMethod.evaluate(JUnit4ZKTestRunner.java:55)


FAILED:  org.apache.zookeeper.server.quorum.auth.QuorumKerberosHostBasedAuthTest.testConnectBadServer

Error Message:
waiting for server 2 being up

Stack Trace:
junit.framework.AssertionFailedError: waiting for server 2 being up
	at org.apache.zookeeper.server.quorum.auth.QuorumAuthTestBase.startQuorum(QuorumAuthTestBase.java:74)
	at org.apache.zookeeper.server.quorum.auth.QuorumKerberosHostBasedAuthTest.testConnectBadServer(QuorumKerberosHostBasedAuthTest.java:146)
	at org.apache.zookeeper.JUnit4ZKTestRunner$LoggedInvokeMethod.evaluate(JUnit4ZKTestRunner.java:55)



ZooKeeper_branch34_jdk7 - Build # 1414 - Still Failing

Posted by Apache Jenkins Server <je...@builds.apache.org>.
See https://builds.apache.org/job/ZooKeeper_branch34_jdk7/1414/

###################################################################################
########################## LAST 60 LINES OF THE CONSOLE ###########################
[...truncated 30.97 MB...]
    [junit] 2017-02-21 02:42:13,240 [myid:] - INFO  [main:SessionTrackerImpl@225] - Shutting down
    [junit] 2017-02-21 02:42:13,240 [myid:] - INFO  [main:PrepRequestProcessor@764] - Shutting down
    [junit] 2017-02-21 02:42:13,240 [myid:] - INFO  [main:SyncRequestProcessor@208] - Shutting down
    [junit] 2017-02-21 02:42:13,241 [myid:] - INFO  [ProcessThread(sid:0 cport:11221)::PrepRequestProcessor@143] - PrepRequestProcessor exited loop!
    [junit] 2017-02-21 02:42:13,241 [myid:] - INFO  [SyncThread:0:SyncRequestProcessor@186] - SyncRequestProcessor exited!
    [junit] 2017-02-21 02:42:13,241 [myid:] - INFO  [main:FinalRequestProcessor@402] - shutdown of request processor complete
    [junit] 2017-02-21 02:42:13,242 [myid:] - INFO  [main:FourLetterWordMain@62] - connecting to 127.0.0.1 11221
    [junit] 2017-02-21 02:42:13,242 [myid:] - INFO  [main:JMXEnv@147] - ensureOnly:[]
    [junit] 2017-02-21 02:42:13,244 [myid:] - INFO  [main:ClientBase@445] - STARTING server
    [junit] 2017-02-21 02:42:13,245 [myid:] - INFO  [main:ClientBase@366] - CREATING server instance 127.0.0.1:11221
    [junit] 2017-02-21 02:42:13,245 [myid:] - INFO  [main:NIOServerCnxnFactory@89] - binding to port 0.0.0.0/0.0.0.0:11221
    [junit] 2017-02-21 02:42:13,245 [myid:] - INFO  [main:ClientBase@341] - STARTING server instance 127.0.0.1:11221
    [junit] 2017-02-21 02:42:13,246 [myid:] - INFO  [main:ZooKeeperServer@173] - Created server with tickTime 3000 minSessionTimeout 6000 maxSessionTimeout 60000 datadir /home/jenkins/jenkins-slave/workspace/ZooKeeper_branch34_jdk7/build/test/tmp/test4676034501719231443.junit.dir/version-2 snapdir /home/jenkins/jenkins-slave/workspace/ZooKeeper_branch34_jdk7/build/test/tmp/test4676034501719231443.junit.dir/version-2
    [junit] 2017-02-21 02:42:13,250 [myid:] - ERROR [main:ZooKeeperServer@472] - ZKShutdownHandler is not registered, so ZooKeeper server won't take any action on ERROR or SHUTDOWN server state changes
    [junit] 2017-02-21 02:42:13,251 [myid:] - INFO  [main:FourLetterWordMain@62] - connecting to 127.0.0.1 11221
    [junit] 2017-02-21 02:42:13,251 [myid:] - INFO  [NIOServerCxn.Factory:0.0.0.0/0.0.0.0:11221:NIOServerCnxnFactory@192] - Accepted socket connection from /127.0.0.1:51474
    [junit] 2017-02-21 02:42:13,252 [myid:] - INFO  [NIOServerCxn.Factory:0.0.0.0/0.0.0.0:11221:NIOServerCnxn@838] - Processing stat command from /127.0.0.1:51474
    [junit] 2017-02-21 02:42:13,252 [myid:] - INFO  [Thread-4:NIOServerCnxn$StatCommand@674] - Stat command output
    [junit] 2017-02-21 02:42:13,253 [myid:] - INFO  [Thread-4:NIOServerCnxn@1019] - Closed socket connection for client /127.0.0.1:51474 (no session established for client)
    [junit] 2017-02-21 02:42:13,253 [myid:] - INFO  [main:JMXEnv@230] - ensureParent:[InMemoryDataTree, StandaloneServer_port]
    [junit] 2017-02-21 02:42:13,255 [myid:] - INFO  [main:JMXEnv@247] - expect:InMemoryDataTree
    [junit] 2017-02-21 02:42:13,256 [myid:] - INFO  [main:JMXEnv@251] - found:InMemoryDataTree org.apache.ZooKeeperService:name0=StandaloneServer_port11221,name1=InMemoryDataTree
    [junit] 2017-02-21 02:42:13,256 [myid:] - INFO  [main:JMXEnv@247] - expect:StandaloneServer_port
    [junit] 2017-02-21 02:42:13,256 [myid:] - INFO  [main:JMXEnv@251] - found:StandaloneServer_port org.apache.ZooKeeperService:name0=StandaloneServer_port11221
    [junit] 2017-02-21 02:42:13,256 [myid:] - INFO  [main:JUnit4ZKTestRunner$LoggedInvokeMethod@58] - Memory used 35676
    [junit] 2017-02-21 02:42:13,257 [myid:] - INFO  [main:JUnit4ZKTestRunner$LoggedInvokeMethod@63] - Number of threads 20
    [junit] 2017-02-21 02:42:13,257 [myid:] - INFO  [main:JUnit4ZKTestRunner$LoggedInvokeMethod@78] - FINISHED TEST METHOD testQuota
    [junit] 2017-02-21 02:42:13,257 [myid:] - INFO  [main:ClientBase@522] - tearDown starting
    [junit] 2017-02-21 02:42:13,321 [myid:] - INFO  [main:ZooKeeper@684] - Session: 0x15a5e8c3bcf0000 closed
    [junit] 2017-02-21 02:42:13,322 [myid:] - INFO  [main:ClientBase@492] - STOPPING server
    [junit] 2017-02-21 02:42:13,322 [myid:] - INFO  [main-EventThread:ClientCnxn$EventThread@519] - EventThread shut down for session: 0x15a5e8c3bcf0000
    [junit] 2017-02-21 02:42:13,322 [myid:] - INFO  [NIOServerCxn.Factory:0.0.0.0/0.0.0.0:11221:NIOServerCnxnFactory@219] - NIOServerCnxn factory exited run method
    [junit] 2017-02-21 02:42:13,322 [myid:] - INFO  [main:ZooKeeperServer@505] - shutting down
    [junit] 2017-02-21 02:42:13,323 [myid:] - ERROR [main:ZooKeeperServer@472] - ZKShutdownHandler is not registered, so ZooKeeper server won't take any action on ERROR or SHUTDOWN server state changes
    [junit] 2017-02-21 02:42:13,323 [myid:] - INFO  [main:SessionTrackerImpl@225] - Shutting down
    [junit] 2017-02-21 02:42:13,323 [myid:] - INFO  [main:PrepRequestProcessor@764] - Shutting down
    [junit] 2017-02-21 02:42:13,323 [myid:] - INFO  [main:SyncRequestProcessor@208] - Shutting down
    [junit] 2017-02-21 02:42:13,324 [myid:] - INFO  [ProcessThread(sid:0 cport:11221)::PrepRequestProcessor@143] - PrepRequestProcessor exited loop!
    [junit] 2017-02-21 02:42:13,324 [myid:] - INFO  [SyncThread:0:SyncRequestProcessor@186] - SyncRequestProcessor exited!
    [junit] 2017-02-21 02:42:13,324 [myid:] - INFO  [main:FinalRequestProcessor@402] - shutdown of request processor complete
    [junit] 2017-02-21 02:42:13,325 [myid:] - INFO  [main:FourLetterWordMain@62] - connecting to 127.0.0.1 11221
    [junit] 2017-02-21 02:42:13,326 [myid:] - INFO  [main:JMXEnv@147] - ensureOnly:[]
    [junit] 2017-02-21 02:42:13,330 [myid:] - INFO  [main:ClientBase@547] - fdcount after test is: 90 at start it was 78
    [junit] 2017-02-21 02:42:13,330 [myid:] - INFO  [main:ClientBase@549] - sleeping for 20 secs
    [junit] 2017-02-21 02:42:13,331 [myid:] - INFO  [main:ZKTestCase$1@65] - SUCCEEDED testQuota
    [junit] 2017-02-21 02:42:13,331 [myid:] - INFO  [main:ZKTestCase$1@60] - FINISHED testQuota
    [junit] Tests run: 1, Failures: 0, Errors: 0, Skipped: 0, Time elapsed: 0.578 sec

fail.build.on.test.failure:

BUILD FAILED
/home/jenkins/jenkins-slave/workspace/ZooKeeper_branch34_jdk7/build.xml:1328: The following error occurred while executing this line:
/home/jenkins/jenkins-slave/workspace/ZooKeeper_branch34_jdk7/build.xml:1331: Tests failed!

Total time: 29 minutes 23 seconds
Build step 'Invoke Ant' marked build as failure
Recording test results
Email was triggered for: Failure - Any
Sending email for trigger: Failure - Any



###################################################################################
############################## FAILED TESTS (if any) ##############################
2 tests failed.
FAILED:  org.apache.zookeeper.server.quorum.auth.QuorumKerberosHostBasedAuthTest.testConnectBadServer

Error Message:
waiting for server 0 being up

Stack Trace:
junit.framework.AssertionFailedError: waiting for server 0 being up
	at org.apache.zookeeper.server.quorum.auth.QuorumAuthTestBase.startQuorum(QuorumAuthTestBase.java:74)
	at org.apache.zookeeper.server.quorum.auth.QuorumKerberosHostBasedAuthTest.testConnectBadServer(QuorumKerberosHostBasedAuthTest.java:146)
	at org.apache.zookeeper.JUnit4ZKTestRunner$LoggedInvokeMethod.evaluate(JUnit4ZKTestRunner.java:55)


FAILED:  org.apache.zookeeper.server.quorum.auth.QuorumKerberosAuthTest.testValidCredentials

Error Message:
waiting for server 0 being up

Stack Trace:
junit.framework.AssertionFailedError: waiting for server 0 being up
	at org.apache.zookeeper.server.quorum.auth.QuorumAuthTestBase.startQuorum(QuorumAuthTestBase.java:74)
	at org.apache.zookeeper.server.quorum.auth.QuorumKerberosAuthTest.testValidCredentials(QuorumKerberosAuthTest.java:101)
	at org.apache.zookeeper.JUnit4ZKTestRunner$LoggedInvokeMethod.evaluate(JUnit4ZKTestRunner.java:55)



ZooKeeper_branch34_jdk7 - Build # 1413 - Still Failing

Posted by Apache Jenkins Server <je...@builds.apache.org>.
See https://builds.apache.org/job/ZooKeeper_branch34_jdk7/1413/

###################################################################################
########################## LAST 60 LINES OF THE CONSOLE ###########################
[...truncated 31.30 MB...]
    [junit] 2017-02-20 02:41:45,859 [myid:] - INFO  [main:SessionTrackerImpl@225] - Shutting down
    [junit] 2017-02-20 02:41:45,859 [myid:] - INFO  [main:PrepRequestProcessor@764] - Shutting down
    [junit] 2017-02-20 02:41:45,859 [myid:] - INFO  [main:SyncRequestProcessor@208] - Shutting down
    [junit] 2017-02-20 02:41:45,860 [myid:] - INFO  [ProcessThread(sid:0 cport:11221)::PrepRequestProcessor@143] - PrepRequestProcessor exited loop!
    [junit] 2017-02-20 02:41:45,860 [myid:] - INFO  [SyncThread:0:SyncRequestProcessor@186] - SyncRequestProcessor exited!
    [junit] 2017-02-20 02:41:45,860 [myid:] - INFO  [main:FinalRequestProcessor@402] - shutdown of request processor complete
    [junit] 2017-02-20 02:41:45,861 [myid:] - INFO  [main:FourLetterWordMain@62] - connecting to 127.0.0.1 11221
    [junit] 2017-02-20 02:41:45,861 [myid:] - INFO  [main:JMXEnv@147] - ensureOnly:[]
    [junit] 2017-02-20 02:41:45,863 [myid:] - INFO  [main:ClientBase@445] - STARTING server
    [junit] 2017-02-20 02:41:45,863 [myid:] - INFO  [main:ClientBase@366] - CREATING server instance 127.0.0.1:11221
    [junit] 2017-02-20 02:41:45,863 [myid:] - INFO  [main:NIOServerCnxnFactory@89] - binding to port 0.0.0.0/0.0.0.0:11221
    [junit] 2017-02-20 02:41:45,864 [myid:] - INFO  [main:ClientBase@341] - STARTING server instance 127.0.0.1:11221
    [junit] 2017-02-20 02:41:45,864 [myid:] - INFO  [main:ZooKeeperServer@173] - Created server with tickTime 3000 minSessionTimeout 6000 maxSessionTimeout 60000 datadir /home/jenkins/jenkins-slave/workspace/ZooKeeper_branch34_jdk7/build/test/tmp/test4374155779636590951.junit.dir/version-2 snapdir /home/jenkins/jenkins-slave/workspace/ZooKeeper_branch34_jdk7/build/test/tmp/test4374155779636590951.junit.dir/version-2
    [junit] 2017-02-20 02:41:45,869 [myid:] - ERROR [main:ZooKeeperServer@472] - ZKShutdownHandler is not registered, so ZooKeeper server won't take any action on ERROR or SHUTDOWN server state changes
    [junit] 2017-02-20 02:41:45,869 [myid:] - INFO  [main:FourLetterWordMain@62] - connecting to 127.0.0.1 11221
    [junit] 2017-02-20 02:41:45,870 [myid:] - INFO  [NIOServerCxn.Factory:0.0.0.0/0.0.0.0:11221:NIOServerCnxnFactory@192] - Accepted socket connection from /127.0.0.1:46077
    [junit] 2017-02-20 02:41:45,870 [myid:] - INFO  [NIOServerCxn.Factory:0.0.0.0/0.0.0.0:11221:NIOServerCnxn@838] - Processing stat command from /127.0.0.1:46077
    [junit] 2017-02-20 02:41:45,870 [myid:] - INFO  [Thread-4:NIOServerCnxn$StatCommand@674] - Stat command output
    [junit] 2017-02-20 02:41:45,871 [myid:] - INFO  [Thread-4:NIOServerCnxn@1019] - Closed socket connection for client /127.0.0.1:46077 (no session established for client)
    [junit] 2017-02-20 02:41:45,871 [myid:] - INFO  [main:JMXEnv@230] - ensureParent:[InMemoryDataTree, StandaloneServer_port]
    [junit] 2017-02-20 02:41:45,873 [myid:] - INFO  [main:JMXEnv@247] - expect:InMemoryDataTree
    [junit] 2017-02-20 02:41:45,874 [myid:] - INFO  [main:JMXEnv@251] - found:InMemoryDataTree org.apache.ZooKeeperService:name0=StandaloneServer_port11221,name1=InMemoryDataTree
    [junit] 2017-02-20 02:41:45,874 [myid:] - INFO  [main:JMXEnv@247] - expect:StandaloneServer_port
    [junit] 2017-02-20 02:41:45,874 [myid:] - INFO  [main:JMXEnv@251] - found:StandaloneServer_port org.apache.ZooKeeperService:name0=StandaloneServer_port11221
    [junit] 2017-02-20 02:41:45,874 [myid:] - INFO  [main:JUnit4ZKTestRunner$LoggedInvokeMethod@58] - Memory used 35675
    [junit] 2017-02-20 02:41:45,875 [myid:] - INFO  [main:JUnit4ZKTestRunner$LoggedInvokeMethod@63] - Number of threads 20
    [junit] 2017-02-20 02:41:45,875 [myid:] - INFO  [main:JUnit4ZKTestRunner$LoggedInvokeMethod@78] - FINISHED TEST METHOD testQuota
    [junit] 2017-02-20 02:41:45,875 [myid:] - INFO  [main:ClientBase@522] - tearDown starting
    [junit] 2017-02-20 02:41:45,942 [myid:] - INFO  [main:ZooKeeper@684] - Session: 0x15a596574e50000 closed
    [junit] 2017-02-20 02:41:45,942 [myid:] - INFO  [main:ClientBase@492] - STOPPING server
    [junit] 2017-02-20 02:41:45,942 [myid:] - INFO  [main-EventThread:ClientCnxn$EventThread@519] - EventThread shut down for session: 0x15a596574e50000
    [junit] 2017-02-20 02:41:45,942 [myid:] - INFO  [NIOServerCxn.Factory:0.0.0.0/0.0.0.0:11221:NIOServerCnxnFactory@219] - NIOServerCnxn factory exited run method
    [junit] 2017-02-20 02:41:45,943 [myid:] - INFO  [main:ZooKeeperServer@505] - shutting down
    [junit] 2017-02-20 02:41:45,943 [myid:] - ERROR [main:ZooKeeperServer@472] - ZKShutdownHandler is not registered, so ZooKeeper server won't take any action on ERROR or SHUTDOWN server state changes
    [junit] 2017-02-20 02:41:45,943 [myid:] - INFO  [main:SessionTrackerImpl@225] - Shutting down
    [junit] 2017-02-20 02:41:45,943 [myid:] - INFO  [main:PrepRequestProcessor@764] - Shutting down
    [junit] 2017-02-20 02:41:45,944 [myid:] - INFO  [main:SyncRequestProcessor@208] - Shutting down
    [junit] 2017-02-20 02:41:45,944 [myid:] - INFO  [ProcessThread(sid:0 cport:11221)::PrepRequestProcessor@143] - PrepRequestProcessor exited loop!
    [junit] 2017-02-20 02:41:45,944 [myid:] - INFO  [SyncThread:0:SyncRequestProcessor@186] - SyncRequestProcessor exited!
    [junit] 2017-02-20 02:41:45,945 [myid:] - INFO  [main:FinalRequestProcessor@402] - shutdown of request processor complete
    [junit] 2017-02-20 02:41:45,945 [myid:] - INFO  [main:FourLetterWordMain@62] - connecting to 127.0.0.1 11221
    [junit] 2017-02-20 02:41:45,946 [myid:] - INFO  [main:JMXEnv@147] - ensureOnly:[]
    [junit] 2017-02-20 02:41:45,950 [myid:] - INFO  [main:ClientBase@547] - fdcount after test is: 90 at start it was 78
    [junit] 2017-02-20 02:41:45,950 [myid:] - INFO  [main:ClientBase@549] - sleeping for 20 secs
    [junit] 2017-02-20 02:41:45,951 [myid:] - INFO  [main:ZKTestCase$1@65] - SUCCEEDED testQuota
    [junit] 2017-02-20 02:41:45,951 [myid:] - INFO  [main:ZKTestCase$1@60] - FINISHED testQuota
    [junit] Tests run: 1, Failures: 0, Errors: 0, Skipped: 0, Time elapsed: 0.561 sec

fail.build.on.test.failure:

BUILD FAILED
/home/jenkins/jenkins-slave/workspace/ZooKeeper_branch34_jdk7/build.xml:1328: The following error occurred while executing this line:
/home/jenkins/jenkins-slave/workspace/ZooKeeper_branch34_jdk7/build.xml:1331: Tests failed!

Total time: 29 minutes 7 seconds
Build step 'Invoke Ant' marked build as failure
Recording test results
Email was triggered for: Failure - Any
Sending email for trigger: Failure - Any



###################################################################################
############################## FAILED TESTS (if any) ##############################
2 tests failed.
FAILED:  org.apache.zookeeper.server.quorum.auth.QuorumKerberosAuthTest.testValidCredentials

Error Message:
waiting for server 0 being up

Stack Trace:
junit.framework.AssertionFailedError: waiting for server 0 being up
	at org.apache.zookeeper.server.quorum.auth.QuorumAuthTestBase.startQuorum(QuorumAuthTestBase.java:74)
	at org.apache.zookeeper.server.quorum.auth.QuorumKerberosAuthTest.testValidCredentials(QuorumKerberosAuthTest.java:101)
	at org.apache.zookeeper.JUnit4ZKTestRunner$LoggedInvokeMethod.evaluate(JUnit4ZKTestRunner.java:55)


FAILED:  org.apache.zookeeper.server.quorum.auth.QuorumKerberosHostBasedAuthTest.testValidCredentials

Error Message:
waiting for server 0 being up

Stack Trace:
junit.framework.AssertionFailedError: waiting for server 0 being up
	at org.apache.zookeeper.server.quorum.auth.QuorumAuthTestBase.startQuorum(QuorumAuthTestBase.java:74)
	at org.apache.zookeeper.server.quorum.auth.QuorumKerberosHostBasedAuthTest.testValidCredentials(QuorumKerberosHostBasedAuthTest.java:125)
	at org.apache.zookeeper.JUnit4ZKTestRunner$LoggedInvokeMethod.evaluate(JUnit4ZKTestRunner.java:55)



ZooKeeper_branch34_jdk7 - Build # 1412 - Still Failing

Posted by Apache Jenkins Server <je...@builds.apache.org>.
See https://builds.apache.org/job/ZooKeeper_branch34_jdk7/1412/

###################################################################################
########################## LAST 60 LINES OF THE CONSOLE ###########################
[...truncated 31.30 MB...]
    [junit] 2017-02-19 03:19:23,851 [myid:] - INFO  [ProcessThread(sid:0 cport:11221)::PrepRequestProcessor@143] - PrepRequestProcessor exited loop!
    [junit] 2017-02-19 03:19:23,852 [myid:] - INFO  [SyncThread:0:SyncRequestProcessor@186] - SyncRequestProcessor exited!
    [junit] 2017-02-19 03:19:23,852 [myid:] - INFO  [main:FinalRequestProcessor@402] - shutdown of request processor complete
    [junit] 2017-02-19 03:19:23,852 [myid:] - INFO  [main:FourLetterWordMain@62] - connecting to 127.0.0.1 11221
    [junit] 2017-02-19 03:19:23,853 [myid:] - INFO  [main:JMXEnv@147] - ensureOnly:[]
    [junit] 2017-02-19 03:19:23,855 [myid:] - INFO  [main:ClientBase@445] - STARTING server
    [junit] 2017-02-19 03:19:23,855 [myid:] - INFO  [main:ClientBase@366] - CREATING server instance 127.0.0.1:11221
    [junit] 2017-02-19 03:19:23,855 [myid:] - INFO  [main:NIOServerCnxnFactory@89] - binding to port 0.0.0.0/0.0.0.0:11221
    [junit] 2017-02-19 03:19:23,856 [myid:] - INFO  [main:ClientBase@341] - STARTING server instance 127.0.0.1:11221
    [junit] 2017-02-19 03:19:23,856 [myid:] - INFO  [main:ZooKeeperServer@173] - Created server with tickTime 3000 minSessionTimeout 6000 maxSessionTimeout 60000 datadir /home/jenkins/jenkins-slave/workspace/ZooKeeper_branch34_jdk7/build/test/tmp/test6822932754416214265.junit.dir/version-2 snapdir /home/jenkins/jenkins-slave/workspace/ZooKeeper_branch34_jdk7/build/test/tmp/test6822932754416214265.junit.dir/version-2
    [junit] 2017-02-19 03:19:23,860 [myid:] - ERROR [main:ZooKeeperServer@472] - ZKShutdownHandler is not registered, so ZooKeeper server won't take any action on ERROR or SHUTDOWN server state changes
    [junit] 2017-02-19 03:19:23,860 [myid:] - INFO  [main:FourLetterWordMain@62] - connecting to 127.0.0.1 11221
    [junit] 2017-02-19 03:19:23,861 [myid:] - INFO  [NIOServerCxn.Factory:0.0.0.0/0.0.0.0:11221:NIOServerCnxnFactory@192] - Accepted socket connection from /127.0.0.1:60096
    [junit] 2017-02-19 03:19:23,861 [myid:] - INFO  [NIOServerCxn.Factory:0.0.0.0/0.0.0.0:11221:NIOServerCnxn@838] - Processing stat command from /127.0.0.1:60096
    [junit] 2017-02-19 03:19:23,862 [myid:] - INFO  [Thread-4:NIOServerCnxn$StatCommand@674] - Stat command output
    [junit] 2017-02-19 03:19:23,862 [myid:] - INFO  [Thread-4:NIOServerCnxn@1019] - Closed socket connection for client /127.0.0.1:60096 (no session established for client)
    [junit] 2017-02-19 03:19:23,863 [myid:] - INFO  [main:JMXEnv@230] - ensureParent:[InMemoryDataTree, StandaloneServer_port]
    [junit] 2017-02-19 03:19:23,865 [myid:] - INFO  [main:JMXEnv@247] - expect:InMemoryDataTree
    [junit] 2017-02-19 03:19:23,865 [myid:] - INFO  [main:JMXEnv@251] - found:InMemoryDataTree org.apache.ZooKeeperService:name0=StandaloneServer_port11221,name1=InMemoryDataTree
    [junit] 2017-02-19 03:19:23,865 [myid:] - INFO  [main:JMXEnv@247] - expect:StandaloneServer_port
    [junit] 2017-02-19 03:19:23,866 [myid:] - INFO  [main:JMXEnv@251] - found:StandaloneServer_port org.apache.ZooKeeperService:name0=StandaloneServer_port11221
    [junit] 2017-02-19 03:19:23,866 [myid:] - INFO  [main:JUnit4ZKTestRunner$LoggedInvokeMethod@58] - Memory used 35675
    [junit] 2017-02-19 03:19:23,866 [myid:] - INFO  [main:JUnit4ZKTestRunner$LoggedInvokeMethod@63] - Number of threads 20
    [junit] 2017-02-19 03:19:23,866 [myid:] - INFO  [main:JUnit4ZKTestRunner$LoggedInvokeMethod@78] - FINISHED TEST METHOD testQuota
    [junit] 2017-02-19 03:19:23,867 [myid:] - INFO  [main:ClientBase@522] - tearDown starting
    [junit] 2017-02-19 03:19:23,932 [myid:] - INFO  [main:ZooKeeper@684] - Session: 0x15a54618d2c0000 closed
    [junit] 2017-02-19 03:19:23,932 [myid:] - INFO  [main:ClientBase@492] - STOPPING server
    [junit] 2017-02-19 03:19:23,933 [myid:] - INFO  [main-EventThread:ClientCnxn$EventThread@519] - EventThread shut down for session: 0x15a54618d2c0000
    [junit] 2017-02-19 03:19:23,933 [myid:] - INFO  [NIOServerCxn.Factory:0.0.0.0/0.0.0.0:11221:NIOServerCnxnFactory@219] - NIOServerCnxn factory exited run method
    [junit] 2017-02-19 03:19:23,933 [myid:] - INFO  [main:ZooKeeperServer@505] - shutting down
    [junit] 2017-02-19 03:19:23,933 [myid:] - ERROR [main:ZooKeeperServer@472] - ZKShutdownHandler is not registered, so ZooKeeper server won't take any action on ERROR or SHUTDOWN server state changes
    [junit] 2017-02-19 03:19:23,933 [myid:] - INFO  [main:SessionTrackerImpl@225] - Shutting down
    [junit] 2017-02-19 03:19:23,934 [myid:] - INFO  [main:PrepRequestProcessor@764] - Shutting down
    [junit] 2017-02-19 03:19:23,934 [myid:] - INFO  [main:SyncRequestProcessor@208] - Shutting down
    [junit] 2017-02-19 03:19:23,934 [myid:] - INFO  [ProcessThread(sid:0 cport:11221)::PrepRequestProcessor@143] - PrepRequestProcessor exited loop!
    [junit] 2017-02-19 03:19:23,934 [myid:] - INFO  [SyncThread:0:SyncRequestProcessor@186] - SyncRequestProcessor exited!
    [junit] 2017-02-19 03:19:23,935 [myid:] - INFO  [main:FinalRequestProcessor@402] - shutdown of request processor complete
    [junit] 2017-02-19 03:19:23,935 [myid:] - INFO  [main:FourLetterWordMain@62] - connecting to 127.0.0.1 11221
    [junit] 2017-02-19 03:19:23,936 [myid:] - INFO  [main:JMXEnv@147] - ensureOnly:[]
    [junit] 2017-02-19 03:19:23,940 [myid:] - INFO  [main:ClientBase@547] - fdcount after test is: 90 at start it was 78
    [junit] 2017-02-19 03:19:23,941 [myid:] - INFO  [main:ClientBase@549] - sleeping for 20 secs
    [junit] 2017-02-19 03:19:23,942 [myid:] - INFO  [main:ZKTestCase$1@65] - SUCCEEDED testQuota
    [junit] 2017-02-19 03:19:23,942 [myid:] - INFO  [main:ZKTestCase$1@60] - FINISHED testQuota
    [junit] Tests run: 1, Failures: 0, Errors: 0, Skipped: 0, Time elapsed: 0.573 sec
    [junit] 2017-02-19 03:19:24,000 [myid:] - INFO  [SessionTracker:SessionTrackerImpl@162] - SessionTrackerImpl exited loop!
    [junit] 2017-02-19 03:19:24,001 [myid:] - INFO  [SessionTracker:SessionTrackerImpl@162] - SessionTrackerImpl exited loop!
    [junit] 2017-02-19 03:19:24,001 [myid:] - INFO  [SessionTracker:SessionTrackerImpl@162] - SessionTrackerImpl exited loop!

fail.build.on.test.failure:

BUILD FAILED
/home/jenkins/jenkins-slave/workspace/ZooKeeper_branch34_jdk7/build.xml:1328: The following error occurred while executing this line:
/home/jenkins/jenkins-slave/workspace/ZooKeeper_branch34_jdk7/build.xml:1331: Tests failed!

Total time: 29 minutes 16 seconds
Build step 'Invoke Ant' marked build as failure
Recording test results
Email was triggered for: Failure - Any
Sending email for trigger: Failure - Any



###################################################################################
############################## FAILED TESTS (if any) ##############################
2 tests failed.
FAILED:  org.apache.zookeeper.server.quorum.auth.QuorumKerberosAuthTest.testValidCredentials

Error Message:
waiting for server 2 being up

Stack Trace:
junit.framework.AssertionFailedError: waiting for server 2 being up
	at org.apache.zookeeper.server.quorum.auth.QuorumAuthTestBase.startQuorum(QuorumAuthTestBase.java:74)
	at org.apache.zookeeper.server.quorum.auth.QuorumKerberosAuthTest.testValidCredentials(QuorumKerberosAuthTest.java:101)
	at org.apache.zookeeper.JUnit4ZKTestRunner$LoggedInvokeMethod.evaluate(JUnit4ZKTestRunner.java:55)


FAILED:  org.apache.zookeeper.server.quorum.auth.QuorumKerberosHostBasedAuthTest.testValidCredentials

Error Message:
waiting for server 1 being up

Stack Trace:
junit.framework.AssertionFailedError: waiting for server 1 being up
	at org.apache.zookeeper.server.quorum.auth.QuorumAuthTestBase.startQuorum(QuorumAuthTestBase.java:74)
	at org.apache.zookeeper.server.quorum.auth.QuorumKerberosHostBasedAuthTest.testValidCredentials(QuorumKerberosHostBasedAuthTest.java:125)
	at org.apache.zookeeper.JUnit4ZKTestRunner$LoggedInvokeMethod.evaluate(JUnit4ZKTestRunner.java:55)



ZooKeeper_branch34_jdk7 - Build # 1411 - Still Failing

Posted by Apache Jenkins Server <je...@builds.apache.org>.
See https://builds.apache.org/job/ZooKeeper_branch34_jdk7/1411/

###################################################################################
########################## LAST 60 LINES OF THE CONSOLE ###########################
[...truncated 240755 lines...]
    [junit] 2017-02-18 02:41:43,582 [myid:] - INFO  [main:SessionTrackerImpl@225] - Shutting down
    [junit] 2017-02-18 02:41:43,582 [myid:] - INFO  [main:PrepRequestProcessor@764] - Shutting down
    [junit] 2017-02-18 02:41:43,582 [myid:] - INFO  [main:SyncRequestProcessor@208] - Shutting down
    [junit] 2017-02-18 02:41:43,583 [myid:] - INFO  [ProcessThread(sid:0 cport:11221)::PrepRequestProcessor@143] - PrepRequestProcessor exited loop!
    [junit] 2017-02-18 02:41:43,583 [myid:] - INFO  [SyncThread:0:SyncRequestProcessor@186] - SyncRequestProcessor exited!
    [junit] 2017-02-18 02:41:43,583 [myid:] - INFO  [main:FinalRequestProcessor@402] - shutdown of request processor complete
    [junit] 2017-02-18 02:41:43,584 [myid:] - INFO  [main:FourLetterWordMain@62] - connecting to 127.0.0.1 11221
    [junit] 2017-02-18 02:41:43,585 [myid:] - INFO  [main:JMXEnv@147] - ensureOnly:[]
    [junit] 2017-02-18 02:41:43,586 [myid:] - INFO  [main:ClientBase@445] - STARTING server
    [junit] 2017-02-18 02:41:43,587 [myid:] - INFO  [main:ClientBase@366] - CREATING server instance 127.0.0.1:11221
    [junit] 2017-02-18 02:41:43,587 [myid:] - INFO  [main:NIOServerCnxnFactory@89] - binding to port 0.0.0.0/0.0.0.0:11221
    [junit] 2017-02-18 02:41:43,587 [myid:] - INFO  [main:ClientBase@341] - STARTING server instance 127.0.0.1:11221
    [junit] 2017-02-18 02:41:43,588 [myid:] - INFO  [main:ZooKeeperServer@173] - Created server with tickTime 3000 minSessionTimeout 6000 maxSessionTimeout 60000 datadir /home/jenkins/jenkins-slave/workspace/ZooKeeper_branch34_jdk7/build/test/tmp/test5009267483675625277.junit.dir/version-2 snapdir /home/jenkins/jenkins-slave/workspace/ZooKeeper_branch34_jdk7/build/test/tmp/test5009267483675625277.junit.dir/version-2
    [junit] 2017-02-18 02:41:43,592 [myid:] - ERROR [main:ZooKeeperServer@472] - ZKShutdownHandler is not registered, so ZooKeeper server won't take any action on ERROR or SHUTDOWN server state changes
    [junit] 2017-02-18 02:41:43,593 [myid:] - INFO  [main:FourLetterWordMain@62] - connecting to 127.0.0.1 11221
    [junit] 2017-02-18 02:41:43,593 [myid:] - INFO  [NIOServerCxn.Factory:0.0.0.0/0.0.0.0:11221:NIOServerCnxnFactory@192] - Accepted socket connection from /127.0.0.1:33609
    [junit] 2017-02-18 02:41:43,594 [myid:] - INFO  [NIOServerCxn.Factory:0.0.0.0/0.0.0.0:11221:NIOServerCnxn@838] - Processing stat command from /127.0.0.1:33609
    [junit] 2017-02-18 02:41:43,594 [myid:] - INFO  [Thread-4:NIOServerCnxn$StatCommand@674] - Stat command output
    [junit] 2017-02-18 02:41:43,595 [myid:] - INFO  [Thread-4:NIOServerCnxn@1019] - Closed socket connection for client /127.0.0.1:33609 (no session established for client)
    [junit] 2017-02-18 02:41:43,595 [myid:] - INFO  [main:JMXEnv@230] - ensureParent:[InMemoryDataTree, StandaloneServer_port]
    [junit] 2017-02-18 02:41:43,597 [myid:] - INFO  [main:JMXEnv@247] - expect:InMemoryDataTree
    [junit] 2017-02-18 02:41:43,598 [myid:] - INFO  [main:JMXEnv@251] - found:InMemoryDataTree org.apache.ZooKeeperService:name0=StandaloneServer_port11221,name1=InMemoryDataTree
    [junit] 2017-02-18 02:41:43,598 [myid:] - INFO  [main:JMXEnv@247] - expect:StandaloneServer_port
    [junit] 2017-02-18 02:41:43,598 [myid:] - INFO  [main:JMXEnv@251] - found:StandaloneServer_port org.apache.ZooKeeperService:name0=StandaloneServer_port11221
    [junit] 2017-02-18 02:41:43,598 [myid:] - INFO  [main:JUnit4ZKTestRunner$LoggedInvokeMethod@58] - Memory used 35674
    [junit] 2017-02-18 02:41:43,599 [myid:] - INFO  [main:JUnit4ZKTestRunner$LoggedInvokeMethod@63] - Number of threads 20
    [junit] 2017-02-18 02:41:43,599 [myid:] - INFO  [main:JUnit4ZKTestRunner$LoggedInvokeMethod@78] - FINISHED TEST METHOD testQuota
    [junit] 2017-02-18 02:41:43,599 [myid:] - INFO  [main:ClientBase@522] - tearDown starting
    [junit] 2017-02-18 02:41:43,664 [myid:] - INFO  [main:ZooKeeper@684] - Session: 0x15a4f18b40e0000 closed
    [junit] 2017-02-18 02:41:43,664 [myid:] - INFO  [main:ClientBase@492] - STOPPING server
    [junit] 2017-02-18 02:41:43,664 [myid:] - INFO  [main-EventThread:ClientCnxn$EventThread@519] - EventThread shut down for session: 0x15a4f18b40e0000
    [junit] 2017-02-18 02:41:43,664 [myid:] - INFO  [NIOServerCxn.Factory:0.0.0.0/0.0.0.0:11221:NIOServerCnxnFactory@219] - NIOServerCnxn factory exited run method
    [junit] 2017-02-18 02:41:43,665 [myid:] - INFO  [main:ZooKeeperServer@505] - shutting down
    [junit] 2017-02-18 02:41:43,665 [myid:] - ERROR [main:ZooKeeperServer@472] - ZKShutdownHandler is not registered, so ZooKeeper server won't take any action on ERROR or SHUTDOWN server state changes
    [junit] 2017-02-18 02:41:43,665 [myid:] - INFO  [main:SessionTrackerImpl@225] - Shutting down
    [junit] 2017-02-18 02:41:43,665 [myid:] - INFO  [main:PrepRequestProcessor@764] - Shutting down
    [junit] 2017-02-18 02:41:43,665 [myid:] - INFO  [main:SyncRequestProcessor@208] - Shutting down
    [junit] 2017-02-18 02:41:43,666 [myid:] - INFO  [ProcessThread(sid:0 cport:11221)::PrepRequestProcessor@143] - PrepRequestProcessor exited loop!
    [junit] 2017-02-18 02:41:43,666 [myid:] - INFO  [SyncThread:0:SyncRequestProcessor@186] - SyncRequestProcessor exited!
    [junit] 2017-02-18 02:41:43,666 [myid:] - INFO  [main:FinalRequestProcessor@402] - shutdown of request processor complete
    [junit] 2017-02-18 02:41:43,667 [myid:] - INFO  [main:FourLetterWordMain@62] - connecting to 127.0.0.1 11221
    [junit] 2017-02-18 02:41:43,667 [myid:] - INFO  [main:JMXEnv@147] - ensureOnly:[]
    [junit] 2017-02-18 02:41:43,671 [myid:] - INFO  [main:ClientBase@547] - fdcount after test is: 90 at start it was 78
    [junit] 2017-02-18 02:41:43,671 [myid:] - INFO  [main:ClientBase@549] - sleeping for 20 secs
    [junit] 2017-02-18 02:41:43,672 [myid:] - INFO  [main:ZKTestCase$1@65] - SUCCEEDED testQuota
    [junit] 2017-02-18 02:41:43,672 [myid:] - INFO  [main:ZKTestCase$1@60] - FINISHED testQuota
    [junit] Tests run: 1, Failures: 0, Errors: 0, Skipped: 0, Time elapsed: 0.543 sec

fail.build.on.test.failure:

BUILD FAILED
/home/jenkins/jenkins-slave/workspace/ZooKeeper_branch34_jdk7/build.xml:1328: The following error occurred while executing this line:
/home/jenkins/jenkins-slave/workspace/ZooKeeper_branch34_jdk7/build.xml:1331: Tests failed!

Total time: 28 minutes 57 seconds
Build step 'Invoke Ant' marked build as failure
Recording test results
Email was triggered for: Failure - Any
Sending email for trigger: Failure - Any



###################################################################################
############################## FAILED TESTS (if any) ##############################
2 tests failed.
FAILED:  org.apache.zookeeper.server.quorum.auth.QuorumKerberosHostBasedAuthTest.testConnectBadServer

Error Message:
waiting for server 2 being up

Stack Trace:
junit.framework.AssertionFailedError: waiting for server 2 being up
	at org.apache.zookeeper.server.quorum.auth.QuorumAuthTestBase.startQuorum(QuorumAuthTestBase.java:74)
	at org.apache.zookeeper.server.quorum.auth.QuorumKerberosHostBasedAuthTest.testConnectBadServer(QuorumKerberosHostBasedAuthTest.java:146)
	at org.apache.zookeeper.JUnit4ZKTestRunner$LoggedInvokeMethod.evaluate(JUnit4ZKTestRunner.java:55)


FAILED:  org.apache.zookeeper.server.quorum.auth.QuorumKerberosHostBasedAuthTest.testValidCredentials

Error Message:
waiting for server 0 being up

Stack Trace:
junit.framework.AssertionFailedError: waiting for server 0 being up
	at org.apache.zookeeper.server.quorum.auth.QuorumAuthTestBase.startQuorum(QuorumAuthTestBase.java:74)
	at org.apache.zookeeper.server.quorum.auth.QuorumKerberosHostBasedAuthTest.testValidCredentials(QuorumKerberosHostBasedAuthTest.java:125)
	at org.apache.zookeeper.JUnit4ZKTestRunner$LoggedInvokeMethod.evaluate(JUnit4ZKTestRunner.java:55)



ZooKeeper_branch34_jdk7 - Build # 1410 - Still Failing

Posted by Apache Jenkins Server <je...@builds.apache.org>.
See https://builds.apache.org/job/ZooKeeper_branch34_jdk7/1410/

###################################################################################
########################## LAST 60 LINES OF THE CONSOLE ###########################
[...truncated 244448 lines...]
    [junit] 2017-02-17 02:42:09,201 [myid:] - INFO  [main:SessionTrackerImpl@225] - Shutting down
    [junit] 2017-02-17 02:42:09,201 [myid:] - INFO  [main:PrepRequestProcessor@764] - Shutting down
    [junit] 2017-02-17 02:42:09,201 [myid:] - INFO  [main:SyncRequestProcessor@208] - Shutting down
    [junit] 2017-02-17 02:42:09,202 [myid:] - INFO  [SyncThread:0:SyncRequestProcessor@186] - SyncRequestProcessor exited!
    [junit] 2017-02-17 02:42:09,202 [myid:] - INFO  [main:FinalRequestProcessor@402] - shutdown of request processor complete
    [junit] 2017-02-17 02:42:09,203 [myid:] - INFO  [main:FourLetterWordMain@62] - connecting to 127.0.0.1 11221
    [junit] 2017-02-17 02:42:09,204 [myid:] - INFO  [main:JMXEnv@147] - ensureOnly:[]
    [junit] 2017-02-17 02:42:09,204 [myid:] - INFO  [ProcessThread(sid:0 cport:11221)::PrepRequestProcessor@143] - PrepRequestProcessor exited loop!
    [junit] 2017-02-17 02:42:09,209 [myid:] - INFO  [main:ClientBase@445] - STARTING server
    [junit] 2017-02-17 02:42:09,209 [myid:] - INFO  [main:ClientBase@366] - CREATING server instance 127.0.0.1:11221
    [junit] 2017-02-17 02:42:09,210 [myid:] - INFO  [main:NIOServerCnxnFactory@89] - binding to port 0.0.0.0/0.0.0.0:11221
    [junit] 2017-02-17 02:42:09,210 [myid:] - INFO  [main:ClientBase@341] - STARTING server instance 127.0.0.1:11221
    [junit] 2017-02-17 02:42:09,210 [myid:] - INFO  [main:ZooKeeperServer@173] - Created server with tickTime 3000 minSessionTimeout 6000 maxSessionTimeout 60000 datadir /home/jenkins/jenkins-slave/workspace/ZooKeeper_branch34_jdk7/build/test/tmp/test5375243551277146134.junit.dir/version-2 snapdir /home/jenkins/jenkins-slave/workspace/ZooKeeper_branch34_jdk7/build/test/tmp/test5375243551277146134.junit.dir/version-2
    [junit] 2017-02-17 02:42:09,214 [myid:] - ERROR [main:ZooKeeperServer@472] - ZKShutdownHandler is not registered, so ZooKeeper server won't take any action on ERROR or SHUTDOWN server state changes
    [junit] 2017-02-17 02:42:09,214 [myid:] - INFO  [main:FourLetterWordMain@62] - connecting to 127.0.0.1 11221
    [junit] 2017-02-17 02:42:09,214 [myid:] - INFO  [NIOServerCxn.Factory:0.0.0.0/0.0.0.0:11221:NIOServerCnxnFactory@192] - Accepted socket connection from /127.0.0.1:52976
    [junit] 2017-02-17 02:42:09,215 [myid:] - INFO  [NIOServerCxn.Factory:0.0.0.0/0.0.0.0:11221:NIOServerCnxn@838] - Processing stat command from /127.0.0.1:52976
    [junit] 2017-02-17 02:42:09,215 [myid:] - INFO  [Thread-4:NIOServerCnxn$StatCommand@674] - Stat command output
    [junit] 2017-02-17 02:42:09,216 [myid:] - INFO  [Thread-4:NIOServerCnxn@1019] - Closed socket connection for client /127.0.0.1:52976 (no session established for client)
    [junit] 2017-02-17 02:42:09,216 [myid:] - INFO  [main:JMXEnv@230] - ensureParent:[InMemoryDataTree, StandaloneServer_port]
    [junit] 2017-02-17 02:42:09,218 [myid:] - INFO  [main:JMXEnv@247] - expect:InMemoryDataTree
    [junit] 2017-02-17 02:42:09,218 [myid:] - INFO  [main:JMXEnv@251] - found:InMemoryDataTree org.apache.ZooKeeperService:name0=StandaloneServer_port11221,name1=InMemoryDataTree
    [junit] 2017-02-17 02:42:09,218 [myid:] - INFO  [main:JMXEnv@247] - expect:StandaloneServer_port
    [junit] 2017-02-17 02:42:09,218 [myid:] - INFO  [main:JMXEnv@251] - found:StandaloneServer_port org.apache.ZooKeeperService:name0=StandaloneServer_port11221
    [junit] 2017-02-17 02:42:09,219 [myid:] - INFO  [main:JUnit4ZKTestRunner$LoggedInvokeMethod@58] - Memory used 35674
    [junit] 2017-02-17 02:42:09,219 [myid:] - INFO  [main:JUnit4ZKTestRunner$LoggedInvokeMethod@63] - Number of threads 20
    [junit] 2017-02-17 02:42:09,219 [myid:] - INFO  [main:JUnit4ZKTestRunner$LoggedInvokeMethod@78] - FINISHED TEST METHOD testQuota
    [junit] 2017-02-17 02:42:09,219 [myid:] - INFO  [main:ClientBase@522] - tearDown starting
    [junit] 2017-02-17 02:42:09,281 [myid:] - INFO  [main:ZooKeeper@684] - Session: 0x15a49f2bbf50000 closed
    [junit] 2017-02-17 02:42:09,282 [myid:] - INFO  [main:ClientBase@492] - STOPPING server
    [junit] 2017-02-17 02:42:09,282 [myid:] - INFO  [main-EventThread:ClientCnxn$EventThread@519] - EventThread shut down for session: 0x15a49f2bbf50000
    [junit] 2017-02-17 02:42:09,282 [myid:] - INFO  [NIOServerCxn.Factory:0.0.0.0/0.0.0.0:11221:NIOServerCnxnFactory@219] - NIOServerCnxn factory exited run method
    [junit] 2017-02-17 02:42:09,286 [myid:] - INFO  [main:ZooKeeperServer@505] - shutting down
    [junit] 2017-02-17 02:42:09,287 [myid:] - ERROR [main:ZooKeeperServer@472] - ZKShutdownHandler is not registered, so ZooKeeper server won't take any action on ERROR or SHUTDOWN server state changes
    [junit] 2017-02-17 02:42:09,287 [myid:] - INFO  [main:SessionTrackerImpl@225] - Shutting down
    [junit] 2017-02-17 02:42:09,287 [myid:] - INFO  [main:PrepRequestProcessor@764] - Shutting down
    [junit] 2017-02-17 02:42:09,287 [myid:] - INFO  [main:SyncRequestProcessor@208] - Shutting down
    [junit] 2017-02-17 02:42:09,288 [myid:] - INFO  [ProcessThread(sid:0 cport:11221)::PrepRequestProcessor@143] - PrepRequestProcessor exited loop!
    [junit] 2017-02-17 02:42:09,288 [myid:] - INFO  [SyncThread:0:SyncRequestProcessor@186] - SyncRequestProcessor exited!
    [junit] 2017-02-17 02:42:09,288 [myid:] - INFO  [main:FinalRequestProcessor@402] - shutdown of request processor complete
    [junit] 2017-02-17 02:42:09,289 [myid:] - INFO  [main:FourLetterWordMain@62] - connecting to 127.0.0.1 11221
    [junit] 2017-02-17 02:42:09,290 [myid:] - INFO  [main:JMXEnv@147] - ensureOnly:[]
    [junit] 2017-02-17 02:42:09,295 [myid:] - INFO  [main:ClientBase@547] - fdcount after test is: 90 at start it was 78
    [junit] 2017-02-17 02:42:09,295 [myid:] - INFO  [main:ClientBase@549] - sleeping for 20 secs
    [junit] 2017-02-17 02:42:09,296 [myid:] - INFO  [main:ZKTestCase$1@65] - SUCCEEDED testQuota
    [junit] 2017-02-17 02:42:09,297 [myid:] - INFO  [main:ZKTestCase$1@60] - FINISHED testQuota
    [junit] Tests run: 1, Failures: 0, Errors: 0, Skipped: 0, Time elapsed: 0.721 sec

fail.build.on.test.failure:

BUILD FAILED
/home/jenkins/jenkins-slave/workspace/ZooKeeper_branch34_jdk7/build.xml:1328: The following error occurred while executing this line:
/home/jenkins/jenkins-slave/workspace/ZooKeeper_branch34_jdk7/build.xml:1331: Tests failed!

Total time: 29 minutes 39 seconds
Build step 'Invoke Ant' marked build as failure
Recording test results
Email was triggered for: Failure - Any
Sending email for trigger: Failure - Any



###################################################################################
############################## FAILED TESTS (if any) ##############################
1 tests failed.
FAILED:  org.apache.zookeeper.server.quorum.auth.QuorumKerberosAuthTest.testValidCredentials

Error Message:
waiting for server 0 being up

Stack Trace:
junit.framework.AssertionFailedError: waiting for server 0 being up
	at org.apache.zookeeper.server.quorum.auth.QuorumAuthTestBase.startQuorum(QuorumAuthTestBase.java:74)
	at org.apache.zookeeper.server.quorum.auth.QuorumKerberosAuthTest.testValidCredentials(QuorumKerberosAuthTest.java:101)
	at org.apache.zookeeper.JUnit4ZKTestRunner$LoggedInvokeMethod.evaluate(JUnit4ZKTestRunner.java:55)



ZooKeeper_branch34_jdk7 - Build # 1409 - Still Failing

Posted by Apache Jenkins Server <je...@builds.apache.org>.
See https://builds.apache.org/job/ZooKeeper_branch34_jdk7/1409/

###################################################################################
########################## LAST 60 LINES OF THE CONSOLE ###########################
[...truncated 243142 lines...]
    [junit] 2017-02-16 02:44:49,639 [myid:] - INFO  [main:SessionTrackerImpl@225] - Shutting down
    [junit] 2017-02-16 02:44:49,640 [myid:] - INFO  [main:PrepRequestProcessor@764] - Shutting down
    [junit] 2017-02-16 02:44:49,640 [myid:] - INFO  [main:SyncRequestProcessor@208] - Shutting down
    [junit] 2017-02-16 02:44:49,640 [myid:] - INFO  [ProcessThread(sid:0 cport:11221)::PrepRequestProcessor@143] - PrepRequestProcessor exited loop!
    [junit] 2017-02-16 02:44:49,640 [myid:] - INFO  [SyncThread:0:SyncRequestProcessor@186] - SyncRequestProcessor exited!
    [junit] 2017-02-16 02:44:49,641 [myid:] - INFO  [main:FinalRequestProcessor@402] - shutdown of request processor complete
    [junit] 2017-02-16 02:44:49,641 [myid:] - INFO  [main:FourLetterWordMain@62] - connecting to 127.0.0.1 11221
    [junit] 2017-02-16 02:44:49,642 [myid:] - INFO  [main:JMXEnv@147] - ensureOnly:[]
    [junit] 2017-02-16 02:44:49,643 [myid:] - INFO  [main:ClientBase@445] - STARTING server
    [junit] 2017-02-16 02:44:49,644 [myid:] - INFO  [main:ClientBase@366] - CREATING server instance 127.0.0.1:11221
    [junit] 2017-02-16 02:44:49,644 [myid:] - INFO  [main:NIOServerCnxnFactory@89] - binding to port 0.0.0.0/0.0.0.0:11221
    [junit] 2017-02-16 02:44:49,644 [myid:] - INFO  [main:ClientBase@341] - STARTING server instance 127.0.0.1:11221
    [junit] 2017-02-16 02:44:49,645 [myid:] - INFO  [main:ZooKeeperServer@173] - Created server with tickTime 3000 minSessionTimeout 6000 maxSessionTimeout 60000 datadir /home/jenkins/jenkins-slave/workspace/ZooKeeper_branch34_jdk7/build/test/tmp/test3803400603815445636.junit.dir/version-2 snapdir /home/jenkins/jenkins-slave/workspace/ZooKeeper_branch34_jdk7/build/test/tmp/test3803400603815445636.junit.dir/version-2
    [junit] 2017-02-16 02:44:49,648 [myid:] - ERROR [main:ZooKeeperServer@472] - ZKShutdownHandler is not registered, so ZooKeeper server won't take any action on ERROR or SHUTDOWN server state changes
    [junit] 2017-02-16 02:44:49,649 [myid:] - INFO  [main:FourLetterWordMain@62] - connecting to 127.0.0.1 11221
    [junit] 2017-02-16 02:44:49,649 [myid:] - INFO  [NIOServerCxn.Factory:0.0.0.0/0.0.0.0:11221:NIOServerCnxnFactory@192] - Accepted socket connection from /127.0.0.1:38039
    [junit] 2017-02-16 02:44:49,650 [myid:] - INFO  [NIOServerCxn.Factory:0.0.0.0/0.0.0.0:11221:NIOServerCnxn@838] - Processing stat command from /127.0.0.1:38039
    [junit] 2017-02-16 02:44:49,650 [myid:] - INFO  [Thread-4:NIOServerCnxn$StatCommand@674] - Stat command output
    [junit] 2017-02-16 02:44:49,651 [myid:] - INFO  [Thread-4:NIOServerCnxn@1019] - Closed socket connection for client /127.0.0.1:38039 (no session established for client)
    [junit] 2017-02-16 02:44:49,651 [myid:] - INFO  [main:JMXEnv@230] - ensureParent:[InMemoryDataTree, StandaloneServer_port]
    [junit] 2017-02-16 02:44:49,653 [myid:] - INFO  [main:JMXEnv@247] - expect:InMemoryDataTree
    [junit] 2017-02-16 02:44:49,653 [myid:] - INFO  [main:JMXEnv@251] - found:InMemoryDataTree org.apache.ZooKeeperService:name0=StandaloneServer_port11221,name1=InMemoryDataTree
    [junit] 2017-02-16 02:44:49,654 [myid:] - INFO  [main:JMXEnv@247] - expect:StandaloneServer_port
    [junit] 2017-02-16 02:44:49,654 [myid:] - INFO  [main:JMXEnv@251] - found:StandaloneServer_port org.apache.ZooKeeperService:name0=StandaloneServer_port11221
    [junit] 2017-02-16 02:44:49,654 [myid:] - INFO  [main:JUnit4ZKTestRunner$LoggedInvokeMethod@58] - Memory used 35674
    [junit] 2017-02-16 02:44:49,655 [myid:] - INFO  [main:JUnit4ZKTestRunner$LoggedInvokeMethod@63] - Number of threads 20
    [junit] 2017-02-16 02:44:49,655 [myid:] - INFO  [main:JUnit4ZKTestRunner$LoggedInvokeMethod@78] - FINISHED TEST METHOD testQuota
    [junit] 2017-02-16 02:44:49,655 [myid:] - INFO  [main:ClientBase@522] - tearDown starting
    [junit] 2017-02-16 02:44:49,721 [myid:] - INFO  [main:ZooKeeper@684] - Session: 0x15a44ced2c70000 closed
    [junit] 2017-02-16 02:44:49,721 [myid:] - INFO  [main:ClientBase@492] - STOPPING server
    [junit] 2017-02-16 02:44:49,721 [myid:] - INFO  [main-EventThread:ClientCnxn$EventThread@519] - EventThread shut down for session: 0x15a44ced2c70000
    [junit] 2017-02-16 02:44:49,721 [myid:] - INFO  [NIOServerCxn.Factory:0.0.0.0/0.0.0.0:11221:NIOServerCnxnFactory@219] - NIOServerCnxn factory exited run method
    [junit] 2017-02-16 02:44:49,722 [myid:] - INFO  [main:ZooKeeperServer@505] - shutting down
    [junit] 2017-02-16 02:44:49,722 [myid:] - ERROR [main:ZooKeeperServer@472] - ZKShutdownHandler is not registered, so ZooKeeper server won't take any action on ERROR or SHUTDOWN server state changes
    [junit] 2017-02-16 02:44:49,722 [myid:] - INFO  [main:SessionTrackerImpl@225] - Shutting down
    [junit] 2017-02-16 02:44:49,722 [myid:] - INFO  [main:PrepRequestProcessor@764] - Shutting down
    [junit] 2017-02-16 02:44:49,722 [myid:] - INFO  [main:SyncRequestProcessor@208] - Shutting down
    [junit] 2017-02-16 02:44:49,723 [myid:] - INFO  [ProcessThread(sid:0 cport:11221)::PrepRequestProcessor@143] - PrepRequestProcessor exited loop!
    [junit] 2017-02-16 02:44:49,723 [myid:] - INFO  [SyncThread:0:SyncRequestProcessor@186] - SyncRequestProcessor exited!
    [junit] 2017-02-16 02:44:49,723 [myid:] - INFO  [main:FinalRequestProcessor@402] - shutdown of request processor complete
    [junit] 2017-02-16 02:44:49,724 [myid:] - INFO  [main:FourLetterWordMain@62] - connecting to 127.0.0.1 11221
    [junit] 2017-02-16 02:44:49,725 [myid:] - INFO  [main:JMXEnv@147] - ensureOnly:[]
    [junit] 2017-02-16 02:44:49,729 [myid:] - INFO  [main:ClientBase@547] - fdcount after test is: 90 at start it was 78
    [junit] 2017-02-16 02:44:49,729 [myid:] - INFO  [main:ClientBase@549] - sleeping for 20 secs
    [junit] 2017-02-16 02:44:49,730 [myid:] - INFO  [main:ZKTestCase$1@65] - SUCCEEDED testQuota
    [junit] 2017-02-16 02:44:49,730 [myid:] - INFO  [main:ZKTestCase$1@60] - FINISHED testQuota
    [junit] Tests run: 1, Failures: 0, Errors: 0, Skipped: 0, Time elapsed: 0.557 sec

fail.build.on.test.failure:

BUILD FAILED
/home/jenkins/jenkins-slave/workspace/ZooKeeper_branch34_jdk7/build.xml:1328: The following error occurred while executing this line:
/home/jenkins/jenkins-slave/workspace/ZooKeeper_branch34_jdk7/build.xml:1331: Tests failed!

Total time: 29 minutes 0 seconds
Build step 'Invoke Ant' marked build as failure
Recording test results
Email was triggered for: Failure - Any
Sending email for trigger: Failure - Any



###################################################################################
############################## FAILED TESTS (if any) ##############################
1 tests failed.
FAILED:  org.apache.zookeeper.server.quorum.auth.QuorumKerberosHostBasedAuthTest.testValidCredentials

Error Message:
waiting for server 2 being up

Stack Trace:
junit.framework.AssertionFailedError: waiting for server 2 being up
	at org.apache.zookeeper.server.quorum.auth.QuorumAuthTestBase.startQuorum(QuorumAuthTestBase.java:74)
	at org.apache.zookeeper.server.quorum.auth.QuorumKerberosHostBasedAuthTest.testValidCredentials(QuorumKerberosHostBasedAuthTest.java:125)
	at org.apache.zookeeper.JUnit4ZKTestRunner$LoggedInvokeMethod.evaluate(JUnit4ZKTestRunner.java:55)



ZooKeeper_branch34_jdk7 - Build # 1408 - Still Failing

Posted by Apache Jenkins Server <je...@builds.apache.org>.
See https://builds.apache.org/job/ZooKeeper_branch34_jdk7/1408/

###################################################################################
########################## LAST 60 LINES OF THE CONSOLE ###########################
[...truncated 242506 lines...]
    [junit] 2017-02-16 02:15:44,836 [myid:] - INFO  [main:SessionTrackerImpl@225] - Shutting down
    [junit] 2017-02-16 02:15:44,836 [myid:] - INFO  [main:PrepRequestProcessor@764] - Shutting down
    [junit] 2017-02-16 02:15:44,837 [myid:] - INFO  [main:SyncRequestProcessor@208] - Shutting down
    [junit] 2017-02-16 02:15:44,837 [myid:] - INFO  [ProcessThread(sid:0 cport:11221)::PrepRequestProcessor@143] - PrepRequestProcessor exited loop!
    [junit] 2017-02-16 02:15:44,837 [myid:] - INFO  [SyncThread:0:SyncRequestProcessor@186] - SyncRequestProcessor exited!
    [junit] 2017-02-16 02:15:44,837 [myid:] - INFO  [main:FinalRequestProcessor@402] - shutdown of request processor complete
    [junit] 2017-02-16 02:15:44,838 [myid:] - INFO  [main:FourLetterWordMain@62] - connecting to 127.0.0.1 11221
    [junit] 2017-02-16 02:15:44,838 [myid:] - INFO  [main:JMXEnv@147] - ensureOnly:[]
    [junit] 2017-02-16 02:15:44,840 [myid:] - INFO  [main:ClientBase@445] - STARTING server
    [junit] 2017-02-16 02:15:44,840 [myid:] - INFO  [main:ClientBase@366] - CREATING server instance 127.0.0.1:11221
    [junit] 2017-02-16 02:15:44,841 [myid:] - INFO  [main:NIOServerCnxnFactory@89] - binding to port 0.0.0.0/0.0.0.0:11221
    [junit] 2017-02-16 02:15:44,841 [myid:] - INFO  [main:ClientBase@341] - STARTING server instance 127.0.0.1:11221
    [junit] 2017-02-16 02:15:44,841 [myid:] - INFO  [main:ZooKeeperServer@173] - Created server with tickTime 3000 minSessionTimeout 6000 maxSessionTimeout 60000 datadir /home/jenkins/jenkins-slave/workspace/ZooKeeper_branch34_jdk7/build/test/tmp/test1454687885659404818.junit.dir/version-2 snapdir /home/jenkins/jenkins-slave/workspace/ZooKeeper_branch34_jdk7/build/test/tmp/test1454687885659404818.junit.dir/version-2
    [junit] 2017-02-16 02:15:44,845 [myid:] - ERROR [main:ZooKeeperServer@472] - ZKShutdownHandler is not registered, so ZooKeeper server won't take any action on ERROR or SHUTDOWN server state changes
    [junit] 2017-02-16 02:15:44,845 [myid:] - INFO  [main:FourLetterWordMain@62] - connecting to 127.0.0.1 11221
    [junit] 2017-02-16 02:15:44,846 [myid:] - INFO  [NIOServerCxn.Factory:0.0.0.0/0.0.0.0:11221:NIOServerCnxnFactory@192] - Accepted socket connection from /127.0.0.1:55663
    [junit] 2017-02-16 02:15:44,846 [myid:] - INFO  [NIOServerCxn.Factory:0.0.0.0/0.0.0.0:11221:NIOServerCnxn@838] - Processing stat command from /127.0.0.1:55663
    [junit] 2017-02-16 02:15:44,847 [myid:] - INFO  [Thread-4:NIOServerCnxn$StatCommand@674] - Stat command output
    [junit] 2017-02-16 02:15:44,847 [myid:] - INFO  [Thread-4:NIOServerCnxn@1019] - Closed socket connection for client /127.0.0.1:55663 (no session established for client)
    [junit] 2017-02-16 02:15:44,848 [myid:] - INFO  [main:JMXEnv@230] - ensureParent:[InMemoryDataTree, StandaloneServer_port]
    [junit] 2017-02-16 02:15:44,850 [myid:] - INFO  [main:JMXEnv@247] - expect:InMemoryDataTree
    [junit] 2017-02-16 02:15:44,850 [myid:] - INFO  [main:JMXEnv@251] - found:InMemoryDataTree org.apache.ZooKeeperService:name0=StandaloneServer_port11221,name1=InMemoryDataTree
    [junit] 2017-02-16 02:15:44,850 [myid:] - INFO  [main:JMXEnv@247] - expect:StandaloneServer_port
    [junit] 2017-02-16 02:15:44,851 [myid:] - INFO  [main:JMXEnv@251] - found:StandaloneServer_port org.apache.ZooKeeperService:name0=StandaloneServer_port11221
    [junit] 2017-02-16 02:15:44,851 [myid:] - INFO  [main:JUnit4ZKTestRunner$LoggedInvokeMethod@58] - Memory used 35674
    [junit] 2017-02-16 02:15:44,851 [myid:] - INFO  [main:JUnit4ZKTestRunner$LoggedInvokeMethod@63] - Number of threads 20
    [junit] 2017-02-16 02:15:44,851 [myid:] - INFO  [main:JUnit4ZKTestRunner$LoggedInvokeMethod@78] - FINISHED TEST METHOD testQuota
    [junit] 2017-02-16 02:15:44,852 [myid:] - INFO  [main:ClientBase@522] - tearDown starting
    [junit] 2017-02-16 02:15:44,918 [myid:] - INFO  [main:ZooKeeper@684] - Session: 0x15a44b433280000 closed
    [junit] 2017-02-16 02:15:44,919 [myid:] - INFO  [main:ClientBase@492] - STOPPING server
    [junit] 2017-02-16 02:15:44,919 [myid:] - INFO  [NIOServerCxn.Factory:0.0.0.0/0.0.0.0:11221:NIOServerCnxnFactory@219] - NIOServerCnxn factory exited run method
    [junit] 2017-02-16 02:15:44,919 [myid:] - INFO  [main-EventThread:ClientCnxn$EventThread@519] - EventThread shut down for session: 0x15a44b433280000
    [junit] 2017-02-16 02:15:44,919 [myid:] - INFO  [main:ZooKeeperServer@505] - shutting down
    [junit] 2017-02-16 02:15:44,920 [myid:] - ERROR [main:ZooKeeperServer@472] - ZKShutdownHandler is not registered, so ZooKeeper server won't take any action on ERROR or SHUTDOWN server state changes
    [junit] 2017-02-16 02:15:44,920 [myid:] - INFO  [main:SessionTrackerImpl@225] - Shutting down
    [junit] 2017-02-16 02:15:44,920 [myid:] - INFO  [main:PrepRequestProcessor@764] - Shutting down
    [junit] 2017-02-16 02:15:44,920 [myid:] - INFO  [main:SyncRequestProcessor@208] - Shutting down
    [junit] 2017-02-16 02:15:44,921 [myid:] - INFO  [SyncThread:0:SyncRequestProcessor@186] - SyncRequestProcessor exited!
    [junit] 2017-02-16 02:15:44,921 [myid:] - INFO  [ProcessThread(sid:0 cport:11221)::PrepRequestProcessor@143] - PrepRequestProcessor exited loop!
    [junit] 2017-02-16 02:15:44,921 [myid:] - INFO  [main:FinalRequestProcessor@402] - shutdown of request processor complete
    [junit] 2017-02-16 02:15:44,922 [myid:] - INFO  [main:FourLetterWordMain@62] - connecting to 127.0.0.1 11221
    [junit] 2017-02-16 02:15:44,922 [myid:] - INFO  [main:JMXEnv@147] - ensureOnly:[]
    [junit] 2017-02-16 02:15:44,926 [myid:] - INFO  [main:ClientBase@547] - fdcount after test is: 90 at start it was 78
    [junit] 2017-02-16 02:15:44,926 [myid:] - INFO  [main:ClientBase@549] - sleeping for 20 secs
    [junit] 2017-02-16 02:15:44,927 [myid:] - INFO  [main:ZKTestCase$1@65] - SUCCEEDED testQuota
    [junit] 2017-02-16 02:15:44,928 [myid:] - INFO  [main:ZKTestCase$1@60] - FINISHED testQuota
    [junit] Tests run: 1, Failures: 0, Errors: 0, Skipped: 0, Time elapsed: 0.555 sec

fail.build.on.test.failure:

BUILD FAILED
/home/jenkins/jenkins-slave/workspace/ZooKeeper_branch34_jdk7/build.xml:1328: The following error occurred while executing this line:
/home/jenkins/jenkins-slave/workspace/ZooKeeper_branch34_jdk7/build.xml:1331: Tests failed!

Total time: 28 minutes 44 seconds
Build step 'Invoke Ant' marked build as failure
Recording test results
Email was triggered for: Failure - Any
Sending email for trigger: Failure - Any



###################################################################################
############################## FAILED TESTS (if any) ##############################
1 tests failed.
FAILED:  org.apache.zookeeper.server.quorum.auth.QuorumKerberosAuthTest.testValidCredentials

Error Message:
waiting for server 0 being up

Stack Trace:
junit.framework.AssertionFailedError: waiting for server 0 being up
	at org.apache.zookeeper.server.quorum.auth.QuorumAuthTestBase.startQuorum(QuorumAuthTestBase.java:74)
	at org.apache.zookeeper.server.quorum.auth.QuorumKerberosAuthTest.testValidCredentials(QuorumKerberosAuthTest.java:101)
	at org.apache.zookeeper.JUnit4ZKTestRunner$LoggedInvokeMethod.evaluate(JUnit4ZKTestRunner.java:55)