You are viewing a plain text version of this content. The canonical link for it is here.
Posted to dev@kafka.apache.org by Apache Jenkins Server <je...@builds.apache.org> on 2015/10/22 20:31:17 UTC
Build failed in Jenkins: kafka-trunk-jdk7 #711
See <https://builds.apache.org/job/kafka-trunk-jdk7/711/changes>
Changes:
[wangguoz] KAFKA-2678; partition level lag metrics can be negative
------------------------------------------
[...truncated 2826 lines...]
kafka.consumer.TopicFilterTest > testWhitelists PASSED
kafka.consumer.TopicFilterTest > testWildcardTopicCountGetTopicCountMapEscapeJson PASSED
kafka.consumer.TopicFilterTest > testBlacklists PASSED
kafka.consumer.PartitionAssignorTest > testRoundRobinPartitionAssignor PASSED
kafka.consumer.PartitionAssignorTest > testRangePartitionAssignor PASSED
kafka.consumer.MetricsTest > testMetricsReporterAfterDeletingTopic PASSED
kafka.consumer.MetricsTest > testMetricsLeak PASSED
kafka.common.TopicTest > testInvalidTopicNames PASSED
kafka.common.TopicTest > testTopicHasCollision PASSED
kafka.common.TopicTest > testTopicHasCollisionChars PASSED
kafka.common.ConfigTest > testInvalidGroupIds PASSED
kafka.common.ConfigTest > testInvalidClientIds PASSED
kafka.common.ZkNodeChangeNotificationListenerTest > testProcessNotification PASSED
kafka.zk.ZKEphemeralTest > testZkWatchedEphemeralRecursive PASSED
kafka.zk.ZKEphemeralTest > testOverlappingSessions PASSED
kafka.zk.ZKEphemeralTest > testEphemeralNodeCleanup PASSED
kafka.zk.ZKEphemeralTest > testZkWatchedEphemeral PASSED
kafka.zk.ZKEphemeralTest > testSameSession PASSED
kafka.zk.ZKPathTest > testCreatePersistentSequentialThrowsException PASSED
kafka.zk.ZKPathTest > testCreatePersistentSequentialExists PASSED
kafka.zk.ZKPathTest > testCreateEphemeralPathExists PASSED
kafka.zk.ZKPathTest > testCreatePersistentPath PASSED
kafka.zk.ZKPathTest > testMakeSurePersistsPathExistsThrowsException PASSED
kafka.zk.ZKPathTest > testCreateEphemeralPathThrowsException PASSED
kafka.zk.ZKPathTest > testCreatePersistentPathThrowsException PASSED
kafka.zk.ZKPathTest > testMakeSurePersistsPathExists PASSED
kafka.security.auth.SimpleAclAuthorizerTest > testAllowAllAccess PASSED
kafka.security.auth.SimpleAclAuthorizerTest > testNoAclFound PASSED
kafka.security.auth.SimpleAclAuthorizerTest > testAclManagementAPIs PASSED
kafka.security.auth.SimpleAclAuthorizerTest > testWildCardAcls PASSED
kafka.security.auth.SimpleAclAuthorizerTest > testTopicAcl PASSED
kafka.security.auth.SimpleAclAuthorizerTest > testSuperUserHasAccess PASSED
kafka.security.auth.SimpleAclAuthorizerTest > testDenyTakesPrecedence PASSED
kafka.security.auth.SimpleAclAuthorizerTest > testNoAclFoundOverride PASSED
kafka.security.auth.SimpleAclAuthorizerTest > testLoadCache PASSED
kafka.server.SaslSslReplicaFetchTest > testReplicaFetcherThread PASSED
kafka.server.ReplicaManagerTest > testHighWaterMarkDirectoryMapping PASSED
kafka.server.ReplicaManagerTest > testIllegalRequiredAcks PASSED
kafka.server.ReplicaManagerTest > testHighwaterMarkRelativeDirectoryMapping PASSED
kafka.server.IsrExpirationTest > testIsrExpirationForSlowFollowers PASSED
kafka.server.IsrExpirationTest > testIsrExpirationForStuckFollowers PASSED
kafka.server.IsrExpirationTest > testIsrExpirationIfNoFetchRequestMade PASSED
kafka.server.ClientQuotaManagerTest > testQuotaViolation PASSED
kafka.server.ClientQuotaManagerTest > testQuotaParsing PASSED
kafka.server.SimpleFetchTest > testReadFromLog PASSED
kafka.server.ServerGenerateBrokerIdTest > testAutoGenerateBrokerId PASSED
kafka.server.ServerGenerateBrokerIdTest > testMultipleLogDirsMetaProps PASSED
kafka.server.ServerGenerateBrokerIdTest > testUserConfigAndGeneratedBrokerId PASSED
kafka.server.ServerGenerateBrokerIdTest > testConsistentBrokerIdFromUserConfigAndMetaProps PASSED
kafka.server.ThrottledResponseExpirationTest > testThrottledRequest PASSED
kafka.server.ThrottledResponseExpirationTest > testExpire PASSED
kafka.server.SslReplicaFetchTest > testReplicaFetcherThread PASSED
kafka.server.ServerShutdownTest > testCleanShutdownAfterFailedStartup PASSED
kafka.server.ServerShutdownTest > testConsecutiveShutdown PASSED
kafka.server.ServerShutdownTest > testCleanShutdown PASSED
kafka.server.ServerShutdownTest > testCleanShutdownWithDeleteTopicEnabled PASSED
kafka.server.KafkaConfigTest > testAdvertiseConfigured PASSED
kafka.server.KafkaConfigTest > testLogRetentionTimeHoursProvided PASSED
kafka.server.KafkaConfigTest > testLogRollTimeBothMsAndHoursProvided PASSED
kafka.server.KafkaConfigTest > testLogRetentionValid PASSED
kafka.server.KafkaConfigTest > testSpecificProperties PASSED
kafka.server.KafkaConfigTest > testDefaultCompressionType PASSED
kafka.server.KafkaConfigTest > testDuplicateListeners PASSED
kafka.server.KafkaConfigTest > testLogRetentionUnlimited PASSED
kafka.server.KafkaConfigTest > testLogRetentionTimeMsProvided PASSED
kafka.server.KafkaConfigTest > testLogRollTimeNoConfigProvided PASSED
kafka.server.KafkaConfigTest > testAdvertiseDefaults PASSED
kafka.server.KafkaConfigTest > testBadListenerProtocol PASSED
kafka.server.KafkaConfigTest > testListenerDefaults PASSED
kafka.server.KafkaConfigTest > testLogRetentionTimeBothMinutesAndHoursProvided PASSED
kafka.server.KafkaConfigTest > testUncleanElectionDisabled PASSED
kafka.server.KafkaConfigTest > testLogRetentionTimeNoConfigProvided PASSED
kafka.server.KafkaConfigTest > testFromPropsInvalid PASSED
kafka.server.KafkaConfigTest > testInvalidCompressionType PASSED
kafka.server.KafkaConfigTest > testAdvertiseHostNameDefault PASSED
kafka.server.KafkaConfigTest > testLogRetentionTimeMinutesProvided PASSED
kafka.server.KafkaConfigTest > testValidCompressionType PASSED
kafka.server.KafkaConfigTest > testUncleanElectionInvalid PASSED
kafka.server.KafkaConfigTest > testLogRetentionTimeBothMinutesAndMsProvided PASSED
kafka.server.KafkaConfigTest > testLogRollTimeMsProvided PASSED
kafka.server.KafkaConfigTest > testUncleanLeaderElectionDefault PASSED
kafka.server.KafkaConfigTest > testUncleanElectionEnabled PASSED
kafka.server.KafkaConfigTest > testAdvertisePortDefault PASSED
kafka.server.KafkaConfigTest > testVersionConfiguration PASSED
kafka.server.OffsetCommitTest > testUpdateOffsets PASSED
kafka.server.OffsetCommitTest > testLargeMetadataPayload PASSED
kafka.server.OffsetCommitTest > testCommitAndFetchOffsets PASSED
kafka.server.OffsetCommitTest > testOffsetExpiration PASSED
kafka.server.OffsetCommitTest > testNonExistingTopicOffsetCommit PASSED
kafka.server.PlaintextReplicaFetchTest > testReplicaFetcherThread PASSED
kafka.server.SaslPlaintextReplicaFetchTest > testReplicaFetcherThread PASSED
kafka.server.LogOffsetTest > testGetOffsetsBeforeEarliestTime PASSED
kafka.server.LogOffsetTest > testGetOffsetsForUnknownTopic PASSED
kafka.server.LogOffsetTest > testEmptyLogsGetOffsets PASSED
kafka.server.LogOffsetTest > testGetOffsetsBeforeLatestTime PASSED
kafka.server.LogOffsetTest > testGetOffsetsBeforeNow PASSED
kafka.server.AdvertiseBrokerTest > testBrokerAdvertiseToZK PASSED
kafka.server.ServerStartupTest > testBrokerCreatesZKChroot PASSED
kafka.server.ServerStartupTest > testConflictBrokerRegistration PASSED
kafka.server.DelayedOperationTest > testRequestPurge PASSED
kafka.server.DelayedOperationTest > testRequestExpiry PASSED
kafka.server.DelayedOperationTest > testRequestSatisfaction PASSED
kafka.server.LeaderElectionTest > testLeaderElectionWithStaleControllerEpoch PASSED
kafka.server.LeaderElectionTest > testLeaderElectionAndEpoch PASSED
kafka.server.DynamicConfigChangeTest > testProcessNotification PASSED
kafka.server.DynamicConfigChangeTest > testClientQuotaConfigChange PASSED
kafka.server.DynamicConfigChangeTest > testConfigChangeOnNonExistingTopic PASSED
kafka.server.DynamicConfigChangeTest > testConfigChange PASSED
kafka.server.HighwatermarkPersistenceTest > testHighWatermarkPersistenceMultiplePartitions PASSED
kafka.server.HighwatermarkPersistenceTest > testHighWatermarkPersistenceSinglePartition PASSED
kafka.server.LogRecoveryTest > testHWCheckpointNoFailuresMultipleLogSegments PASSED
kafka.server.LogRecoveryTest > testHWCheckpointWithFailuresMultipleLogSegments PASSED
kafka.server.LogRecoveryTest > testHWCheckpointNoFailuresSingleLogSegment PASSED
519 tests completed, 1 failed
:kafka-trunk-jdk7:core:test FAILED
:test_core_2_11_7 FAILED
FAILURE: Build failed with an exception.
* What went wrong:
Execution failed for task ':core:test'.
> Process 'Gradle Test Executor 2' finished with non-zero exit value 1
* Try:
Run with --stacktrace option to get the stack trace. Run with --info or --debug option to get more log output.
BUILD FAILED
Total time: 1 hrs 52 mins 39.373 secs
Build step 'Execute shell' marked build as failure
Recording test results
Setting GRADLE_2_1_HOME=/home/jenkins/jenkins-slave/tools/hudson.plugins.gradle.GradleInstallation/Gradle_2.1
Setting JDK_1_7_LATEST__HOME=/home/jenkins/tools/java/latest1.7
Setting GRADLE_2_1_HOME=/home/jenkins/jenkins-slave/tools/hudson.plugins.gradle.GradleInstallation/Gradle_2.1
Setting JDK_1_7_LATEST__HOME=/home/jenkins/tools/java/latest1.7
Jenkins build is back to normal : kafka-trunk-jdk7 #712
Posted by Apache Jenkins Server <je...@builds.apache.org>.
See <https://builds.apache.org/job/kafka-trunk-jdk7/712/changes>