You are viewing a plain text version of this content. The canonical link for it is here.
Posted to builds@hbase.apache.org by Apache Jenkins Server <je...@builds.apache.org> on 2015/10/09 04:04:43 UTC
Build failed in Jenkins: HBase-1.2-IT » IntegrationTestAcidGuarantees,latest1.8,Hadoop #197
See <https://builds.apache.org/job/HBase-1.2-IT/it.test=IntegrationTestAcidGuarantees,jdk=latest1.8,label=Hadoop/197/changes>
Changes:
[eclark] HBASE-14529 Respond to SIGHUP to reload config
------------------------------------------
[...truncated 1775 lines...]
[INFO]
[INFO] --- jacoco-maven-plugin:0.7.5.201505241946:prepare-agent (prepare-agent) @ hbase-it ---
[INFO] Skipping JaCoCo execution because property jacoco.skip is set.
[INFO] argLine set to empty
[INFO]
[INFO] --- maven-remote-resources-plugin:1.5:process (default) @ hbase-it ---
[INFO]
[INFO] --- maven-resources-plugin:2.6:resources (default-resources) @ hbase-it ---
[INFO] Using 'UTF-8' encoding to copy filtered resources.
[INFO] skip non existing resourceDirectory <https://builds.apache.org/job/HBase-1.2-IT/it.test=IntegrationTestAcidGuarantees,jdk=latest1.8,label=Hadoop/ws/hbase-it/src/main/resources>
[INFO] Copying 3 resources
[INFO] Copying 3 resources
[INFO]
[INFO] --- maven-compiler-plugin:2.5.1:compile (default-compile) @ hbase-it ---
[INFO] No sources to compile
[INFO]
[INFO] --- maven-dependency-plugin:2.1:build-classpath (create-mrapp-generated-classpath) @ hbase-it ---
[INFO] Skipped writing classpath file '<https://builds.apache.org/job/HBase-1.2-IT/it.test=IntegrationTestAcidGuarantees,jdk=latest1.8,label=Hadoop/ws/hbase-it/target/test-classes/mrapp-generated-classpath'.> No changes found.
[INFO]
[INFO] --- maven-resources-plugin:2.6:testResources (default-testResources) @ hbase-it ---
[INFO] Using 'UTF-8' encoding to copy filtered resources.
[INFO] Copying 12 resources
[INFO] Copying 3 resources
[INFO] Copying 3 resources
[INFO]
[INFO] --- maven-compiler-plugin:2.5.1:testCompile (default-testCompile) @ hbase-it ---
[INFO] Nothing to compile - all classes are up to date
[INFO]
[INFO] --- maven-surefire-plugin:2.18.1:test (default-test) @ hbase-it ---
[INFO] Skipping execution of surefire because it has already been run for this configuration
[INFO]
[INFO] --- maven-surefire-plugin:2.18.1:test (secondPartTestsExecution) @ hbase-it ---
[INFO] Tests are skipped.
[INFO]
[INFO] --- jacoco-maven-plugin:0.7.5.201505241946:report (report) @ hbase-it ---
[INFO] Skipping JaCoCo execution because property jacoco.skip is set.
[INFO]
[INFO] --- maven-jar-plugin:2.4:test-jar (default) @ hbase-it ---
[WARNING] Artifact org.apache.hbase:hbase-it:test-jar:tests:1.2.0-SNAPSHOT already attached to project, ignoring duplicate
[INFO]
[INFO] --- maven-jar-plugin:2.4:jar (default-jar) @ hbase-it ---
[INFO]
[INFO] --- maven-failsafe-plugin:2.18.1:integration-test (integration-test) @ hbase-it ---
[WARNING] The parameter forkMode is deprecated since version 2.14. Use forkCount and reuseForks instead.
[INFO] Failsafe report directory: <https://builds.apache.org/job/HBase-1.2-IT/it.test=IntegrationTestAcidGuarantees,jdk=latest1.8,label=Hadoop/ws/hbase-it/target/failsafe-reports>
[INFO] Using configured provider org.apache.maven.surefire.junit4.JUnit4Provider
-------------------------------------------------------
T E S T S
-------------------------------------------------------
Running org.apache.hadoop.hbase.IntegrationTestAcidGuarantees
Tests run: 3, Failures: 0, Errors: 1, Skipped: 0, Time elapsed: 1,213.328 sec <<< FAILURE! - in org.apache.hadoop.hbase.IntegrationTestAcidGuarantees
testScanAtomicity(org.apache.hadoop.hbase.IntegrationTestAcidGuarantees) Time elapsed: 833.281 sec <<< ERROR!
java.lang.RuntimeException: Deferred
at org.apache.hadoop.hbase.MultithreadedTestUtil$TestContext.checkException(MultithreadedTestUtil.java:78)
at org.apache.hadoop.hbase.MultithreadedTestUtil$TestContext.stop(MultithreadedTestUtil.java:105)
at org.apache.hadoop.hbase.TestAcidGuarantees.runTestAtomicity(TestAcidGuarantees.java:316)
at org.apache.hadoop.hbase.TestAcidGuarantees.runTestAtomicity(TestAcidGuarantees.java:254)
at org.apache.hadoop.hbase.IntegrationTestAcidGuarantees.testScanAtomicity(IntegrationTestAcidGuarantees.java:101)
Caused by: org.apache.hadoop.hbase.client.RetriesExhaustedException: Failed after attempts=36, exceptions:
Fri Oct 09 01:52:07 UTC 2015, null, java.net.SocketTimeoutException: callTimeout=60000, callDuration=68011: row '' on table 'TestAcidGuarantees' at region=TestAcidGuarantees,,1444355471175.afc2ebfb7966e8e0bfb9be90be797acf., hostname=asf907.gq1.ygridcore.net,40865,1444355467965, seqNum=2
at org.apache.hadoop.hbase.client.RpcRetryingCallerWithReadReplicas.throwEnrichedException(RpcRetryingCallerWithReadReplicas.java:276)
at org.apache.hadoop.hbase.client.ScannerCallableWithReplicas.call(ScannerCallableWithReplicas.java:195)
at org.apache.hadoop.hbase.client.ScannerCallableWithReplicas.call(ScannerCallableWithReplicas.java:59)
at org.apache.hadoop.hbase.client.RpcRetryingCaller.callWithoutRetries(RpcRetryingCaller.java:200)
at org.apache.hadoop.hbase.client.ClientScanner.call(ClientScanner.java:320)
at org.apache.hadoop.hbase.client.ClientScanner.nextScanner(ClientScanner.java:295)
at org.apache.hadoop.hbase.client.ClientScanner.initializeScannerInConstruction(ClientScanner.java:160)
at org.apache.hadoop.hbase.client.ClientScanner.<init>(ClientScanner.java:155)
at org.apache.hadoop.hbase.client.HTable.getScanner(HTable.java:804)
at org.apache.hadoop.hbase.TestAcidGuarantees$AtomicScanReader.doAnAction(TestAcidGuarantees.java:214)
at org.apache.hadoop.hbase.MultithreadedTestUtil$RepeatingTestThread.doWork(MultithreadedTestUtil.java:147)
at org.apache.hadoop.hbase.MultithreadedTestUtil$TestThread.run(MultithreadedTestUtil.java:123)
Caused by: java.net.SocketTimeoutException: callTimeout=60000, callDuration=68011: row '' on table 'TestAcidGuarantees' at region=TestAcidGuarantees,,1444355471175.afc2ebfb7966e8e0bfb9be90be797acf., hostname=asf907.gq1.ygridcore.net,40865,1444355467965, seqNum=2
at org.apache.hadoop.hbase.client.RpcRetryingCaller.callWithRetries(RpcRetryingCaller.java:159)
at org.apache.hadoop.hbase.client.ResultBoundedCompletionService$QueueingFuture.run(ResultBoundedCompletionService.java:65)
at java.util.concurrent.ThreadPoolExecutor.runWorker(ThreadPoolExecutor.java:1142)
at java.util.concurrent.ThreadPoolExecutor$Worker.run(ThreadPoolExecutor.java:617)
at java.lang.Thread.run(Thread.java:745)
Caused by: org.apache.hadoop.hbase.NotServingRegionException: org.apache.hadoop.hbase.NotServingRegionException: Region TestAcidGuarantees,,1444355471175.afc2ebfb7966e8e0bfb9be90be797acf. is not online on asf907.gq1.ygridcore.net,40865,1444355467965
at org.apache.hadoop.hbase.regionserver.HRegionServer.getRegionByEncodedName(HRegionServer.java:2906)
at org.apache.hadoop.hbase.regionserver.RSRpcServices.getRegion(RSRpcServices.java:963)
at org.apache.hadoop.hbase.regionserver.RSRpcServices.scan(RSRpcServices.java:2254)
at org.apache.hadoop.hbase.protobuf.generated.ClientProtos$ClientService$2.callBlockingMethod(ClientProtos.java:32586)
at org.apache.hadoop.hbase.ipc.RpcServer.call(RpcServer.java:2120)
at org.apache.hadoop.hbase.ipc.CallRunner.run(CallRunner.java:106)
at org.apache.hadoop.hbase.ipc.RpcExecutor.consumerLoop(RpcExecutor.java:130)
at org.apache.hadoop.hbase.ipc.RpcExecutor$1.run(RpcExecutor.java:107)
at java.lang.Thread.run(Thread.java:745)
at sun.reflect.GeneratedConstructorAccessor38.newInstance(Unknown Source)
at sun.reflect.DelegatingConstructorAccessorImpl.newInstance(DelegatingConstructorAccessorImpl.java:45)
at java.lang.reflect.Constructor.newInstance(Constructor.java:422)
at org.apache.hadoop.ipc.RemoteException.instantiateException(RemoteException.java:106)
at org.apache.hadoop.ipc.RemoteException.unwrapRemoteException(RemoteException.java:95)
at org.apache.hadoop.hbase.protobuf.ProtobufUtil.getRemoteException(ProtobufUtil.java:329)
at org.apache.hadoop.hbase.client.ScannerCallable.openScanner(ScannerCallable.java:401)
at org.apache.hadoop.hbase.client.ScannerCallable.call(ScannerCallable.java:202)
at org.apache.hadoop.hbase.client.ScannerCallable.call(ScannerCallable.java:64)
at org.apache.hadoop.hbase.client.RpcRetryingCaller.callWithoutRetries(RpcRetryingCaller.java:200)
at org.apache.hadoop.hbase.client.ScannerCallableWithReplicas$RetryingRPC.call(ScannerCallableWithReplicas.java:346)
at org.apache.hadoop.hbase.client.ScannerCallableWithReplicas$RetryingRPC.call(ScannerCallableWithReplicas.java:320)
at org.apache.hadoop.hbase.client.RpcRetryingCaller.callWithRetries(RpcRetryingCaller.java:126)
at org.apache.hadoop.hbase.client.ResultBoundedCompletionService$QueueingFuture.run(ResultBoundedCompletionService.java:65)
at java.util.concurrent.ThreadPoolExecutor.runWorker(ThreadPoolExecutor.java:1142)
at java.util.concurrent.ThreadPoolExecutor$Worker.run(ThreadPoolExecutor.java:617)
at java.lang.Thread.run(Thread.java:745)
Caused by: org.apache.hadoop.hbase.ipc.RemoteWithExtrasException: org.apache.hadoop.hbase.NotServingRegionException: Region TestAcidGuarantees,,1444355471175.afc2ebfb7966e8e0bfb9be90be797acf. is not online on asf907.gq1.ygridcore.net,40865,1444355467965
at org.apache.hadoop.hbase.regionserver.HRegionServer.getRegionByEncodedName(HRegionServer.java:2906)
at org.apache.hadoop.hbase.regionserver.RSRpcServices.getRegion(RSRpcServices.java:963)
at org.apache.hadoop.hbase.regionserver.RSRpcServices.scan(RSRpcServices.java:2254)
at org.apache.hadoop.hbase.protobuf.generated.ClientProtos$ClientService$2.callBlockingMethod(ClientProtos.java:32586)
at org.apache.hadoop.hbase.ipc.RpcServer.call(RpcServer.java:2120)
at org.apache.hadoop.hbase.ipc.CallRunner.run(CallRunner.java:106)
at org.apache.hadoop.hbase.ipc.RpcExecutor.consumerLoop(RpcExecutor.java:130)
at org.apache.hadoop.hbase.ipc.RpcExecutor$1.run(RpcExecutor.java:107)
at java.lang.Thread.run(Thread.java:745)
at org.apache.hadoop.hbase.ipc.RpcClientImpl.call(RpcClientImpl.java:1259)
at org.apache.hadoop.hbase.ipc.AbstractRpcClient.callBlockingMethod(AbstractRpcClient.java:217)
at org.apache.hadoop.hbase.ipc.AbstractRpcClient$BlockingRpcChannelImplementation.callBlockingMethod(AbstractRpcClient.java:295)
at org.apache.hadoop.hbase.protobuf.generated.ClientProtos$ClientService$BlockingStub.scan(ClientProtos.java:33032)
at org.apache.hadoop.hbase.client.ScannerCallable.openScanner(ScannerCallable.java:393)
at org.apache.hadoop.hbase.client.ScannerCallable.call(ScannerCallable.java:202)
at org.apache.hadoop.hbase.client.ScannerCallable.call(ScannerCallable.java:64)
at org.apache.hadoop.hbase.client.RpcRetryingCaller.callWithoutRetries(RpcRetryingCaller.java:200)
at org.apache.hadoop.hbase.client.ScannerCallableWithReplicas$RetryingRPC.call(ScannerCallableWithReplicas.java:346)
at org.apache.hadoop.hbase.client.ScannerCallableWithReplicas$RetryingRPC.call(ScannerCallableWithReplicas.java:320)
at org.apache.hadoop.hbase.client.RpcRetryingCaller.callWithRetries(RpcRetryingCaller.java:126)
at org.apache.hadoop.hbase.client.ResultBoundedCompletionService$QueueingFuture.run(ResultBoundedCompletionService.java:65)
at java.util.concurrent.ThreadPoolExecutor.runWorker(ThreadPoolExecutor.java:1142)
at java.util.concurrent.ThreadPoolExecutor$Worker.run(ThreadPoolExecutor.java:617)
at java.lang.Thread.run(Thread.java:745)
Results :
Tests in error:
IntegrationTestAcidGuarantees.testScanAtomicity:101 » Runtime Deferred
Tests run: 3, Failures: 0, Errors: 1, Skipped: 0
[WARNING] File encoding has not been set, using platform encoding ISO-8859-1, i.e. build is platform dependent! The file encoding for reports output files should be provided by the POM property ${project.reporting.outputEncoding}.
[INFO]
[INFO] --- maven-failsafe-plugin:2.18.1:verify (verify) @ hbase-it ---
[INFO] Failsafe report directory: <https://builds.apache.org/job/HBase-1.2-IT/it.test=IntegrationTestAcidGuarantees,jdk=latest1.8,label=Hadoop/ws/hbase-it/target/failsafe-reports>
[WARNING] File encoding has not been set, using platform encoding ISO-8859-1, i.e. build is platform dependent! The file encoding for reports output files should be provided by the POM property ${project.reporting.outputEncoding}.
[INFO] ------------------------------------------------------------------------
[INFO] Reactor Summary:
[INFO]
[INFO] Apache HBase ...................................... SUCCESS [6.052s]
[INFO] Apache HBase - Checkstyle ......................... SUCCESS [0.730s]
[INFO] Apache HBase - Resource Bundle .................... SUCCESS [0.402s]
[INFO] Apache HBase - Annotations ........................ SUCCESS [1.619s]
[INFO] Apache HBase - Protocol ........................... SUCCESS [18.283s]
[INFO] Apache HBase - Common ............................. SUCCESS [9.697s]
[INFO] Apache HBase - Procedure .......................... SUCCESS [1.555s]
[INFO] Apache HBase - Client ............................. SUCCESS [6.521s]
[INFO] Apache HBase - Hadoop Compatibility ............... SUCCESS [0.418s]
[INFO] Apache HBase - Hadoop Two Compatibility ........... SUCCESS [1.188s]
[INFO] Apache HBase - Prefix Tree ........................ SUCCESS [1.443s]
[INFO] Apache HBase - Server ............................. SUCCESS [30.115s]
[INFO] Apache HBase - Testing Util ....................... SUCCESS [1.672s]
[INFO] Apache HBase - Thrift ............................. SUCCESS [6.500s]
[INFO] Apache HBase - Rest ............................... SUCCESS [3.214s]
[INFO] Apache HBase - Shell .............................. SUCCESS [1.089s]
[INFO] Apache HBase - Integration Tests .................. FAILURE [20:22.130s]
[INFO] Apache HBase - Examples ........................... SKIPPED
[INFO] Apache HBase - External Block Cache ............... SKIPPED
[INFO] Apache HBase - Assembly ........................... SKIPPED
[INFO] Apache HBase - Shaded ............................. SKIPPED
[INFO] Apache HBase - Shaded - Client .................... SKIPPED
[INFO] Apache HBase - Shaded - Server .................... SKIPPED
[INFO] ------------------------------------------------------------------------
[INFO] BUILD FAILURE
[INFO] ------------------------------------------------------------------------
[INFO] Total time: 21:54.464s
[INFO] Finished at: Fri Oct 09 02:05:06 UTC 2015
[INFO] Final Memory: 191M/3597M
[INFO] ------------------------------------------------------------------------
[ERROR] Failed to execute goal org.apache.maven.plugins:maven-failsafe-plugin:2.18.1:verify (verify) on project hbase-it: There are test failures.
[ERROR]
[ERROR] Please refer to <https://builds.apache.org/job/HBase-1.2-IT/it.test=IntegrationTestAcidGuarantees,jdk=latest1.8,label=Hadoop/ws/hbase-it/target/failsafe-reports> for the individual test results.
[ERROR] -> [Help 1]
[ERROR]
[ERROR] To see the full stack trace of the errors, re-run Maven with the -e switch.
[ERROR] Re-run Maven using the -X switch to enable full debug logging.
[ERROR]
[ERROR] For more information about the errors and possible solutions, please read the following articles:
[ERROR] [Help 1] http://cwiki.apache.org/confluence/display/MAVEN/MojoFailureException
[ERROR]
[ERROR] After correcting the problems, you can resume the build with the command
[ERROR] mvn <goals> -rf :hbase-it
Build step 'Invoke top-level Maven targets' marked build as failure
Performing Post build task...
Match found for :.* : True
Logical operation result is TRUE
Running script : ZOMBIE_TESTS_COUNT=`jps | grep surefirebooter | wc -l`
if [[ $ZOMBIE_TESTS_COUNT != 0 ]] ; then
#It seems sometimes the tests are not dying immediately. Let's give them 10s
echo "Suspicious java process found - waiting 10s to see if there are just slow to stop"
sleep 10
ZOMBIE_TESTS_COUNT=`jps | grep surefirebooter | wc -l`
if [[ $ZOMBIE_TESTS_COUNT != 0 ]] ; then
echo "There are $ZOMBIE_TESTS_COUNT zombie tests, they should have been killed by surefire but survived"
echo "************ BEGIN zombies jstack extract"
ZB_STACK=`jps | grep surefirebooter | cut -d ' ' -f 1 | xargs -n 1 jstack | grep ".test" | grep "\.java"`
jps | grep surefirebooter | cut -d ' ' -f 1 | xargs -n 1 jstack
echo "************ END zombies jstack extract"
JIRA_COMMENT="$JIRA_COMMENT
{color:red}-1 core zombie tests{color}. There are ${ZOMBIE_TESTS_COUNT} zombie test(s): ${ZB_STACK}"
BAD=1
jps | grep surefirebooter | cut -d ' ' -f 1 | xargs kill -9
else
echo "We're ok: there is no zombie test, but some tests took some time to stop"
fi
else
echo "We're ok: there is no zombie test"
fi
[Hadoop] $ /bin/bash -xe /tmp/hudson564900581472091723.sh
++ jps
++ grep surefirebooter
++ wc -l
+ ZOMBIE_TESTS_COUNT=1
+ [[ 1 != 0 ]]
+ echo 'Suspicious java process found - waiting 10s to see if there are just slow to stop'
Suspicious java process found - waiting 10s to see if there are just slow to stop
+ sleep 10
++ jps
++ grep surefirebooter
++ wc -l
+ ZOMBIE_TESTS_COUNT=1
+ [[ 1 != 0 ]]
+ echo 'There are 1 zombie tests, they should have been killed by surefire but survived'
There are 1 zombie tests, they should have been killed by surefire but survived
+ echo '************ BEGIN zombies jstack extract'
************ BEGIN zombies jstack extract
++ jps
++ grep surefirebooter
++ xargs -n 1 jstack
++ cut -d ' ' -f 1
++ grep '\.java'
++ grep .test
+ ZB_STACK=
POST BUILD TASK : FAILURE
END OF POST BUILD TASK : 0
Archiving artifacts
Jenkins build is back to normal : HBase-1.2-IT » IntegrationTestAcidGuarantees,latest1.8,Hadoop #198
Posted by Apache Jenkins Server <je...@builds.apache.org>.
See <https://builds.apache.org/job/HBase-1.2-IT/it.test=IntegrationTestAcidGuarantees,jdk=latest1.8,label=Hadoop/198/changes>