You are viewing a plain text version of this content. The canonical link for it is here.
Posted to dev@juneau.apache.org by Apache Jenkins Server <je...@builds.apache.org> on 2024/08/09 13:24:18 UTC
Build failed in Jenkins: Juneau » Juneau-Java-17 #921
See <https://ci-builds.apache.org/job/Juneau/job/Juneau-Java-17/921/display/redirect>
Changes:
------------------------------------------
[...truncated 756.47 KB...]
[INFO] --- enforcer:3.5.0:enforce (enforce-java-version) @ juneau-examples-rest ---
[INFO]
[INFO] --- enforcer:3.5.0:enforce (enforce-maven) @ juneau-examples-rest ---
[INFO]
[INFO] --- remote-resources:3.2.0:process (process-resource-bundles) @ juneau-examples-rest ---
[INFO] Preparing remote bundle org.apache.apache.resources:apache-jar-resource-bundle:1.5
[INFO] Copying 3 resources from 1 bundle.
[INFO]
[INFO] --- resources:3.3.1:resources (default-resources) @ juneau-examples-rest ---
[INFO] Copying 20 resources from src/main/resources to target/classes
[INFO] Copying 3 resources from target/maven-shared-archive-resources to target/classes
[INFO] Copying 3 resources from target/maven-shared-archive-resources to target/classes
[INFO] Copying 3 resources from target/maven-shared-archive-resources to target/classes
[INFO]
[INFO] --- compiler:3.13.0:compile (default-compile) @ juneau-examples-rest ---
[INFO] Recompiling the module because of changed dependency.
[INFO] Compiling 14 source files with javac [debug release 17] to target/classes
[WARNING] Overwriting artifact's file from <https://ci-builds.apache.org/job/Juneau/job/Juneau-Java-17/ws/juneau-examples/juneau-examples-rest/target/juneau-examples-rest-9.1.0-SNAPSHOT.jar> to <https://ci-builds.apache.org/job/Juneau/job/Juneau-Java-17/ws/juneau-examples/juneau-examples-rest/target/classes>
[INFO]
[INFO] >>>>>>>>>>>>>>>>>>>>>>>>>>>>>>>>>>>>>>>>>>>>>>>>>>>>>>>>>>>>>>>>>>>>>>>>
[INFO] Forking juneau/examples/examples-rest-jetty 9.1.0-SNAPSHOT
[INFO] >>>>>>>>>>>>>>>>>>>>>>>>>>>>>>>>>>>>>>>>>>>>>>>>>>>>>>>>>>>>>>>>>>>>>>>>
[INFO]
[INFO] --- enforcer:3.5.0:enforce (enforce-maven-version) @ juneau-examples-rest-jetty ---
[INFO]
[INFO] --- enforcer:3.5.0:enforce (enforce-java-version) @ juneau-examples-rest-jetty ---
[INFO]
[INFO] --- enforcer:3.5.0:enforce (enforce-maven) @ juneau-examples-rest-jetty ---
[INFO]
[INFO] --- remote-resources:3.2.0:process (process-resource-bundles) @ juneau-examples-rest-jetty ---
[INFO] Preparing remote bundle org.apache.apache.resources:apache-jar-resource-bundle:1.5
[INFO] Copying 3 resources from 1 bundle.
[INFO]
[INFO] --- resources:3.3.1:resources (default-resources) @ juneau-examples-rest-jetty ---
[INFO] Copying 1 resource from src/main/resources to target/classes
[INFO] Copying 3 resources from target/maven-shared-archive-resources to target/classes
[INFO] Copying 3 resources from target/maven-shared-archive-resources to target/classes
[INFO] Copying 3 resources from target/maven-shared-archive-resources to target/classes
[INFO]
[INFO] --- compiler:3.13.0:compile (default-compile) @ juneau-examples-rest-jetty ---
[INFO] Recompiling the module because of changed dependency.
[INFO] Compiling 2 source files with javac [debug release 17] to target/classes
[WARNING] Overwriting artifact's file from <https://ci-builds.apache.org/job/Juneau/job/Juneau-Java-17/ws/juneau-examples/juneau-examples-rest-jetty/target/juneau-examples-rest-jetty-9.1.0-SNAPSHOT.jar> to <https://ci-builds.apache.org/job/Juneau/job/Juneau-Java-17/ws/juneau-examples/juneau-examples-rest-jetty/target/classes>
[INFO]
[INFO] >>>>>>>>>>>>>>>>>>>>>>>>>>>>>>>>>>>>>>>>>>>>>>>>>>>>>>>>>>>>>>>>>>>>>>>>
[INFO] Forking juneau/examples/examples-rest-springboot 9.1.0-SNAPSHOT
[INFO] >>>>>>>>>>>>>>>>>>>>>>>>>>>>>>>>>>>>>>>>>>>>>>>>>>>>>>>>>>>>>>>>>>>>>>>>
[INFO]
[INFO] --- enforcer:3.5.0:enforce (enforce-maven-version) @ juneau-examples-rest-springboot ---
[INFO]
[INFO] --- enforcer:3.5.0:enforce (enforce-java-version) @ juneau-examples-rest-springboot ---
[INFO]
[INFO] --- enforcer:3.5.0:enforce (enforce-maven) @ juneau-examples-rest-springboot ---
[INFO]
[INFO] --- remote-resources:3.2.0:process (process-resource-bundles) @ juneau-examples-rest-springboot ---
[INFO] Preparing remote bundle org.apache.apache.resources:apache-jar-resource-bundle:1.5
[INFO] Copying 3 resources from 1 bundle.
[INFO]
[INFO] --- resources:3.3.1:resources (default-resources) @ juneau-examples-rest-springboot ---
[INFO] Copying 3 resources from src/main/resources to target/classes
[INFO] Copying 3 resources from target/maven-shared-archive-resources to target/classes
[INFO] Copying 3 resources from target/maven-shared-archive-resources to target/classes
[INFO] Copying 3 resources from target/maven-shared-archive-resources to target/classes
[INFO]
[INFO] --- compiler:3.13.0:compile (default-compile) @ juneau-examples-rest-springboot ---
[INFO] Recompiling the module because of changed dependency.
[INFO] Compiling 5 source files with javac [debug release 17] to target/classes
[WARNING] Overwriting artifact's file from <https://ci-builds.apache.org/job/Juneau/job/Juneau-Java-17/ws/juneau-examples/juneau-examples-rest-springboot/target/juneau-examples-rest-springboot-9.1.0-SNAPSHOT.jar> to <https://ci-builds.apache.org/job/Juneau/job/Juneau-Java-17/ws/juneau-examples/juneau-examples-rest-springboot/target/classes>
[INFO]
[INFO] >>>>>>>>>>>>>>>>>>>>>>>>>>>>>>>>>>>>>>>>>>>>>>>>>>>>>>>>>>>>>>>>>>>>>>>>
[INFO] Forking juneau/examples/examples-rest-jetty-ftest 9.1.0-SNAPSHOT
[INFO] >>>>>>>>>>>>>>>>>>>>>>>>>>>>>>>>>>>>>>>>>>>>>>>>>>>>>>>>>>>>>>>>>>>>>>>>
[INFO]
[INFO] --- enforcer:3.5.0:enforce (enforce-maven-version) @ juneau-examples-rest-jetty-ftest ---
[INFO]
[INFO] --- enforcer:3.5.0:enforce (enforce-java-version) @ juneau-examples-rest-jetty-ftest ---
[INFO]
[INFO] --- enforcer:3.5.0:enforce (enforce-maven) @ juneau-examples-rest-jetty-ftest ---
[INFO]
[INFO] --- jacoco:0.8.12:prepare-agent (default-prepare-agent) @ juneau-examples-rest-jetty-ftest ---
[INFO] argLine set to -javaagent:/home/jenkins/.m2/repository/org/jacoco/org.jacoco.agent/0.8.12/org.jacoco.agent-0.8.12-runtime.jar=destfile=<https://ci-builds.apache.org/job/Juneau/job/Juneau-Java-17/ws/juneau-examples/juneau-examples-rest-jetty-ftest/target/jacoco.exec>
[INFO]
[INFO] --- remote-resources:3.2.0:process (process-resource-bundles) @ juneau-examples-rest-jetty-ftest ---
[INFO] Preparing remote bundle org.apache.apache.resources:apache-jar-resource-bundle:1.5
[INFO] Copying 3 resources from 1 bundle.
[INFO]
[INFO] --- resources:3.3.1:resources (default-resources) @ juneau-examples-rest-jetty-ftest ---
[INFO] skip non existing resourceDirectory <https://ci-builds.apache.org/job/Juneau/job/Juneau-Java-17/ws/juneau-examples/juneau-examples-rest-jetty-ftest/src/main/resources>
[INFO] Copying 3 resources from target/maven-shared-archive-resources to target/classes
[INFO] Copying 3 resources from target/maven-shared-archive-resources to target/classes
[INFO] Copying 3 resources from target/maven-shared-archive-resources to target/classes
[INFO]
[INFO] --- compiler:3.13.0:compile (default-compile) @ juneau-examples-rest-jetty-ftest ---
[INFO] Recompiling the module because of changed dependency.
[WARNING] Overwriting artifact's file from <https://ci-builds.apache.org/job/Juneau/job/Juneau-Java-17/ws/juneau-examples/juneau-examples-rest-jetty-ftest/target/juneau-examples-rest-jetty-ftest-9.1.0-SNAPSHOT.jar> to <https://ci-builds.apache.org/job/Juneau/job/Juneau-Java-17/ws/juneau-examples/juneau-examples-rest-jetty-ftest/target/classes>
[INFO]
[INFO] >>>>>>>>>>>>>>>>>>>>>>>>>>>>>>>>>>>>>>>>>>>>>>>>>>>>>>>>>>>>>>>>>>>>>>>>
[INFO] Forking juneau/utest-utils 9.1.0-SNAPSHOT
[INFO] >>>>>>>>>>>>>>>>>>>>>>>>>>>>>>>>>>>>>>>>>>>>>>>>>>>>>>>>>>>>>>>>>>>>>>>>
[INFO]
[INFO] --- enforcer:3.5.0:enforce (enforce-maven-version) @ juneau-utest-utils ---
[INFO]
[INFO] --- enforcer:3.5.0:enforce (enforce-java-version) @ juneau-utest-utils ---
[INFO]
[INFO] --- enforcer:3.5.0:enforce (enforce-maven) @ juneau-utest-utils ---
[INFO]
[INFO] --- remote-resources:3.2.0:process (process-resource-bundles) @ juneau-utest-utils ---
[INFO] Preparing remote bundle org.apache.apache.resources:apache-jar-resource-bundle:1.5
[INFO] Copying 3 resources from 1 bundle.
[INFO]
[INFO] --- resources:3.3.1:resources (default-resources) @ juneau-utest-utils ---
[INFO] skip non existing resourceDirectory <https://ci-builds.apache.org/job/Juneau/job/Juneau-Java-17/ws/juneau-utest-utils/src/main/resources>
[INFO] Copying 3 resources from target/maven-shared-archive-resources to target/classes
[INFO] Copying 3 resources from target/maven-shared-archive-resources to target/classes
[INFO] Copying 3 resources from target/maven-shared-archive-resources to target/classes
[INFO]
[INFO] --- compiler:3.13.0:compile (default-compile) @ juneau-utest-utils ---
[INFO] Recompiling the module because of changed dependency.
[INFO] Compiling 30 source files with javac [debug release 17] to target/classes
[WARNING] Overwriting artifact's file from <https://ci-builds.apache.org/job/Juneau/job/Juneau-Java-17/ws/juneau-utest-utils/target/juneau-utest-utils-9.1.0-SNAPSHOT.jar> to <https://ci-builds.apache.org/job/Juneau/job/Juneau-Java-17/ws/juneau-utest-utils/target/classes>
[INFO]
[INFO] >>>>>>>>>>>>>>>>>>>>>>>>>>>>>>>>>>>>>>>>>>>>>>>>>>>>>>>>>>>>>>>>>>>>>>>>
[INFO] Forking juneau/utest 9.1.0-SNAPSHOT
[INFO] >>>>>>>>>>>>>>>>>>>>>>>>>>>>>>>>>>>>>>>>>>>>>>>>>>>>>>>>>>>>>>>>>>>>>>>>
[INFO]
[INFO] --- enforcer:3.5.0:enforce (enforce-maven-version) @ juneau-utest ---
[INFO]
[INFO] --- enforcer:3.5.0:enforce (enforce-java-version) @ juneau-utest ---
[INFO]
[INFO] --- enforcer:3.5.0:enforce (enforce-maven) @ juneau-utest ---
[INFO]
[INFO] --- jacoco:0.8.12:prepare-agent (default-prepare-agent) @ juneau-utest ---
[INFO] argLine set to -javaagent:/home/jenkins/.m2/repository/org/jacoco/org.jacoco.agent/0.8.12/org.jacoco.agent-0.8.12-runtime.jar=destfile=<https://ci-builds.apache.org/job/Juneau/job/Juneau-Java-17/ws/juneau-utest/target/jacoco.exec>
[INFO]
[INFO] --- remote-resources:3.2.0:process (process-resource-bundles) @ juneau-utest ---
[INFO] Preparing remote bundle org.apache.apache.resources:apache-jar-resource-bundle:1.5
[INFO] Copying 3 resources from 1 bundle.
[INFO]
[INFO] --- resources:3.3.1:resources (default-resources) @ juneau-utest ---
[INFO] skip non existing resourceDirectory <https://ci-builds.apache.org/job/Juneau/job/Juneau-Java-17/ws/juneau-utest/src/main/resources>
[INFO] Copying 3 resources from target/maven-shared-archive-resources to target/classes
[INFO] Copying 3 resources from target/maven-shared-archive-resources to target/classes
[INFO] Copying 3 resources from target/maven-shared-archive-resources to target/classes
[INFO]
[INFO] --- compiler:3.13.0:compile (default-compile) @ juneau-utest ---
[INFO] Recompiling the module because of changed dependency.
[WARNING] Overwriting artifact's file from <https://ci-builds.apache.org/job/Juneau/job/Juneau-Java-17/ws/juneau-utest/target/juneau-utest-9.1.0-SNAPSHOT.jar> to <https://ci-builds.apache.org/job/Juneau/job/Juneau-Java-17/ws/juneau-utest/target/classes>
[INFO]
[INFO] >>>>>>>>>>>>>>>>>>>>>>>>>>>>>>>>>>>>>>>>>>>>>>>>>>>>>>>>>>>>>>>>>>>>>>>>
[INFO] Forking juneau/all 9.1.0-SNAPSHOT
[INFO] >>>>>>>>>>>>>>>>>>>>>>>>>>>>>>>>>>>>>>>>>>>>>>>>>>>>>>>>>>>>>>>>>>>>>>>>
[INFO]
[INFO] --- enforcer:3.5.0:enforce (enforce-maven-version) @ juneau-all ---
[INFO]
[INFO] --- enforcer:3.5.0:enforce (enforce-java-version) @ juneau-all ---
[INFO]
[INFO] --- enforcer:3.5.0:enforce (enforce-maven) @ juneau-all ---
[INFO]
[INFO] --- remote-resources:3.2.0:process (process-resource-bundles) @ juneau-all ---
[INFO] Preparing remote bundle org.apache.apache.resources:apache-jar-resource-bundle:1.5
[INFO] Copying 3 resources from 1 bundle.
[INFO]
[INFO] --- resources:3.3.1:resources (default-resources) @ juneau-all ---
[INFO] skip non existing resourceDirectory <https://ci-builds.apache.org/job/Juneau/job/Juneau-Java-17/ws/juneau-all/src/main/resources>
[INFO] Copying 3 resources from target/maven-shared-archive-resources to target/classes
[INFO] Copying 3 resources from target/maven-shared-archive-resources to target/classes
[INFO] Copying 3 resources from target/maven-shared-archive-resources to target/classes
[INFO]
[INFO] --- compiler:3.13.0:compile (default-compile) @ juneau-all ---
[INFO] No sources to compile
[WARNING] Overwriting artifact's file from <https://ci-builds.apache.org/job/Juneau/job/Juneau-Java-17/ws/juneau-all/target/juneau-all-9.1.0-SNAPSHOT.jar> to <https://ci-builds.apache.org/job/Juneau/job/Juneau-Java-17/ws/juneau-all/target/classes>
[INFO]
[INFO] >>>>>>>>>>>>>>>>>>>>>>>>>>>>>>>>>>>>>>>>>>>>>>>>>>>>>>>>>>>>>>>>>>>>>>>>
[INFO] Forking juneau/distrib 9.1.0-SNAPSHOT
[INFO] >>>>>>>>>>>>>>>>>>>>>>>>>>>>>>>>>>>>>>>>>>>>>>>>>>>>>>>>>>>>>>>>>>>>>>>>
[INFO]
[INFO] --- enforcer:3.5.0:enforce (enforce-maven-version) @ juneau-distrib ---
[INFO]
[INFO] --- enforcer:3.5.0:enforce (enforce-java-version) @ juneau-distrib ---
[INFO]
[INFO] --- enforcer:3.5.0:enforce (enforce-maven) @ juneau-distrib ---
[INFO]
[INFO] --- remote-resources:3.2.0:process (process-resource-bundles) @ juneau-distrib ---
[INFO] Preparing remote bundle org.apache.apache.resources:apache-jar-resource-bundle:1.5
[INFO] Copying 3 resources from 1 bundle.
[INFO]
[INFO] <<< javadoc:3.8.0:aggregate (default-cli) < compile @ juneau <<<
[INFO]
[INFO]
[INFO] --- javadoc:3.8.0:aggregate (default-cli) @ juneau ---
[INFO] No previous run data found, generating javadoc.
[INFO] ------------------------------------------------------------------------
[INFO] Reactor Summary for juneau 9.1.0-SNAPSHOT:
[INFO]
[INFO] juneau ............................................. FAILURE [ 24.512 s]
[INFO] juneau/core ........................................ SUCCESS [ 4.961 s]
[INFO] juneau/core/common ................................. SUCCESS [ 14.062 s]
[INFO] juneau/core/marshall ............................... SUCCESS [ 48.331 s]
[INFO] juneau/core/dto .................................... SUCCESS [ 19.218 s]
[INFO] juneau/core/config ................................. SUCCESS [ 8.752 s]
[INFO] juneau/core/assertions ............................. SUCCESS [ 10.085 s]
[INFO] juneau/rest ........................................ SUCCESS [ 4.624 s]
[INFO] juneau/rest/rest-common ............................ SUCCESS [ 13.691 s]
[INFO] juneau/rest/rest-server ............................ SUCCESS [ 19.561 s]
[INFO] juneau/rest/rest-server-springboot ................. SUCCESS [ 9.185 s]
[INFO] juneau/rest/rest-client ............................ SUCCESS [ 10.175 s]
[INFO] juneau/rest/rest-mock .............................. SUCCESS [ 9.804 s]
[INFO] juneau/microservice ................................ SUCCESS [ 4.002 s]
[INFO] juneau/microservice/microservice-core .............. SUCCESS [ 8.753 s]
[INFO] juneau/microservice/microservice-jetty ............. SUCCESS [ 10.170 s]
[INFO] juneau/microservice/my-jetty-microservice .......... SUCCESS [ 6.797 s]
[INFO] juneau/microservice/my-springboot-microservice ..... SUCCESS [ 7.162 s]
[INFO] juneau/sc .......................................... SUCCESS [ 5.464 s]
[INFO] juneau/sc/sc-server ................................ SUCCESS [ 6.736 s]
[INFO] juneau/sc/sc-client ................................ SUCCESS [ 5.663 s]
[INFO] juneau/examples .................................... SUCCESS [ 3.939 s]
[INFO] juneau/examples/examples-core ...................... SUCCESS [ 9.951 s]
[INFO] juneau/examples/rest ............................... SUCCESS [ 10.286 s]
[INFO] juneau/examples/examples-rest-jetty ................ SUCCESS [ 8.612 s]
[INFO] juneau/examples/examples-rest-springboot ........... SUCCESS [ 13.785 s]
[INFO] juneau/examples/examples-rest-jetty-ftest .......... SUCCESS [ 18.654 s]
[INFO] juneau/utest-utils ................................. SUCCESS [ 8.600 s]
[INFO] juneau/utest ....................................... SUCCESS [02:33 min]
[INFO] juneau/all ......................................... SUCCESS [ 12.270 s]
[INFO] juneau/distrib ..................................... SUCCESS [ 8.878 s]
[INFO] ------------------------------------------------------------------------
[INFO] BUILD FAILURE
[INFO] ------------------------------------------------------------------------
[INFO] Total time: 08:40 min
[INFO] Finished at: 2024-08-09T13:24:14Z
[INFO] ------------------------------------------------------------------------
[ERROR] Failed to execute goal org.apache.maven.plugins:maven-javadoc-plugin:3.8.0:aggregate (default-cli) on project juneau: An error has occurred in Javadoc report generation:
[ERROR] Exit code: 2
[ERROR] error: No source files for package org.apache.juneau.common.utils
[ERROR] 1 error
[ERROR] Command line was: /usr/local/asfpackages/java/adoptium-jdk-17.0.7+7/bin/javadoc -J-Duser.language= -J-Duser.country= -J-DjuneauVersion=9.1.0 -J-DjuneauVersionNext=9.1.1 --allow-script-in-comments @options @packages
[ERROR]
[ERROR] Refer to the generated Javadoc files in '<https://ci-builds.apache.org/job/Juneau/job/Juneau-Java-17/ws/target/site/apidocs'> dir.
[ERROR]
[ERROR] -> [Help 1]
[ERROR]
[ERROR] To see the full stack trace of the errors, re-run Maven with the -e switch.
[ERROR] Re-run Maven using the -X switch to enable full debug logging.
[ERROR]
[ERROR] For more information about the errors and possible solutions, please read the following articles:
[ERROR] [Help 1] http://cwiki.apache.org/confluence/display/MAVEN/MojoExecutionException
Build step 'Invoke top-level Maven targets' marked build as failure
Recording test results
[Checks API] No suitable checks publisher found.
Build failed in Jenkins: Juneau » Juneau-Java-17 #923
Posted by Apache Jenkins Server <je...@builds.apache.org>.
See <https://ci-builds.apache.org/job/Juneau/job/Juneau-Java-17/923/display/redirect?page=changes>
Changes:
[github] Omit transfer progress from Maven output
------------------------------------------
[...truncated 752.04 KB...]
[INFO] --- enforcer:3.5.0:enforce (enforce-java-version) @ juneau-examples-rest ---
[INFO]
[INFO] --- enforcer:3.5.0:enforce (enforce-maven) @ juneau-examples-rest ---
[INFO]
[INFO] --- remote-resources:3.2.0:process (process-resource-bundles) @ juneau-examples-rest ---
[INFO] Preparing remote bundle org.apache.apache.resources:apache-jar-resource-bundle:1.5
[INFO] Copying 3 resources from 1 bundle.
[INFO]
[INFO] --- resources:3.3.1:resources (default-resources) @ juneau-examples-rest ---
[INFO] Copying 20 resources from src/main/resources to target/classes
[INFO] Copying 3 resources from target/maven-shared-archive-resources to target/classes
[INFO] Copying 3 resources from target/maven-shared-archive-resources to target/classes
[INFO] Copying 3 resources from target/maven-shared-archive-resources to target/classes
[INFO]
[INFO] --- compiler:3.13.0:compile (default-compile) @ juneau-examples-rest ---
[INFO] Recompiling the module because of changed dependency.
[INFO] Compiling 14 source files with javac [debug release 17] to target/classes
[WARNING] Overwriting artifact's file from <https://ci-builds.apache.org/job/Juneau/job/Juneau-Java-17/ws/juneau-examples/juneau-examples-rest/target/juneau-examples-rest-9.1.0-SNAPSHOT.jar> to <https://ci-builds.apache.org/job/Juneau/job/Juneau-Java-17/ws/juneau-examples/juneau-examples-rest/target/classes>
[INFO]
[INFO] >>>>>>>>>>>>>>>>>>>>>>>>>>>>>>>>>>>>>>>>>>>>>>>>>>>>>>>>>>>>>>>>>>>>>>>>
[INFO] Forking juneau/examples/examples-rest-jetty 9.1.0-SNAPSHOT
[INFO] >>>>>>>>>>>>>>>>>>>>>>>>>>>>>>>>>>>>>>>>>>>>>>>>>>>>>>>>>>>>>>>>>>>>>>>>
[INFO]
[INFO] --- enforcer:3.5.0:enforce (enforce-maven-version) @ juneau-examples-rest-jetty ---
[INFO]
[INFO] --- enforcer:3.5.0:enforce (enforce-java-version) @ juneau-examples-rest-jetty ---
[INFO]
[INFO] --- enforcer:3.5.0:enforce (enforce-maven) @ juneau-examples-rest-jetty ---
[INFO]
[INFO] --- remote-resources:3.2.0:process (process-resource-bundles) @ juneau-examples-rest-jetty ---
[INFO] Preparing remote bundle org.apache.apache.resources:apache-jar-resource-bundle:1.5
[INFO] Copying 3 resources from 1 bundle.
[INFO]
[INFO] --- resources:3.3.1:resources (default-resources) @ juneau-examples-rest-jetty ---
[INFO] Copying 1 resource from src/main/resources to target/classes
[INFO] Copying 3 resources from target/maven-shared-archive-resources to target/classes
[INFO] Copying 3 resources from target/maven-shared-archive-resources to target/classes
[INFO] Copying 3 resources from target/maven-shared-archive-resources to target/classes
[INFO]
[INFO] --- compiler:3.13.0:compile (default-compile) @ juneau-examples-rest-jetty ---
[INFO] Recompiling the module because of changed dependency.
[INFO] Compiling 2 source files with javac [debug release 17] to target/classes
[WARNING] Overwriting artifact's file from <https://ci-builds.apache.org/job/Juneau/job/Juneau-Java-17/ws/juneau-examples/juneau-examples-rest-jetty/target/juneau-examples-rest-jetty-9.1.0-SNAPSHOT.jar> to <https://ci-builds.apache.org/job/Juneau/job/Juneau-Java-17/ws/juneau-examples/juneau-examples-rest-jetty/target/classes>
[INFO]
[INFO] >>>>>>>>>>>>>>>>>>>>>>>>>>>>>>>>>>>>>>>>>>>>>>>>>>>>>>>>>>>>>>>>>>>>>>>>
[INFO] Forking juneau/examples/examples-rest-springboot 9.1.0-SNAPSHOT
[INFO] >>>>>>>>>>>>>>>>>>>>>>>>>>>>>>>>>>>>>>>>>>>>>>>>>>>>>>>>>>>>>>>>>>>>>>>>
[INFO]
[INFO] --- enforcer:3.5.0:enforce (enforce-maven-version) @ juneau-examples-rest-springboot ---
[INFO]
[INFO] --- enforcer:3.5.0:enforce (enforce-java-version) @ juneau-examples-rest-springboot ---
[INFO]
[INFO] --- enforcer:3.5.0:enforce (enforce-maven) @ juneau-examples-rest-springboot ---
[INFO]
[INFO] --- remote-resources:3.2.0:process (process-resource-bundles) @ juneau-examples-rest-springboot ---
[INFO] Preparing remote bundle org.apache.apache.resources:apache-jar-resource-bundle:1.5
[INFO] Copying 3 resources from 1 bundle.
[INFO]
[INFO] --- resources:3.3.1:resources (default-resources) @ juneau-examples-rest-springboot ---
[INFO] Copying 3 resources from src/main/resources to target/classes
[INFO] Copying 3 resources from target/maven-shared-archive-resources to target/classes
[INFO] Copying 3 resources from target/maven-shared-archive-resources to target/classes
[INFO] Copying 3 resources from target/maven-shared-archive-resources to target/classes
[INFO]
[INFO] --- compiler:3.13.0:compile (default-compile) @ juneau-examples-rest-springboot ---
[INFO] Recompiling the module because of changed dependency.
[INFO] Compiling 5 source files with javac [debug release 17] to target/classes
[WARNING] Overwriting artifact's file from <https://ci-builds.apache.org/job/Juneau/job/Juneau-Java-17/ws/juneau-examples/juneau-examples-rest-springboot/target/juneau-examples-rest-springboot-9.1.0-SNAPSHOT.jar> to <https://ci-builds.apache.org/job/Juneau/job/Juneau-Java-17/ws/juneau-examples/juneau-examples-rest-springboot/target/classes>
[INFO]
[INFO] >>>>>>>>>>>>>>>>>>>>>>>>>>>>>>>>>>>>>>>>>>>>>>>>>>>>>>>>>>>>>>>>>>>>>>>>
[INFO] Forking juneau/examples/examples-rest-jetty-ftest 9.1.0-SNAPSHOT
[INFO] >>>>>>>>>>>>>>>>>>>>>>>>>>>>>>>>>>>>>>>>>>>>>>>>>>>>>>>>>>>>>>>>>>>>>>>>
[INFO]
[INFO] --- enforcer:3.5.0:enforce (enforce-maven-version) @ juneau-examples-rest-jetty-ftest ---
[INFO]
[INFO] --- enforcer:3.5.0:enforce (enforce-java-version) @ juneau-examples-rest-jetty-ftest ---
[INFO]
[INFO] --- enforcer:3.5.0:enforce (enforce-maven) @ juneau-examples-rest-jetty-ftest ---
[INFO]
[INFO] --- jacoco:0.8.12:prepare-agent (default-prepare-agent) @ juneau-examples-rest-jetty-ftest ---
[INFO] argLine set to -javaagent:/home/jenkins/.m2/repository/org/jacoco/org.jacoco.agent/0.8.12/org.jacoco.agent-0.8.12-runtime.jar=destfile=<https://ci-builds.apache.org/job/Juneau/job/Juneau-Java-17/ws/juneau-examples/juneau-examples-rest-jetty-ftest/target/jacoco.exec>
[INFO]
[INFO] --- remote-resources:3.2.0:process (process-resource-bundles) @ juneau-examples-rest-jetty-ftest ---
[INFO] Preparing remote bundle org.apache.apache.resources:apache-jar-resource-bundle:1.5
[INFO] Copying 3 resources from 1 bundle.
[INFO]
[INFO] --- resources:3.3.1:resources (default-resources) @ juneau-examples-rest-jetty-ftest ---
[INFO] skip non existing resourceDirectory <https://ci-builds.apache.org/job/Juneau/job/Juneau-Java-17/ws/juneau-examples/juneau-examples-rest-jetty-ftest/src/main/resources>
[INFO] Copying 3 resources from target/maven-shared-archive-resources to target/classes
[INFO] Copying 3 resources from target/maven-shared-archive-resources to target/classes
[INFO] Copying 3 resources from target/maven-shared-archive-resources to target/classes
[INFO]
[INFO] --- compiler:3.13.0:compile (default-compile) @ juneau-examples-rest-jetty-ftest ---
[INFO] Recompiling the module because of changed dependency.
[WARNING] Overwriting artifact's file from <https://ci-builds.apache.org/job/Juneau/job/Juneau-Java-17/ws/juneau-examples/juneau-examples-rest-jetty-ftest/target/juneau-examples-rest-jetty-ftest-9.1.0-SNAPSHOT.jar> to <https://ci-builds.apache.org/job/Juneau/job/Juneau-Java-17/ws/juneau-examples/juneau-examples-rest-jetty-ftest/target/classes>
[INFO]
[INFO] >>>>>>>>>>>>>>>>>>>>>>>>>>>>>>>>>>>>>>>>>>>>>>>>>>>>>>>>>>>>>>>>>>>>>>>>
[INFO] Forking juneau/utest-utils 9.1.0-SNAPSHOT
[INFO] >>>>>>>>>>>>>>>>>>>>>>>>>>>>>>>>>>>>>>>>>>>>>>>>>>>>>>>>>>>>>>>>>>>>>>>>
[INFO]
[INFO] --- enforcer:3.5.0:enforce (enforce-maven-version) @ juneau-utest-utils ---
[INFO]
[INFO] --- enforcer:3.5.0:enforce (enforce-java-version) @ juneau-utest-utils ---
[INFO]
[INFO] --- enforcer:3.5.0:enforce (enforce-maven) @ juneau-utest-utils ---
[INFO]
[INFO] --- remote-resources:3.2.0:process (process-resource-bundles) @ juneau-utest-utils ---
[INFO] Preparing remote bundle org.apache.apache.resources:apache-jar-resource-bundle:1.5
[INFO] Copying 3 resources from 1 bundle.
[INFO]
[INFO] --- resources:3.3.1:resources (default-resources) @ juneau-utest-utils ---
[INFO] skip non existing resourceDirectory <https://ci-builds.apache.org/job/Juneau/job/Juneau-Java-17/ws/juneau-utest-utils/src/main/resources>
[INFO] Copying 3 resources from target/maven-shared-archive-resources to target/classes
[INFO] Copying 3 resources from target/maven-shared-archive-resources to target/classes
[INFO] Copying 3 resources from target/maven-shared-archive-resources to target/classes
[INFO]
[INFO] --- compiler:3.13.0:compile (default-compile) @ juneau-utest-utils ---
[INFO] Recompiling the module because of changed dependency.
[INFO] Compiling 30 source files with javac [debug release 17] to target/classes
[WARNING] Overwriting artifact's file from <https://ci-builds.apache.org/job/Juneau/job/Juneau-Java-17/ws/juneau-utest-utils/target/juneau-utest-utils-9.1.0-SNAPSHOT.jar> to <https://ci-builds.apache.org/job/Juneau/job/Juneau-Java-17/ws/juneau-utest-utils/target/classes>
[INFO]
[INFO] >>>>>>>>>>>>>>>>>>>>>>>>>>>>>>>>>>>>>>>>>>>>>>>>>>>>>>>>>>>>>>>>>>>>>>>>
[INFO] Forking juneau/utest 9.1.0-SNAPSHOT
[INFO] >>>>>>>>>>>>>>>>>>>>>>>>>>>>>>>>>>>>>>>>>>>>>>>>>>>>>>>>>>>>>>>>>>>>>>>>
[INFO]
[INFO] --- enforcer:3.5.0:enforce (enforce-maven-version) @ juneau-utest ---
[INFO]
[INFO] --- enforcer:3.5.0:enforce (enforce-java-version) @ juneau-utest ---
[INFO]
[INFO] --- enforcer:3.5.0:enforce (enforce-maven) @ juneau-utest ---
[INFO]
[INFO] --- jacoco:0.8.12:prepare-agent (default-prepare-agent) @ juneau-utest ---
[INFO] argLine set to -javaagent:/home/jenkins/.m2/repository/org/jacoco/org.jacoco.agent/0.8.12/org.jacoco.agent-0.8.12-runtime.jar=destfile=<https://ci-builds.apache.org/job/Juneau/job/Juneau-Java-17/ws/juneau-utest/target/jacoco.exec>
[INFO]
[INFO] --- remote-resources:3.2.0:process (process-resource-bundles) @ juneau-utest ---
[INFO] Preparing remote bundle org.apache.apache.resources:apache-jar-resource-bundle:1.5
[INFO] Copying 3 resources from 1 bundle.
[INFO]
[INFO] --- resources:3.3.1:resources (default-resources) @ juneau-utest ---
[INFO] skip non existing resourceDirectory <https://ci-builds.apache.org/job/Juneau/job/Juneau-Java-17/ws/juneau-utest/src/main/resources>
[INFO] Copying 3 resources from target/maven-shared-archive-resources to target/classes
[INFO] Copying 3 resources from target/maven-shared-archive-resources to target/classes
[INFO] Copying 3 resources from target/maven-shared-archive-resources to target/classes
[INFO]
[INFO] --- compiler:3.13.0:compile (default-compile) @ juneau-utest ---
[INFO] Recompiling the module because of changed dependency.
[WARNING] Overwriting artifact's file from <https://ci-builds.apache.org/job/Juneau/job/Juneau-Java-17/ws/juneau-utest/target/juneau-utest-9.1.0-SNAPSHOT.jar> to <https://ci-builds.apache.org/job/Juneau/job/Juneau-Java-17/ws/juneau-utest/target/classes>
[INFO]
[INFO] >>>>>>>>>>>>>>>>>>>>>>>>>>>>>>>>>>>>>>>>>>>>>>>>>>>>>>>>>>>>>>>>>>>>>>>>
[INFO] Forking juneau/all 9.1.0-SNAPSHOT
[INFO] >>>>>>>>>>>>>>>>>>>>>>>>>>>>>>>>>>>>>>>>>>>>>>>>>>>>>>>>>>>>>>>>>>>>>>>>
[INFO]
[INFO] --- enforcer:3.5.0:enforce (enforce-maven-version) @ juneau-all ---
[INFO]
[INFO] --- enforcer:3.5.0:enforce (enforce-java-version) @ juneau-all ---
[INFO]
[INFO] --- enforcer:3.5.0:enforce (enforce-maven) @ juneau-all ---
[INFO]
[INFO] --- remote-resources:3.2.0:process (process-resource-bundles) @ juneau-all ---
[INFO] Preparing remote bundle org.apache.apache.resources:apache-jar-resource-bundle:1.5
[INFO] Copying 3 resources from 1 bundle.
[INFO]
[INFO] --- resources:3.3.1:resources (default-resources) @ juneau-all ---
[INFO] skip non existing resourceDirectory <https://ci-builds.apache.org/job/Juneau/job/Juneau-Java-17/ws/juneau-all/src/main/resources>
[INFO] Copying 3 resources from target/maven-shared-archive-resources to target/classes
[INFO] Copying 3 resources from target/maven-shared-archive-resources to target/classes
[INFO] Copying 3 resources from target/maven-shared-archive-resources to target/classes
[INFO]
[INFO] --- compiler:3.13.0:compile (default-compile) @ juneau-all ---
[INFO] No sources to compile
[WARNING] Overwriting artifact's file from <https://ci-builds.apache.org/job/Juneau/job/Juneau-Java-17/ws/juneau-all/target/juneau-all-9.1.0-SNAPSHOT.jar> to <https://ci-builds.apache.org/job/Juneau/job/Juneau-Java-17/ws/juneau-all/target/classes>
[INFO]
[INFO] >>>>>>>>>>>>>>>>>>>>>>>>>>>>>>>>>>>>>>>>>>>>>>>>>>>>>>>>>>>>>>>>>>>>>>>>
[INFO] Forking juneau/distrib 9.1.0-SNAPSHOT
[INFO] >>>>>>>>>>>>>>>>>>>>>>>>>>>>>>>>>>>>>>>>>>>>>>>>>>>>>>>>>>>>>>>>>>>>>>>>
[INFO]
[INFO] --- enforcer:3.5.0:enforce (enforce-maven-version) @ juneau-distrib ---
[INFO]
[INFO] --- enforcer:3.5.0:enforce (enforce-java-version) @ juneau-distrib ---
[INFO]
[INFO] --- enforcer:3.5.0:enforce (enforce-maven) @ juneau-distrib ---
[INFO]
[INFO] --- remote-resources:3.2.0:process (process-resource-bundles) @ juneau-distrib ---
[INFO] Preparing remote bundle org.apache.apache.resources:apache-jar-resource-bundle:1.5
[INFO] Copying 3 resources from 1 bundle.
[INFO]
[INFO] <<< javadoc:3.8.0:aggregate (default-cli) < compile @ juneau <<<
[INFO]
[INFO]
[INFO] --- javadoc:3.8.0:aggregate (default-cli) @ juneau ---
[INFO] No previous run data found, generating javadoc.
[INFO] ------------------------------------------------------------------------
[INFO] Reactor Summary for juneau 9.1.0-SNAPSHOT:
[INFO]
[INFO] juneau ............................................. FAILURE [ 10.181 s]
[INFO] juneau/core ........................................ SUCCESS [ 4.482 s]
[INFO] juneau/core/common ................................. SUCCESS [ 9.805 s]
[INFO] juneau/core/marshall ............................... SUCCESS [ 22.416 s]
[INFO] juneau/core/dto .................................... SUCCESS [ 10.900 s]
[INFO] juneau/core/config ................................. SUCCESS [ 6.510 s]
[INFO] juneau/core/assertions ............................. SUCCESS [ 7.203 s]
[INFO] juneau/rest ........................................ SUCCESS [ 3.867 s]
[INFO] juneau/rest/rest-common ............................ SUCCESS [ 9.029 s]
[INFO] juneau/rest/rest-server ............................ SUCCESS [ 11.177 s]
[INFO] juneau/rest/rest-server-springboot ................. SUCCESS [ 6.197 s]
[INFO] juneau/rest/rest-client ............................ SUCCESS [ 8.330 s]
[INFO] juneau/rest/rest-mock .............................. SUCCESS [ 6.522 s]
[INFO] juneau/microservice ................................ SUCCESS [ 3.561 s]
[INFO] juneau/microservice/microservice-core .............. SUCCESS [ 6.430 s]
[INFO] juneau/microservice/microservice-jetty ............. SUCCESS [ 6.209 s]
[INFO] juneau/microservice/my-jetty-microservice .......... SUCCESS [ 6.092 s]
[INFO] juneau/microservice/my-springboot-microservice ..... SUCCESS [ 5.378 s]
[INFO] juneau/sc .......................................... SUCCESS [ 3.542 s]
[INFO] juneau/sc/sc-server ................................ SUCCESS [ 5.555 s]
[INFO] juneau/sc/sc-client ................................ SUCCESS [ 4.588 s]
[INFO] juneau/examples .................................... SUCCESS [ 3.629 s]
[INFO] juneau/examples/examples-core ...................... SUCCESS [ 6.490 s]
[INFO] juneau/examples/rest ............................... SUCCESS [ 7.154 s]
[INFO] juneau/examples/examples-rest-jetty ................ SUCCESS [ 7.267 s]
[INFO] juneau/examples/examples-rest-springboot ........... SUCCESS [ 11.567 s]
[INFO] juneau/examples/examples-rest-jetty-ftest .......... SUCCESS [ 11.468 s]
[INFO] juneau/utest-utils ................................. SUCCESS [ 6.480 s]
[INFO] juneau/utest ....................................... SUCCESS [01:04 min]
[INFO] juneau/all ......................................... SUCCESS [ 8.912 s]
[INFO] juneau/distrib ..................................... SUCCESS [ 7.891 s]
[INFO] ------------------------------------------------------------------------
[INFO] BUILD FAILURE
[INFO] ------------------------------------------------------------------------
[INFO] Total time: 05:05 min
[INFO] Finished at: 2024-08-16T13:22:24Z
[INFO] ------------------------------------------------------------------------
[ERROR] Failed to execute goal org.apache.maven.plugins:maven-javadoc-plugin:3.8.0:aggregate (default-cli) on project juneau: An error has occurred in Javadoc report generation:
[ERROR] Exit code: 2
[ERROR] error: No source files for package org.apache.juneau.common.internal
[ERROR] 1 error
[ERROR] Command line was: /usr/local/asfpackages/java/adoptium-jdk-17.0.7+7/bin/javadoc -J-Duser.language= -J-Duser.country= -J-DjuneauVersion=9.1.0 -J-DjuneauVersionNext=9.1.1 --allow-script-in-comments @options @packages
[ERROR]
[ERROR] Refer to the generated Javadoc files in '<https://ci-builds.apache.org/job/Juneau/job/Juneau-Java-17/ws/target/site/apidocs'> dir.
[ERROR]
[ERROR] -> [Help 1]
[ERROR]
[ERROR] To see the full stack trace of the errors, re-run Maven with the -e switch.
[ERROR] Re-run Maven using the -X switch to enable full debug logging.
[ERROR]
[ERROR] For more information about the errors and possible solutions, please read the following articles:
[ERROR] [Help 1] http://cwiki.apache.org/confluence/display/MAVEN/MojoExecutionException
Build step 'Invoke top-level Maven targets' marked build as failure
Recording test results
[Checks API] No suitable checks publisher found.
Build failed in Jenkins: Juneau » Juneau-Java-17 #922
Posted by Apache Jenkins Server <je...@builds.apache.org>.
See <https://ci-builds.apache.org/job/Juneau/job/Juneau-Java-17/922/display/redirect?page=changes>
Changes:
[github] Bump org.junit:junit-bom from 5.10.3 to 5.11.0
[github] Bump org.junit:junit-bom from 5.10.3 to 5.11.0 #161
------------------------------------------
[...truncated 751.04 KB...]
[INFO] --- enforcer:3.5.0:enforce (enforce-java-version) @ juneau-examples-rest ---
[INFO]
[INFO] --- enforcer:3.5.0:enforce (enforce-maven) @ juneau-examples-rest ---
[INFO]
[INFO] --- remote-resources:3.2.0:process (process-resource-bundles) @ juneau-examples-rest ---
[INFO] Preparing remote bundle org.apache.apache.resources:apache-jar-resource-bundle:1.5
[INFO] Copying 3 resources from 1 bundle.
[INFO]
[INFO] --- resources:3.3.1:resources (default-resources) @ juneau-examples-rest ---
[INFO] Copying 20 resources from src/main/resources to target/classes
[INFO] Copying 3 resources from target/maven-shared-archive-resources to target/classes
[INFO] Copying 3 resources from target/maven-shared-archive-resources to target/classes
[INFO] Copying 3 resources from target/maven-shared-archive-resources to target/classes
[INFO]
[INFO] --- compiler:3.13.0:compile (default-compile) @ juneau-examples-rest ---
[INFO] Recompiling the module because of changed dependency.
[INFO] Compiling 14 source files with javac [debug release 17] to target/classes
[WARNING] Overwriting artifact's file from <https://ci-builds.apache.org/job/Juneau/job/Juneau-Java-17/ws/juneau-examples/juneau-examples-rest/target/juneau-examples-rest-9.1.0-SNAPSHOT.jar> to <https://ci-builds.apache.org/job/Juneau/job/Juneau-Java-17/ws/juneau-examples/juneau-examples-rest/target/classes>
[INFO]
[INFO] >>>>>>>>>>>>>>>>>>>>>>>>>>>>>>>>>>>>>>>>>>>>>>>>>>>>>>>>>>>>>>>>>>>>>>>>
[INFO] Forking juneau/examples/examples-rest-jetty 9.1.0-SNAPSHOT
[INFO] >>>>>>>>>>>>>>>>>>>>>>>>>>>>>>>>>>>>>>>>>>>>>>>>>>>>>>>>>>>>>>>>>>>>>>>>
[INFO]
[INFO] --- enforcer:3.5.0:enforce (enforce-maven-version) @ juneau-examples-rest-jetty ---
[INFO]
[INFO] --- enforcer:3.5.0:enforce (enforce-java-version) @ juneau-examples-rest-jetty ---
[INFO]
[INFO] --- enforcer:3.5.0:enforce (enforce-maven) @ juneau-examples-rest-jetty ---
[INFO]
[INFO] --- remote-resources:3.2.0:process (process-resource-bundles) @ juneau-examples-rest-jetty ---
[INFO] Preparing remote bundle org.apache.apache.resources:apache-jar-resource-bundle:1.5
[INFO] Copying 3 resources from 1 bundle.
[INFO]
[INFO] --- resources:3.3.1:resources (default-resources) @ juneau-examples-rest-jetty ---
[INFO] Copying 1 resource from src/main/resources to target/classes
[INFO] Copying 3 resources from target/maven-shared-archive-resources to target/classes
[INFO] Copying 3 resources from target/maven-shared-archive-resources to target/classes
[INFO] Copying 3 resources from target/maven-shared-archive-resources to target/classes
[INFO]
[INFO] --- compiler:3.13.0:compile (default-compile) @ juneau-examples-rest-jetty ---
[INFO] Recompiling the module because of changed dependency.
[INFO] Compiling 2 source files with javac [debug release 17] to target/classes
[WARNING] Overwriting artifact's file from <https://ci-builds.apache.org/job/Juneau/job/Juneau-Java-17/ws/juneau-examples/juneau-examples-rest-jetty/target/juneau-examples-rest-jetty-9.1.0-SNAPSHOT.jar> to <https://ci-builds.apache.org/job/Juneau/job/Juneau-Java-17/ws/juneau-examples/juneau-examples-rest-jetty/target/classes>
[INFO]
[INFO] >>>>>>>>>>>>>>>>>>>>>>>>>>>>>>>>>>>>>>>>>>>>>>>>>>>>>>>>>>>>>>>>>>>>>>>>
[INFO] Forking juneau/examples/examples-rest-springboot 9.1.0-SNAPSHOT
[INFO] >>>>>>>>>>>>>>>>>>>>>>>>>>>>>>>>>>>>>>>>>>>>>>>>>>>>>>>>>>>>>>>>>>>>>>>>
[INFO]
[INFO] --- enforcer:3.5.0:enforce (enforce-maven-version) @ juneau-examples-rest-springboot ---
[INFO]
[INFO] --- enforcer:3.5.0:enforce (enforce-java-version) @ juneau-examples-rest-springboot ---
[INFO]
[INFO] --- enforcer:3.5.0:enforce (enforce-maven) @ juneau-examples-rest-springboot ---
[INFO]
[INFO] --- remote-resources:3.2.0:process (process-resource-bundles) @ juneau-examples-rest-springboot ---
[INFO] Preparing remote bundle org.apache.apache.resources:apache-jar-resource-bundle:1.5
[INFO] Copying 3 resources from 1 bundle.
[INFO]
[INFO] --- resources:3.3.1:resources (default-resources) @ juneau-examples-rest-springboot ---
[INFO] Copying 3 resources from src/main/resources to target/classes
[INFO] Copying 3 resources from target/maven-shared-archive-resources to target/classes
[INFO] Copying 3 resources from target/maven-shared-archive-resources to target/classes
[INFO] Copying 3 resources from target/maven-shared-archive-resources to target/classes
[INFO]
[INFO] --- compiler:3.13.0:compile (default-compile) @ juneau-examples-rest-springboot ---
[INFO] Recompiling the module because of changed dependency.
[INFO] Compiling 5 source files with javac [debug release 17] to target/classes
[WARNING] Overwriting artifact's file from <https://ci-builds.apache.org/job/Juneau/job/Juneau-Java-17/ws/juneau-examples/juneau-examples-rest-springboot/target/juneau-examples-rest-springboot-9.1.0-SNAPSHOT.jar> to <https://ci-builds.apache.org/job/Juneau/job/Juneau-Java-17/ws/juneau-examples/juneau-examples-rest-springboot/target/classes>
[INFO]
[INFO] >>>>>>>>>>>>>>>>>>>>>>>>>>>>>>>>>>>>>>>>>>>>>>>>>>>>>>>>>>>>>>>>>>>>>>>>
[INFO] Forking juneau/examples/examples-rest-jetty-ftest 9.1.0-SNAPSHOT
[INFO] >>>>>>>>>>>>>>>>>>>>>>>>>>>>>>>>>>>>>>>>>>>>>>>>>>>>>>>>>>>>>>>>>>>>>>>>
[INFO]
[INFO] --- enforcer:3.5.0:enforce (enforce-maven-version) @ juneau-examples-rest-jetty-ftest ---
[INFO]
[INFO] --- enforcer:3.5.0:enforce (enforce-java-version) @ juneau-examples-rest-jetty-ftest ---
[INFO]
[INFO] --- enforcer:3.5.0:enforce (enforce-maven) @ juneau-examples-rest-jetty-ftest ---
[INFO]
[INFO] --- jacoco:0.8.12:prepare-agent (default-prepare-agent) @ juneau-examples-rest-jetty-ftest ---
[INFO] argLine set to -javaagent:/home/jenkins/.m2/repository/org/jacoco/org.jacoco.agent/0.8.12/org.jacoco.agent-0.8.12-runtime.jar=destfile=<https://ci-builds.apache.org/job/Juneau/job/Juneau-Java-17/ws/juneau-examples/juneau-examples-rest-jetty-ftest/target/jacoco.exec>
[INFO]
[INFO] --- remote-resources:3.2.0:process (process-resource-bundles) @ juneau-examples-rest-jetty-ftest ---
[INFO] Preparing remote bundle org.apache.apache.resources:apache-jar-resource-bundle:1.5
[INFO] Copying 3 resources from 1 bundle.
[INFO]
[INFO] --- resources:3.3.1:resources (default-resources) @ juneau-examples-rest-jetty-ftest ---
[INFO] skip non existing resourceDirectory <https://ci-builds.apache.org/job/Juneau/job/Juneau-Java-17/ws/juneau-examples/juneau-examples-rest-jetty-ftest/src/main/resources>
[INFO] Copying 3 resources from target/maven-shared-archive-resources to target/classes
[INFO] Copying 3 resources from target/maven-shared-archive-resources to target/classes
[INFO] Copying 3 resources from target/maven-shared-archive-resources to target/classes
[INFO]
[INFO] --- compiler:3.13.0:compile (default-compile) @ juneau-examples-rest-jetty-ftest ---
[INFO] Recompiling the module because of changed dependency.
[WARNING] Overwriting artifact's file from <https://ci-builds.apache.org/job/Juneau/job/Juneau-Java-17/ws/juneau-examples/juneau-examples-rest-jetty-ftest/target/juneau-examples-rest-jetty-ftest-9.1.0-SNAPSHOT.jar> to <https://ci-builds.apache.org/job/Juneau/job/Juneau-Java-17/ws/juneau-examples/juneau-examples-rest-jetty-ftest/target/classes>
[INFO]
[INFO] >>>>>>>>>>>>>>>>>>>>>>>>>>>>>>>>>>>>>>>>>>>>>>>>>>>>>>>>>>>>>>>>>>>>>>>>
[INFO] Forking juneau/utest-utils 9.1.0-SNAPSHOT
[INFO] >>>>>>>>>>>>>>>>>>>>>>>>>>>>>>>>>>>>>>>>>>>>>>>>>>>>>>>>>>>>>>>>>>>>>>>>
[INFO]
[INFO] --- enforcer:3.5.0:enforce (enforce-maven-version) @ juneau-utest-utils ---
[INFO]
[INFO] --- enforcer:3.5.0:enforce (enforce-java-version) @ juneau-utest-utils ---
[INFO]
[INFO] --- enforcer:3.5.0:enforce (enforce-maven) @ juneau-utest-utils ---
[INFO]
[INFO] --- remote-resources:3.2.0:process (process-resource-bundles) @ juneau-utest-utils ---
[INFO] Preparing remote bundle org.apache.apache.resources:apache-jar-resource-bundle:1.5
[INFO] Copying 3 resources from 1 bundle.
[INFO]
[INFO] --- resources:3.3.1:resources (default-resources) @ juneau-utest-utils ---
[INFO] skip non existing resourceDirectory <https://ci-builds.apache.org/job/Juneau/job/Juneau-Java-17/ws/juneau-utest-utils/src/main/resources>
[INFO] Copying 3 resources from target/maven-shared-archive-resources to target/classes
[INFO] Copying 3 resources from target/maven-shared-archive-resources to target/classes
[INFO] Copying 3 resources from target/maven-shared-archive-resources to target/classes
[INFO]
[INFO] --- compiler:3.13.0:compile (default-compile) @ juneau-utest-utils ---
[INFO] Recompiling the module because of changed dependency.
[INFO] Compiling 30 source files with javac [debug release 17] to target/classes
[WARNING] Overwriting artifact's file from <https://ci-builds.apache.org/job/Juneau/job/Juneau-Java-17/ws/juneau-utest-utils/target/juneau-utest-utils-9.1.0-SNAPSHOT.jar> to <https://ci-builds.apache.org/job/Juneau/job/Juneau-Java-17/ws/juneau-utest-utils/target/classes>
[INFO]
[INFO] >>>>>>>>>>>>>>>>>>>>>>>>>>>>>>>>>>>>>>>>>>>>>>>>>>>>>>>>>>>>>>>>>>>>>>>>
[INFO] Forking juneau/utest 9.1.0-SNAPSHOT
[INFO] >>>>>>>>>>>>>>>>>>>>>>>>>>>>>>>>>>>>>>>>>>>>>>>>>>>>>>>>>>>>>>>>>>>>>>>>
[INFO]
[INFO] --- enforcer:3.5.0:enforce (enforce-maven-version) @ juneau-utest ---
[INFO]
[INFO] --- enforcer:3.5.0:enforce (enforce-java-version) @ juneau-utest ---
[INFO]
[INFO] --- enforcer:3.5.0:enforce (enforce-maven) @ juneau-utest ---
[INFO]
[INFO] --- jacoco:0.8.12:prepare-agent (default-prepare-agent) @ juneau-utest ---
[INFO] argLine set to -javaagent:/home/jenkins/.m2/repository/org/jacoco/org.jacoco.agent/0.8.12/org.jacoco.agent-0.8.12-runtime.jar=destfile=<https://ci-builds.apache.org/job/Juneau/job/Juneau-Java-17/ws/juneau-utest/target/jacoco.exec>
[INFO]
[INFO] --- remote-resources:3.2.0:process (process-resource-bundles) @ juneau-utest ---
[INFO] Preparing remote bundle org.apache.apache.resources:apache-jar-resource-bundle:1.5
[INFO] Copying 3 resources from 1 bundle.
[INFO]
[INFO] --- resources:3.3.1:resources (default-resources) @ juneau-utest ---
[INFO] skip non existing resourceDirectory <https://ci-builds.apache.org/job/Juneau/job/Juneau-Java-17/ws/juneau-utest/src/main/resources>
[INFO] Copying 3 resources from target/maven-shared-archive-resources to target/classes
[INFO] Copying 3 resources from target/maven-shared-archive-resources to target/classes
[INFO] Copying 3 resources from target/maven-shared-archive-resources to target/classes
[INFO]
[INFO] --- compiler:3.13.0:compile (default-compile) @ juneau-utest ---
[INFO] Recompiling the module because of changed dependency.
[WARNING] Overwriting artifact's file from <https://ci-builds.apache.org/job/Juneau/job/Juneau-Java-17/ws/juneau-utest/target/juneau-utest-9.1.0-SNAPSHOT.jar> to <https://ci-builds.apache.org/job/Juneau/job/Juneau-Java-17/ws/juneau-utest/target/classes>
[INFO]
[INFO] >>>>>>>>>>>>>>>>>>>>>>>>>>>>>>>>>>>>>>>>>>>>>>>>>>>>>>>>>>>>>>>>>>>>>>>>
[INFO] Forking juneau/all 9.1.0-SNAPSHOT
[INFO] >>>>>>>>>>>>>>>>>>>>>>>>>>>>>>>>>>>>>>>>>>>>>>>>>>>>>>>>>>>>>>>>>>>>>>>>
[INFO]
[INFO] --- enforcer:3.5.0:enforce (enforce-maven-version) @ juneau-all ---
[INFO]
[INFO] --- enforcer:3.5.0:enforce (enforce-java-version) @ juneau-all ---
[INFO]
[INFO] --- enforcer:3.5.0:enforce (enforce-maven) @ juneau-all ---
[INFO]
[INFO] --- remote-resources:3.2.0:process (process-resource-bundles) @ juneau-all ---
[INFO] Preparing remote bundle org.apache.apache.resources:apache-jar-resource-bundle:1.5
[INFO] Copying 3 resources from 1 bundle.
[INFO]
[INFO] --- resources:3.3.1:resources (default-resources) @ juneau-all ---
[INFO] skip non existing resourceDirectory <https://ci-builds.apache.org/job/Juneau/job/Juneau-Java-17/ws/juneau-all/src/main/resources>
[INFO] Copying 3 resources from target/maven-shared-archive-resources to target/classes
[INFO] Copying 3 resources from target/maven-shared-archive-resources to target/classes
[INFO] Copying 3 resources from target/maven-shared-archive-resources to target/classes
[INFO]
[INFO] --- compiler:3.13.0:compile (default-compile) @ juneau-all ---
[INFO] No sources to compile
[WARNING] Overwriting artifact's file from <https://ci-builds.apache.org/job/Juneau/job/Juneau-Java-17/ws/juneau-all/target/juneau-all-9.1.0-SNAPSHOT.jar> to <https://ci-builds.apache.org/job/Juneau/job/Juneau-Java-17/ws/juneau-all/target/classes>
[INFO]
[INFO] >>>>>>>>>>>>>>>>>>>>>>>>>>>>>>>>>>>>>>>>>>>>>>>>>>>>>>>>>>>>>>>>>>>>>>>>
[INFO] Forking juneau/distrib 9.1.0-SNAPSHOT
[INFO] >>>>>>>>>>>>>>>>>>>>>>>>>>>>>>>>>>>>>>>>>>>>>>>>>>>>>>>>>>>>>>>>>>>>>>>>
[INFO]
[INFO] --- enforcer:3.5.0:enforce (enforce-maven-version) @ juneau-distrib ---
[INFO]
[INFO] --- enforcer:3.5.0:enforce (enforce-java-version) @ juneau-distrib ---
[INFO]
[INFO] --- enforcer:3.5.0:enforce (enforce-maven) @ juneau-distrib ---
[INFO]
[INFO] --- remote-resources:3.2.0:process (process-resource-bundles) @ juneau-distrib ---
[INFO] Preparing remote bundle org.apache.apache.resources:apache-jar-resource-bundle:1.5
[INFO] Copying 3 resources from 1 bundle.
[INFO]
[INFO] <<< javadoc:3.8.0:aggregate (default-cli) < compile @ juneau <<<
[INFO]
[INFO]
[INFO] --- javadoc:3.8.0:aggregate (default-cli) @ juneau ---
[INFO] No previous run data found, generating javadoc.
[INFO] ------------------------------------------------------------------------
[INFO] Reactor Summary for juneau 9.1.0-SNAPSHOT:
[INFO]
[INFO] juneau ............................................. FAILURE [ 9.048 s]
[INFO] juneau/core ........................................ SUCCESS [ 4.726 s]
[INFO] juneau/core/common ................................. SUCCESS [ 10.099 s]
[INFO] juneau/core/marshall ............................... SUCCESS [ 20.362 s]
[INFO] juneau/core/dto .................................... SUCCESS [ 10.700 s]
[INFO] juneau/core/config ................................. SUCCESS [ 6.755 s]
[INFO] juneau/core/assertions ............................. SUCCESS [ 7.984 s]
[INFO] juneau/rest ........................................ SUCCESS [ 3.786 s]
[INFO] juneau/rest/rest-common ............................ SUCCESS [ 8.920 s]
[INFO] juneau/rest/rest-server ............................ SUCCESS [ 11.881 s]
[INFO] juneau/rest/rest-server-springboot ................. SUCCESS [ 7.520 s]
[INFO] juneau/rest/rest-client ............................ SUCCESS [ 7.833 s]
[INFO] juneau/rest/rest-mock .............................. SUCCESS [ 6.925 s]
[INFO] juneau/microservice ................................ SUCCESS [ 3.802 s]
[INFO] juneau/microservice/microservice-core .............. SUCCESS [ 7.165 s]
[INFO] juneau/microservice/microservice-jetty ............. SUCCESS [ 7.992 s]
[INFO] juneau/microservice/my-jetty-microservice .......... SUCCESS [ 5.731 s]
[INFO] juneau/microservice/my-springboot-microservice ..... SUCCESS [ 5.453 s]
[INFO] juneau/sc .......................................... SUCCESS [ 3.738 s]
[INFO] juneau/sc/sc-server ................................ SUCCESS [ 5.798 s]
[INFO] juneau/sc/sc-client ................................ SUCCESS [ 4.733 s]
[INFO] juneau/examples .................................... SUCCESS [ 4.379 s]
[INFO] juneau/examples/examples-core ...................... SUCCESS [ 6.884 s]
[INFO] juneau/examples/rest ............................... SUCCESS [ 7.485 s]
[INFO] juneau/examples/examples-rest-jetty ................ SUCCESS [ 7.362 s]
[INFO] juneau/examples/examples-rest-springboot ........... SUCCESS [ 10.677 s]
[INFO] juneau/examples/examples-rest-jetty-ftest .......... SUCCESS [ 11.773 s]
[INFO] juneau/utest-utils ................................. SUCCESS [ 6.680 s]
[INFO] juneau/utest ....................................... SUCCESS [ 59.112 s]
[INFO] juneau/all ......................................... SUCCESS [ 8.981 s]
[INFO] juneau/distrib ..................................... SUCCESS [ 8.203 s]
[INFO] ------------------------------------------------------------------------
[INFO] BUILD FAILURE
[INFO] ------------------------------------------------------------------------
[INFO] Total time: 05:02 min
[INFO] Finished at: 2024-08-16T13:10:28Z
[INFO] ------------------------------------------------------------------------
[ERROR] Failed to execute goal org.apache.maven.plugins:maven-javadoc-plugin:3.8.0:aggregate (default-cli) on project juneau: An error has occurred in Javadoc report generation:
[ERROR] Exit code: 2
[ERROR] error: No source files for package org.apache.juneau.common.internal
[ERROR] 1 error
[ERROR] Command line was: /usr/local/asfpackages/java/adoptium-jdk-17.0.7+7/bin/javadoc -J-Duser.language= -J-Duser.country= -J-DjuneauVersion=9.1.0 -J-DjuneauVersionNext=9.1.1 --allow-script-in-comments @options @packages
[ERROR]
[ERROR] Refer to the generated Javadoc files in '<https://ci-builds.apache.org/job/Juneau/job/Juneau-Java-17/ws/target/site/apidocs'> dir.
[ERROR]
[ERROR] -> [Help 1]
[ERROR]
[ERROR] To see the full stack trace of the errors, re-run Maven with the -e switch.
[ERROR] Re-run Maven using the -X switch to enable full debug logging.
[ERROR]
[ERROR] For more information about the errors and possible solutions, please read the following articles:
[ERROR] [Help 1] http://cwiki.apache.org/confluence/display/MAVEN/MojoExecutionException
Build step 'Invoke top-level Maven targets' marked build as failure
Recording test results
[Checks API] No suitable checks publisher found.