You are viewing a plain text version of this content. The canonical link for it is here.
Posted to commits@karaf.apache.org by Apache Hudson Server <hu...@hudson.apache.org> on 2010/12/13 22:22:47 UTC

Build failed in Hudson: Karaf #230

See <https://hudson.apache.org/hudson/job/Karaf/230/changes>

Changes:

[ldywicki] Fix build after adding diagnostic stuff

[ldywicki] Removed unecessary namespace in configuration file

------------------------------------------
[...truncated 5954 lines...]

Results :

Tests run: 2, Failures: 0, Errors: 0, Skipped: 0

[HUDSON] Recording test results
[INFO] [bundle:bundle {execution: default-bundle}]
[INFO] [install:install {execution: default-install}]
[INFO] Installing <https://hudson.apache.org/hudson/job/Karaf/ws/karaf/webconsole/admin/target/org.apache.karaf.webconsole.admin-2.1.99-SNAPSHOT.jar> to <https://hudson.apache.org/hudson/job/Karaf/ws/.repository/org/apache/karaf/webconsole/org.apache.karaf.webconsole.admin/2.1.99-SNAPSHOT/org.apache.karaf.webconsole.admin-2.1.99-SNAPSHOT.jar>
[INFO] [bundle:install {execution: default-install}]
[INFO] Installing org/apache/karaf/webconsole/org.apache.karaf.webconsole.admin/2.1.99-SNAPSHOT/org.apache.karaf.webconsole.admin-2.1.99-SNAPSHOT.jar
[INFO] Writing OBR metadata
[HUDSON] Archiving <https://hudson.apache.org/hudson/job/Karaf/ws/karaf/webconsole/admin/pom.xml> to /home/hudson/hudson/jobs/Karaf/modules/org.apache.karaf.webconsole$org.apache.karaf.webconsole.admin/builds/2010-12-13_21-11-25/archive/org.apache.karaf.webconsole/org.apache.karaf.webconsole.admin/2.1.99-SNAPSHOT/pom.xml
[HUDSON] Archiving <https://hudson.apache.org/hudson/job/Karaf/ws/karaf/webconsole/admin/target/org.apache.karaf.webconsole.admin-2.1.99-SNAPSHOT.jar> to /home/hudson/hudson/jobs/Karaf/modules/org.apache.karaf.webconsole$org.apache.karaf.webconsole.admin/builds/2010-12-13_21-11-25/archive/org.apache.karaf.webconsole/org.apache.karaf.webconsole.admin/2.1.99-SNAPSHOT/org.apache.karaf.webconsole.admin-2.1.99-SNAPSHOT.jar
[INFO] ------------------------------------------------------------------------
[INFO] Building Apache Karaf :: Exception
[INFO]    task-segment: [clean, install]
[INFO] ------------------------------------------------------------------------
[INFO] [clean:clean {execution: default-clean}]
[INFO] [bundle:cleanVersions {execution: cleanVersions}]
[INFO] [remote-resources:process {execution: default}]
[INFO] [antrun:run {execution: copy-notice}]
[INFO] Executing tasks
     [copy] Warning: Could not find file <https://hudson.apache.org/hudson/job/Karaf/ws/karaf/exception/NOTICE> to copy.
[INFO] Executed tasks
[INFO] [resources:resources {execution: default-resources}]
[INFO] Using 'UTF-8' encoding to copy filtered resources.
[INFO] skip non existing resourceDirectory <https://hudson.apache.org/hudson/job/Karaf/ws/karaf/exception/src/main/resources>
[INFO] Copying 3 resources
[INFO] [compiler:compile {execution: default-compile}]
[INFO] Compiling 1 source file to <https://hudson.apache.org/hudson/job/Karaf/ws/karaf/exception/target/classes>
[INFO] [resources:testResources {execution: default-testResources}]
[INFO] Using 'UTF-8' encoding to copy filtered resources.
[INFO] skip non existing resourceDirectory <https://hudson.apache.org/hudson/job/Karaf/ws/karaf/exception/src/test/resources>
[INFO] Copying 3 resources
[INFO] [compiler:testCompile {execution: default-testCompile}]
[INFO] No sources to compile
[INFO] [surefire:test {execution: default-test}]
[INFO] Surefire report directory: <https://hudson.apache.org/hudson/job/Karaf/ws/karaf/exception/target/surefire-reports>

-------------------------------------------------------
 T E S T S
-------------------------------------------------------
There are no tests to run.

Results :

Tests run: 0, Failures: 0, Errors: 0, Skipped: 0

[HUDSON] Recording test results
[INFO] [jar:jar {execution: default-jar}]
[INFO] Building jar: <https://hudson.apache.org/hudson/job/Karaf/ws/karaf/exception/target/org.apache.karaf.exception-2.1.99-SNAPSHOT.jar>
[INFO] [install:install {execution: default-install}]
[INFO] Installing <https://hudson.apache.org/hudson/job/Karaf/ws/karaf/exception/target/org.apache.karaf.exception-2.1.99-SNAPSHOT.jar> to <https://hudson.apache.org/hudson/job/Karaf/ws/.repository/org/apache/karaf/org.apache.karaf.exception/2.1.99-SNAPSHOT/org.apache.karaf.exception-2.1.99-SNAPSHOT.jar>
[HUDSON] Archiving <https://hudson.apache.org/hudson/job/Karaf/ws/karaf/exception/pom.xml> to /home/hudson/hudson/jobs/Karaf/modules/org.apache.karaf$org.apache.karaf.exception/builds/2010-12-13_21-11-25/archive/org.apache.karaf/org.apache.karaf.exception/2.1.99-SNAPSHOT/pom.xml
[HUDSON] Archiving <https://hudson.apache.org/hudson/job/Karaf/ws/karaf/exception/target/org.apache.karaf.exception-2.1.99-SNAPSHOT.jar> to /home/hudson/hudson/jobs/Karaf/modules/org.apache.karaf$org.apache.karaf.exception/builds/2010-12-13_21-11-25/archive/org.apache.karaf/org.apache.karaf.exception/2.1.99-SNAPSHOT/org.apache.karaf.exception-2.1.99-SNAPSHOT.jar
[INFO] ------------------------------------------------------------------------
[INFO] Building Apache Karaf :: Diagnostic
[INFO]    task-segment: [clean, install]
[INFO] ------------------------------------------------------------------------
[INFO] [clean:clean {execution: default-clean}]
[INFO] [bundle:cleanVersions {execution: cleanVersions}]
[INFO] [remote-resources:process {execution: default}]
[INFO] [antrun:run {execution: copy-notice}]
[INFO] Executing tasks
     [copy] Warning: Could not find file <https://hudson.apache.org/hudson/job/Karaf/ws/karaf/diagnostic/NOTICE> to copy.
[INFO] Executed tasks
[INFO] [site:attach-descriptor {execution: default-attach-descriptor}]
[INFO] [install:install {execution: default-install}]
[INFO] Installing <https://hudson.apache.org/hudson/job/Karaf/ws/karaf/diagnostic/pom.xml> to <https://hudson.apache.org/hudson/job/Karaf/ws/.repository/org/apache/karaf/diagnostic/diagnostic/2.1.99-SNAPSHOT/diagnostic-2.1.99-SNAPSHOT.pom>
[HUDSON] Archiving <https://hudson.apache.org/hudson/job/Karaf/ws/karaf/diagnostic/pom.xml> to /home/hudson/hudson/jobs/Karaf/modules/org.apache.karaf.diagnostic$diagnostic/builds/2010-12-13_21-11-25/archive/org.apache.karaf.diagnostic/diagnostic/2.1.99-SNAPSHOT/pom.xml
[HUDSON] Archiving <https://hudson.apache.org/hudson/job/Karaf/ws/.repository/org/apache/karaf/diagnostic/diagnostic/2.1.99-SNAPSHOT/diagnostic-2.1.99-SNAPSHOT.pom> to /home/hudson/hudson/jobs/Karaf/modules/org.apache.karaf.diagnostic$diagnostic/builds/2010-12-13_21-11-25/archive/org.apache.karaf.diagnostic/diagnostic/2.1.99-SNAPSHOT/diagnostic-2.1.99-SNAPSHOT.pom
[INFO] ------------------------------------------------------------------------
[INFO] Building Apache Karaf :: Diagnostic :: Core
[INFO]    task-segment: [clean, install]
[INFO] ------------------------------------------------------------------------
[INFO] [clean:clean {execution: default-clean}]
[INFO] [bundle:cleanVersions {execution: cleanVersions}]
[INFO] [remote-resources:process {execution: default}]
[INFO] [antrun:run {execution: copy-notice}]
[INFO] Executing tasks
     [copy] Warning: Could not find file <https://hudson.apache.org/hudson/job/Karaf/ws/karaf/diagnostic/core/NOTICE> to copy.
[INFO] Executed tasks
[INFO] [resources:resources {execution: default-resources}]
[INFO] Using 'UTF-8' encoding to copy filtered resources.
[INFO] skip non existing resourceDirectory <https://hudson.apache.org/hudson/job/Karaf/ws/karaf/diagnostic/core/src/main/resources>
[INFO] Copying 3 resources
[INFO] [compiler:compile {execution: default-compile}]
[INFO] Compiling 6 source files to <https://hudson.apache.org/hudson/job/Karaf/ws/karaf/diagnostic/core/target/classes>
[INFO] [resources:testResources {execution: default-testResources}]
[INFO] Using 'UTF-8' encoding to copy filtered resources.
[INFO] skip non existing resourceDirectory <https://hudson.apache.org/hudson/job/Karaf/ws/karaf/diagnostic/core/src/test/resources>
[INFO] Copying 3 resources
[INFO] [compiler:testCompile {execution: default-testCompile}]
[INFO] No sources to compile
[INFO] [surefire:test {execution: default-test}]
[INFO] Surefire report directory: <https://hudson.apache.org/hudson/job/Karaf/ws/karaf/diagnostic/core/target/surefire-reports>

-------------------------------------------------------
 T E S T S
-------------------------------------------------------
There are no tests to run.

Results :

Tests run: 0, Failures: 0, Errors: 0, Skipped: 0

[HUDSON] Recording test results[INFO] [bundle:bundle {execution: default-bundle}]

[WARNING] Warning building bundle org.apache.karaf.diagnostic:org.apache.karaf.diagnostic.core:bundle:2.1.99-SNAPSHOT : Instructions in Private-Package, or -testpackages that are never used: org\.apache\.karaf\.diagnostic\.internal
[INFO] [install:install {execution: default-install}]
[INFO] Installing <https://hudson.apache.org/hudson/job/Karaf/ws/karaf/diagnostic/core/target/org.apache.karaf.diagnostic.core-2.1.99-SNAPSHOT.jar> to <https://hudson.apache.org/hudson/job/Karaf/ws/.repository/org/apache/karaf/diagnostic/org.apache.karaf.diagnostic.core/2.1.99-SNAPSHOT/org.apache.karaf.diagnostic.core-2.1.99-SNAPSHOT.jar>
[INFO] [bundle:install {execution: default-install}]
[INFO] Installing org/apache/karaf/diagnostic/org.apache.karaf.diagnostic.core/2.1.99-SNAPSHOT/org.apache.karaf.diagnostic.core-2.1.99-SNAPSHOT.jar
[INFO] Writing OBR metadata
[HUDSON] Archiving <https://hudson.apache.org/hudson/job/Karaf/ws/karaf/diagnostic/core/pom.xml> to /home/hudson/hudson/jobs/Karaf/modules/org.apache.karaf.diagnostic$org.apache.karaf.diagnostic.core/builds/2010-12-13_21-11-25/archive/org.apache.karaf.diagnostic/org.apache.karaf.diagnostic.core/2.1.99-SNAPSHOT/pom.xml
[HUDSON] Archiving <https://hudson.apache.org/hudson/job/Karaf/ws/karaf/diagnostic/core/target/org.apache.karaf.diagnostic.core-2.1.99-SNAPSHOT.jar> to /home/hudson/hudson/jobs/Karaf/modules/org.apache.karaf.diagnostic$org.apache.karaf.diagnostic.core/builds/2010-12-13_21-11-25/archive/org.apache.karaf.diagnostic/org.apache.karaf.diagnostic.core/2.1.99-SNAPSHOT/org.apache.karaf.diagnostic.core-2.1.99-SNAPSHOT.jar
[INFO] ------------------------------------------------------------------------
[INFO] Building Apache Karaf :: Diagnostic :: Common
[INFO]    task-segment: [clean, install]
[INFO] ------------------------------------------------------------------------
[INFO] [clean:clean {execution: default-clean}]
[INFO] [bundle:cleanVersions {execution: cleanVersions}]
[INFO] [remote-resources:process {execution: default}]
[INFO] snapshot org.apache.karaf.diagnostic:org.apache.karaf.diagnostic.core:2.1.99-SNAPSHOT: checking for updates from apache-snapshots
[INFO] snapshot org.apache.karaf.diagnostic:org.apache.karaf.diagnostic.core:2.1.99-SNAPSHOT: checking for updates from sonatype
[INFO] snapshot org.apache.karaf.diagnostic:org.apache.karaf.diagnostic.core:2.1.99-SNAPSHOT: checking for updates from fusesource.snapshots
[INFO] snapshot org.apache.karaf.diagnostic:org.apache.karaf.diagnostic.core:2.1.99-SNAPSHOT: checking for updates from apache.snapshots
[INFO] [antrun:run {execution: copy-notice}]
[INFO] Executing tasks
     [copy] Warning: Could not find file <https://hudson.apache.org/hudson/job/Karaf/ws/karaf/diagnostic/common/NOTICE> to copy.
[INFO] Executed tasks
[INFO] [resources:resources {execution: default-resources}]
[INFO] Using 'UTF-8' encoding to copy filtered resources.
[INFO] Copying 1 resource
[INFO] Copying 3 resources
[INFO] [compiler:compile {execution: default-compile}]
[INFO] Compiling 4 source files to <https://hudson.apache.org/hudson/job/Karaf/ws/karaf/diagnostic/common/target/classes>
[INFO] [resources:testResources {execution: default-testResources}]
[INFO] Using 'UTF-8' encoding to copy filtered resources.
[INFO] skip non existing resourceDirectory <https://hudson.apache.org/hudson/job/Karaf/ws/karaf/diagnostic/common/src/test/resources>
[INFO] Copying 3 resources
[INFO] [compiler:testCompile {execution: default-testCompile}]
[INFO] No sources to compile
[INFO] [surefire:test {execution: default-test}]
[INFO] Surefire report directory: <https://hudson.apache.org/hudson/job/Karaf/ws/karaf/diagnostic/common/target/surefire-reports>

-------------------------------------------------------
 T E S T S
-------------------------------------------------------
There are no tests to run.

Results :

Tests run: 0, Failures: 0, Errors: 0, Skipped: 0

[HUDSON] Recording test results
[INFO] [bundle:bundle {execution: default-bundle}]
[INFO] [install:install {execution: default-install}]
[INFO] Installing <https://hudson.apache.org/hudson/job/Karaf/ws/karaf/diagnostic/common/target/org.apache.karaf.diagnostic.common-2.1.99-SNAPSHOT.jar> to <https://hudson.apache.org/hudson/job/Karaf/ws/.repository/org/apache/karaf/diagnostic/org.apache.karaf.diagnostic.common/2.1.99-SNAPSHOT/org.apache.karaf.diagnostic.common-2.1.99-SNAPSHOT.jar>
[INFO] [bundle:install {execution: default-install}]
[INFO] Installing org/apache/karaf/diagnostic/org.apache.karaf.diagnostic.common/2.1.99-SNAPSHOT/org.apache.karaf.diagnostic.common-2.1.99-SNAPSHOT.jar
[INFO] Writing OBR metadata
[HUDSON] Archiving <https://hudson.apache.org/hudson/job/Karaf/ws/karaf/diagnostic/common/pom.xml> to /home/hudson/hudson/jobs/Karaf/modules/org.apache.karaf.diagnostic$org.apache.karaf.diagnostic.common/builds/2010-12-13_21-11-25/archive/org.apache.karaf.diagnostic/org.apache.karaf.diagnostic.common/2.1.99-SNAPSHOT/pom.xml
[HUDSON] Archiving <https://hudson.apache.org/hudson/job/Karaf/ws/karaf/diagnostic/common/target/org.apache.karaf.diagnostic.common-2.1.99-SNAPSHOT.jar> to /home/hudson/hudson/jobs/Karaf/modules/org.apache.karaf.diagnostic$org.apache.karaf.diagnostic.common/builds/2010-12-13_21-11-25/archive/org.apache.karaf.diagnostic/org.apache.karaf.diagnostic.common/2.1.99-SNAPSHOT/org.apache.karaf.diagnostic.common-2.1.99-SNAPSHOT.jar
[INFO] ------------------------------------------------------------------------
[INFO] Building Apache Karaf :: Diagnostic :: Command
[INFO]    task-segment: [clean, install]
[INFO] ------------------------------------------------------------------------
[INFO] [clean:clean {execution: default-clean}]
[INFO] [bundle:cleanVersions {execution: cleanVersions}]
[INFO] [remote-resources:process {execution: default}]
[INFO] [antrun:run {execution: copy-notice}]
[INFO] Executing tasks
     [copy] Warning: Could not find file <https://hudson.apache.org/hudson/job/Karaf/ws/karaf/diagnostic/command/NOTICE> to copy.
[INFO] Executed tasks
[INFO] [resources:resources {execution: default-resources}]
[INFO] Using 'UTF-8' encoding to copy filtered resources.
[INFO] Copying 1 resource
[INFO] Copying 3 resources
[INFO] [compiler:compile {execution: default-compile}]
[INFO] Compiling 1 source file to <https://hudson.apache.org/hudson/job/Karaf/ws/karaf/diagnostic/command/target/classes>
[HUDSON] Archiving <https://hudson.apache.org/hudson/job/Karaf/ws/karaf/diagnostic/command/pom.xml> to /home/hudson/hudson/jobs/Karaf/modules/org.apache.karaf.diagnostic$org.apache.karaf.diagnostic.command/builds/2010-12-13_21-11-25/archive/org.apache.karaf.diagnostic/org.apache.karaf.diagnostic.command/2.1.99-SNAPSHOT/pom.xml
[INFO] ------------------------------------------------------------------------
[ERROR] BUILD FAILURE
[INFO] ------------------------------------------------------------------------
[INFO] Compilation failure
<https://hudson.apache.org/hudson/job/Karaf/ws/karaf/diagnostic/command/src/main/java/org/apache/karaf/diagnostic/command/DumpCommand.java>:[69,40] cannot find symbol
symbol  : method isEmpty()
location: class java.lang.String


[INFO] ------------------------------------------------------------------------
[INFO] Trace
org.apache.maven.BuildFailureException: Compilation failure
<https://hudson.apache.org/hudson/job/Karaf/ws/karaf/diagnostic/command/src/main/java/org/apache/karaf/diagnostic/command/DumpCommand.java>:[69,40] cannot find symbol
symbol  : method isEmpty()
location: class java.lang.String


	at org.apache.maven.lifecycle.DefaultLifecycleExecutor.executeGoals(DefaultLifecycleExecutor.java:715)
	at org.apache.maven.lifecycle.DefaultLifecycleExecutor.executeGoalWithLifecycle(DefaultLifecycleExecutor.java:556)
	at org.apache.maven.lifecycle.DefaultLifecycleExecutor.executeGoal(DefaultLifecycleExecutor.java:535)
	at org.apache.maven.lifecycle.DefaultLifecycleExecutor.executeGoalAndHandleFailures(DefaultLifecycleExecutor.java:387)
	at org.apache.maven.lifecycle.DefaultLifecycleExecutor.executeTaskSegments(DefaultLifecycleExecutor.java:348)
	at org.apache.maven.lifecycle.DefaultLifecycleExecutor.execute(DefaultLifecycleExecutor.java:180)
	at org.apache.maven.lifecycle.LifecycleExecutorInterceptor.execute(LifecycleExecutorInterceptor.java:65)
	at org.apache.maven.DefaultMaven.doExecute(DefaultMaven.java:328)
	at org.apache.maven.DefaultMaven.execute(DefaultMaven.java:138)
	at org.apache.maven.cli.MavenCli.main(MavenCli.java:362)
	at sun.reflect.NativeMethodAccessorImpl.invoke0(Native Method)
	at sun.reflect.NativeMethodAccessorImpl.invoke(NativeMethodAccessorImpl.java:39)
	at sun.reflect.DelegatingMethodAccessorImpl.invoke(DelegatingMethodAccessorImpl.java:25)
	at java.lang.reflect.Method.invoke(Method.java:592)
	at org.codehaus.classworlds.Launcher.launchEnhanced(Launcher.java:315)
	at org.codehaus.classworlds.Launcher.launch(Launcher.java:255)
	at hudson.maven.agent.Main.launch(Main.java:165)
	at hudson.maven.MavenBuilder.call(MavenBuilder.java:165)
	at hudson.maven.MavenModuleSetBuild$Builder.call(MavenModuleSetBuild.java:750)
	at hudson.maven.MavenModuleSetBuild$Builder.call(MavenModuleSetBuild.java:694)
	at hudson.remoting.UserRequest.perform(UserRequest.java:114)
	at hudson.remoting.UserRequest.perform(UserRequest.java:48)
	at hudson.remoting.Request$2.run(Request.java:270)
	at java.util.concurrent.Executors$RunnableAdapter.call(Executors.java:417)
	at java.util.concurrent.FutureTask$Sync.innerRun(FutureTask.java:269)
	at java.util.concurrent.FutureTask.run(FutureTask.java:123)
	at java.util.concurrent.ThreadPoolExecutor$Worker.runTask(ThreadPoolExecutor.java:651)
	at java.util.concurrent.ThreadPoolExecutor$Worker.run(ThreadPoolExecutor.java:676)
	at java.lang.Thread.run(Thread.java:595)
Caused by: org.apache.maven.plugin.CompilationFailureException: Compilation failure
<https://hudson.apache.org/hudson/job/Karaf/ws/karaf/diagnostic/command/src/main/java/org/apache/karaf/diagnostic/command/DumpCommand.java>:[69,40] cannot find symbol
symbol  : method isEmpty()
location: class java.lang.String


	at org.apache.maven.plugin.AbstractCompilerMojo.execute(AbstractCompilerMojo.java:516)
	at org.apache.maven.plugin.CompilerMojo.execute(CompilerMojo.java:114)
	at org.apache.maven.plugin.DefaultPluginManager.executeMojo(DefaultPluginManager.java:490)
	at hudson.maven.agent.PluginManagerInterceptor.executeMojo(PluginManagerInterceptor.java:182)
	at org.apache.maven.lifecycle.DefaultLifecycleExecutor.executeGoals(DefaultLifecycleExecutor.java:694)
	... 28 more
[INFO] ------------------------------------------------------------------------
[INFO] Total time: 11 minutes 11 seconds
[INFO] Finished at: Mon Dec 13 13:22:46 GMT-08:00 2010
[INFO] Final Memory: 60M/336M
[INFO] ------------------------------------------------------------------------
Sending e-mails to: commits@karaf.apache.org
Sending e-mails to: commits@karaf.apache.org
channel stopped


Hudson build is back to normal : Karaf #231

Posted by Apache Hudson Server <hu...@hudson.apache.org>.
See <https://hudson.apache.org/hudson/job/Karaf/231/changes>