You are viewing a plain text version of this content. The canonical link for it is here.
Posted to dev@kafka.apache.org by Apache Jenkins Server <je...@builds.apache.org> on 2024/03/06 23:33:33 UTC
Jenkins build is still unstable: Kafka » Kafka Branch Builder » trunk #2703
See <https://ci-builds.apache.org/job/Kafka/job/kafka/job/trunk/2703/display/redirect>
Jenkins build is still unstable: Kafka » Kafka Branch Builder » trunk #2717
Posted by Apache Jenkins Server <je...@builds.apache.org>.
See <https://ci-builds.apache.org/job/Kafka/job/kafka/job/trunk/2717/display/redirect>
Jenkins build is still unstable: Kafka » Kafka Branch Builder » trunk #2716
Posted by Apache Jenkins Server <je...@builds.apache.org>.
See <https://ci-builds.apache.org/job/Kafka/job/kafka/job/trunk/2716/display/redirect>
Jenkins build is still unstable: Kafka » Kafka Branch Builder » trunk #2715
Posted by Apache Jenkins Server <je...@builds.apache.org>.
See <https://ci-builds.apache.org/job/Kafka/job/kafka/job/trunk/2715/display/redirect>
Jenkins build is unstable: Kafka » Kafka Branch Builder » trunk #2714
Posted by Apache Jenkins Server <je...@builds.apache.org>.
See <https://ci-builds.apache.org/job/Kafka/job/kafka/job/trunk/2714/display/redirect>
Build failed in Jenkins: Kafka » Kafka Branch Builder » trunk #2713
Posted by Apache Jenkins Server <je...@builds.apache.org>.
See <https://ci-builds.apache.org/job/Kafka/job/kafka/job/trunk/2713/display/redirect>
Changes:
------------------------------------------
[...truncated 451588 lines...]
[2024-03-10T04:02:03.759Z]
[2024-03-10T04:02:03.759Z] Gradle Test Run :connect:runtime:test > Gradle Test Executor 46 > org.apache.kafka.connect.storage.OffsetUtilsTest > testValidateFormatMapWithNonStringKeys PASSED
[2024-03-10T04:02:03.759Z]
[2024-03-10T04:02:03.759Z] Gradle Test Run :connect:runtime:test > Gradle Test Executor 46 > org.apache.kafka.connect.storage.OffsetUtilsTest > testProcessPartitionKeyListWithElementsOfWrongType STARTED
[2024-03-10T04:02:03.759Z]
[2024-03-10T04:02:03.759Z] Gradle Test Run :connect:runtime:test > Gradle Test Executor 46 > org.apache.kafka.connect.storage.OffsetUtilsTest > testProcessPartitionKeyListWithElementsOfWrongType PASSED
[2024-03-10T04:02:03.759Z]
[2024-03-10T04:02:03.759Z] Gradle Test Run :connect:runtime:test > Gradle Test Executor 46 > org.apache.kafka.connect.storage.OffsetUtilsTest > testProcessPartitionKeyNotList STARTED
[2024-03-10T04:02:03.759Z]
[2024-03-10T04:02:03.759Z] Gradle Test Run :connect:runtime:test > Gradle Test Executor 46 > org.apache.kafka.connect.storage.OffsetUtilsTest > testProcessPartitionKeyNotList PASSED
[2024-03-10T04:02:03.759Z]
[2024-03-10T04:02:03.759Z] Gradle Test Run :connect:runtime:test > Gradle Test Executor 46 > org.apache.kafka.connect.storage.OffsetUtilsTest > testValidateFormatMapWithNonPrimitiveKeys STARTED
[2024-03-10T04:02:03.759Z]
[2024-03-10T04:02:03.759Z] Gradle Test Run :connect:runtime:test > Gradle Test Executor 46 > org.apache.kafka.connect.storage.OffsetUtilsTest > testValidateFormatMapWithNonPrimitiveKeys PASSED
[2024-03-10T04:02:03.759Z]
[2024-03-10T04:02:03.759Z] Gradle Test Run :connect:runtime:test > Gradle Test Executor 46 > org.apache.kafka.connect.storage.OffsetUtilsTest > testProcessPartitionKeyListWithOneElement STARTED
[2024-03-10T04:02:03.759Z]
[2024-03-10T04:02:03.759Z] Gradle Test Run :connect:runtime:test > Gradle Test Executor 46 > org.apache.kafka.connect.storage.OffsetUtilsTest > testProcessPartitionKeyListWithOneElement PASSED
[2024-03-10T04:02:03.759Z]
[2024-03-10T04:02:03.759Z] Gradle Test Run :connect:runtime:test > Gradle Test Executor 46 > org.apache.kafka.connect.storage.OffsetUtilsTest > testValidateFormatNotMap STARTED
[2024-03-10T04:02:03.759Z]
[2024-03-10T04:02:03.759Z] Gradle Test Run :connect:runtime:test > Gradle Test Executor 46 > org.apache.kafka.connect.storage.OffsetUtilsTest > testValidateFormatNotMap PASSED
[2024-03-10T04:02:03.759Z]
[2024-03-10T04:02:03.759Z] Gradle Test Run :connect:runtime:test > Gradle Test Executor 46 > org.apache.kafka.connect.storage.OffsetUtilsTest > testProcessPartitionKeyWithUnknownSerialization STARTED
[2024-03-10T04:02:03.759Z]
[2024-03-10T04:02:03.759Z] Gradle Test Run :connect:runtime:test > Gradle Test Executor 46 > org.apache.kafka.connect.storage.OffsetUtilsTest > testProcessPartitionKeyWithUnknownSerialization PASSED
[2024-03-10T04:02:03.759Z]
[2024-03-10T04:02:03.759Z] Gradle Test Run :connect:runtime:test > Gradle Test Executor 46 > org.apache.kafka.connect.storage.OffsetUtilsTest > testProcessPartitionKeyValidList STARTED
[2024-03-10T04:02:03.759Z]
[2024-03-10T04:02:03.759Z] Gradle Test Run :connect:runtime:test > Gradle Test Executor 46 > org.apache.kafka.connect.storage.OffsetUtilsTest > testProcessPartitionKeyValidList PASSED
[2024-03-10T04:02:03.759Z]
[2024-03-10T04:02:03.759Z] Gradle Test Run :connect:runtime:test > Gradle Test Executor 46 > org.apache.kafka.connect.util.ConvertingFutureCallbackTest > shouldNotConvertBeforeGetOnFailedCompletion STARTED
[2024-03-10T04:02:03.759Z]
[2024-03-10T04:02:03.759Z] Gradle Test Run :connect:runtime:test > Gradle Test Executor 46 > org.apache.kafka.connect.util.ConvertingFutureCallbackTest > shouldNotConvertBeforeGetOnFailedCompletion PASSED
[2024-03-10T04:02:03.759Z]
[2024-03-10T04:02:03.759Z] Gradle Test Run :connect:runtime:test > Gradle Test Executor 46 > org.apache.kafka.connect.util.ConvertingFutureCallbackTest > shouldBlockUntilCancellation STARTED
[2024-03-10T04:02:03.759Z]
[2024-03-10T04:02:03.759Z] Gradle Test Run :connect:runtime:test > Gradle Test Executor 46 > org.apache.kafka.connect.util.ConvertingFutureCallbackTest > shouldBlockUntilCancellation PASSED
[2024-03-10T04:02:03.759Z]
[2024-03-10T04:02:03.759Z] Gradle Test Run :connect:runtime:test > Gradle Test Executor 46 > org.apache.kafka.connect.util.ConvertingFutureCallbackTest > shouldConvertOnlyOnceBeforeGetOnSuccessfulCompletion STARTED
[2024-03-10T04:02:03.759Z]
[2024-03-10T04:02:03.759Z] Gradle Test Run :connect:runtime:test > Gradle Test Executor 46 > org.apache.kafka.connect.util.ConvertingFutureCallbackTest > shouldConvertOnlyOnceBeforeGetOnSuccessfulCompletion PASSED
[2024-03-10T04:02:03.759Z]
[2024-03-10T04:02:03.759Z] Gradle Test Run :connect:runtime:test > Gradle Test Executor 46 > org.apache.kafka.connect.util.ConvertingFutureCallbackTest > shouldBlockUntilSuccessfulCompletion STARTED
[2024-03-10T04:02:03.759Z]
[2024-03-10T04:02:03.759Z] Gradle Test Run :connect:runtime:test > Gradle Test Executor 46 > org.apache.kafka.connect.util.ConvertingFutureCallbackTest > shouldBlockUntilSuccessfulCompletion PASSED
[2024-03-10T04:02:03.759Z]
[2024-03-10T04:02:03.759Z] Gradle Test Run :connect:runtime:test > Gradle Test Executor 46 > org.apache.kafka.connect.util.ConvertingFutureCallbackTest > shouldConvertBeforeGetOnSuccessfulCompletion STARTED
[2024-03-10T04:02:03.759Z]
[2024-03-10T04:02:03.759Z] Gradle Test Run :connect:runtime:test > Gradle Test Executor 46 > org.apache.kafka.connect.util.ConvertingFutureCallbackTest > shouldConvertBeforeGetOnSuccessfulCompletion PASSED
[2024-03-10T04:02:03.759Z]
[2024-03-10T04:02:03.759Z] Gradle Test Run :connect:runtime:test > Gradle Test Executor 46 > org.apache.kafka.connect.util.ConvertingFutureCallbackTest > shouldNotCancelIfMayNotCancelWhileRunning STARTED
[2024-03-10T04:02:03.759Z]
[2024-03-10T04:02:03.759Z] Gradle Test Run :connect:runtime:test > Gradle Test Executor 46 > org.apache.kafka.connect.util.ConvertingFutureCallbackTest > shouldNotCancelIfMayNotCancelWhileRunning PASSED
[2024-03-10T04:02:03.759Z]
[2024-03-10T04:02:03.759Z] Gradle Test Run :connect:runtime:test > Gradle Test Executor 46 > org.apache.kafka.connect.util.ConvertingFutureCallbackTest > shouldCancelBeforeGetIfMayCancelWhileRunning STARTED
[2024-03-10T04:02:03.759Z]
[2024-03-10T04:02:03.759Z] Gradle Test Run :connect:runtime:test > Gradle Test Executor 46 > org.apache.kafka.connect.util.ConvertingFutureCallbackTest > shouldCancelBeforeGetIfMayCancelWhileRunning PASSED
[2024-03-10T04:02:03.759Z]
[2024-03-10T04:02:03.759Z] Gradle Test Run :connect:runtime:test > Gradle Test Executor 46 > org.apache.kafka.connect.util.ConvertingFutureCallbackTest > shouldRecordOnlyFirstErrorBeforeGetOnFailedCompletion STARTED
[2024-03-10T04:02:03.759Z]
[2024-03-10T04:02:03.759Z] Gradle Test Run :connect:runtime:test > Gradle Test Executor 46 > org.apache.kafka.connect.util.ConvertingFutureCallbackTest > shouldRecordOnlyFirstErrorBeforeGetOnFailedCompletion PASSED
[2024-03-10T04:02:03.759Z]
[2024-03-10T04:02:03.759Z] Gradle Test Run :connect:runtime:test > Gradle Test Executor 46 > org.apache.kafka.connect.util.ConvertingFutureCallbackTest > shouldBlockUntilFailedCompletion STARTED
[2024-03-10T04:02:03.759Z]
[2024-03-10T04:02:03.759Z] Gradle Test Run :connect:runtime:test > Gradle Test Executor 46 > org.apache.kafka.connect.util.ConvertingFutureCallbackTest > shouldBlockUntilFailedCompletion PASSED
[2024-03-10T04:02:03.759Z]
[2024-03-10T04:02:03.759Z] Gradle Test Run :connect:runtime:test > Gradle Test Executor 46 > org.apache.kafka.connect.util.LoggingContextTest > shouldCreateConnectorLoggingContext STARTED
[2024-03-10T04:02:03.759Z]
[2024-03-10T04:02:03.759Z] Gradle Test Run :connect:runtime:test > Gradle Test Executor 46 > org.apache.kafka.connect.util.LoggingContextTest > shouldCreateConnectorLoggingContext PASSED
[2024-03-10T04:02:03.759Z]
[2024-03-10T04:02:03.759Z] Gradle Test Run :connect:runtime:test > Gradle Test Executor 46 > org.apache.kafka.connect.util.LoggingContextTest > shouldCreateTaskLoggingContext STARTED
[2024-03-10T04:02:03.759Z]
[2024-03-10T04:02:03.759Z] Gradle Test Run :connect:runtime:test > Gradle Test Executor 46 > org.apache.kafka.connect.util.LoggingContextTest > shouldCreateTaskLoggingContext PASSED
[2024-03-10T04:02:03.759Z]
[2024-03-10T04:02:03.759Z] Gradle Test Run :connect:runtime:test > Gradle Test Executor 46 > org.apache.kafka.connect.util.LoggingContextTest > shouldNotAllowNullConnectorNameForConnectorContext STARTED
[2024-03-10T04:02:03.759Z]
[2024-03-10T04:02:03.759Z] Gradle Test Run :connect:runtime:test > Gradle Test Executor 46 > org.apache.kafka.connect.util.LoggingContextTest > shouldNotAllowNullConnectorNameForConnectorContext PASSED
[2024-03-10T04:02:03.759Z]
[2024-03-10T04:02:03.759Z] Gradle Test Run :connect:runtime:test > Gradle Test Executor 46 > org.apache.kafka.connect.util.LoggingContextTest > shouldAllowNestedLoggingContexts STARTED
[2024-03-10T04:02:03.759Z]
[2024-03-10T04:02:03.759Z] Gradle Test Run :connect:runtime:test > Gradle Test Executor 46 > org.apache.kafka.connect.util.LoggingContextTest > shouldAllowNestedLoggingContexts PASSED
[2024-03-10T04:02:03.759Z]
[2024-03-10T04:02:03.759Z] Gradle Test Run :connect:runtime:test > Gradle Test Executor 46 > org.apache.kafka.connect.util.LoggingContextTest > shouldNotAllowNullTaskIdForTaskContext STARTED
[2024-03-10T04:02:03.759Z]
[2024-03-10T04:02:03.759Z] Gradle Test Run :connect:runtime:test > Gradle Test Executor 46 > org.apache.kafka.connect.util.LoggingContextTest > shouldNotAllowNullTaskIdForTaskContext PASSED
[2024-03-10T04:02:03.759Z]
[2024-03-10T04:02:03.759Z] Gradle Test Run :connect:runtime:test > Gradle Test Executor 46 > org.apache.kafka.connect.util.LoggingContextTest > shouldCreateAndCloseLoggingContextEvenWithNullContextMap STARTED
[2024-03-10T04:02:03.759Z]
[2024-03-10T04:02:03.759Z] Gradle Test Run :connect:runtime:test > Gradle Test Executor 46 > org.apache.kafka.connect.util.LoggingContextTest > shouldCreateAndCloseLoggingContextEvenWithNullContextMap PASSED
[2024-03-10T04:02:03.759Z]
[2024-03-10T04:02:03.759Z] Gradle Test Run :connect:runtime:test > Gradle Test Executor 46 > org.apache.kafka.connect.util.LoggingContextTest > shouldNotAllowNullTaskIdForOffsetContext STARTED
[2024-03-10T04:02:03.759Z]
[2024-03-10T04:02:03.759Z] Gradle Test Run :connect:runtime:test > Gradle Test Executor 46 > org.apache.kafka.connect.util.LoggingContextTest > shouldNotAllowNullTaskIdForOffsetContext PASSED
[2024-03-10T04:02:03.759Z]
[2024-03-10T04:02:03.759Z] Gradle Test Run :connect:runtime:test > Gradle Test Executor 46 > org.apache.kafka.connect.util.LoggingContextTest > shouldCreateOffsetsLoggingContext STARTED
[2024-03-10T04:02:03.759Z]
[2024-03-10T04:02:03.759Z] Gradle Test Run :connect:runtime:test > Gradle Test Executor 46 > org.apache.kafka.connect.util.LoggingContextTest > shouldCreateOffsetsLoggingContext PASSED
[2024-03-10T04:02:03.759Z]
[2024-03-10T04:02:03.759Z] Gradle Test Run :connect:runtime:test > Gradle Test Executor 46 > org.apache.kafka.connect.util.SharedTopicAdminTest > shouldCloseWithDurationAfterTopicAdminUsed STARTED
[2024-03-10T04:02:04.772Z]
[2024-03-10T04:02:04.772Z] Gradle Test Run :connect:runtime:test > Gradle Test Executor 46 > org.apache.kafka.connect.util.SharedTopicAdminTest > shouldCloseWithDurationAfterTopicAdminUsed PASSED
[2024-03-10T04:02:04.772Z]
[2024-03-10T04:02:04.772Z] Gradle Test Run :connect:runtime:test > Gradle Test Executor 46 > org.apache.kafka.connect.util.SharedTopicAdminTest > shouldCloseWithoutBeingUsed STARTED
[2024-03-10T04:02:04.772Z]
[2024-03-10T04:02:04.772Z] Gradle Test Run :connect:runtime:test > Gradle Test Executor 46 > org.apache.kafka.connect.util.SharedTopicAdminTest > shouldCloseWithoutBeingUsed PASSED
[2024-03-10T04:02:04.772Z]
[2024-03-10T04:02:04.772Z] Gradle Test Run :connect:runtime:test > Gradle Test Executor 46 > org.apache.kafka.connect.util.SharedTopicAdminTest > shouldCloseAfterTopicAdminUsed STARTED
[2024-03-10T04:02:04.772Z]
[2024-03-10T04:02:04.772Z] Gradle Test Run :connect:runtime:test > Gradle Test Executor 46 > org.apache.kafka.connect.util.SharedTopicAdminTest > shouldCloseAfterTopicAdminUsed PASSED
[2024-03-10T04:02:04.772Z]
[2024-03-10T04:02:04.772Z] Gradle Test Run :connect:runtime:test > Gradle Test Executor 46 > org.apache.kafka.connect.util.SharedTopicAdminTest > shouldFailToGetTopicAdminAfterClose STARTED
[2024-03-10T04:02:04.772Z]
[2024-03-10T04:02:04.772Z] Gradle Test Run :connect:runtime:test > Gradle Test Executor 46 > org.apache.kafka.connect.util.SharedTopicAdminTest > shouldFailToGetTopicAdminAfterClose PASSED
[2024-03-10T04:02:04.772Z]
[2024-03-10T04:02:04.772Z] Gradle Test Run :connect:runtime:test > Gradle Test Executor 46 > org.apache.kafka.connect.util.SharedTopicAdminTest > shouldCloseAfterTopicAdminUsedMultipleTimes STARTED
[2024-03-10T04:02:04.772Z]
[2024-03-10T04:02:04.772Z] Gradle Test Run :connect:runtime:test > Gradle Test Executor 46 > org.apache.kafka.connect.util.SharedTopicAdminTest > shouldCloseAfterTopicAdminUsedMultipleTimes PASSED
[2024-03-10T04:02:04.772Z]
[2024-03-10T04:02:04.772Z] Gradle Test Run :connect:runtime:test > Gradle Test Executor 46 > org.apache.kafka.connect.util.TableTest > basicOperations STARTED
[2024-03-10T04:02:04.772Z]
[2024-03-10T04:02:04.772Z] Gradle Test Run :connect:runtime:test > Gradle Test Executor 46 > org.apache.kafka.connect.util.TableTest > basicOperations PASSED
[2024-03-10T04:02:04.772Z]
[2024-03-10T04:02:04.773Z] Gradle Test Run :connect:runtime:test > Gradle Test Executor 46 > org.apache.kafka.connect.util.TopicCreationTest > topicCreationWithOneGroup STARTED
[2024-03-10T04:02:04.773Z]
[2024-03-10T04:02:04.773Z] Gradle Test Run :connect:runtime:test > Gradle Test Executor 46 > org.apache.kafka.connect.util.TopicCreationTest > topicCreationWithOneGroup PASSED
[2024-03-10T04:02:04.773Z]
[2024-03-10T04:02:04.773Z] Gradle Test Run :connect:runtime:test > Gradle Test Executor 46 > org.apache.kafka.connect.util.TopicCreationTest > topicCreationWithOneGroupAndCombinedRegex STARTED
[2024-03-10T04:02:04.773Z]
[2024-03-10T04:02:04.773Z] Gradle Test Run :connect:runtime:test > Gradle Test Executor 46 > org.apache.kafka.connect.util.TopicCreationTest > topicCreationWithOneGroupAndCombinedRegex PASSED
[2024-03-10T04:02:04.773Z]
[2024-03-10T04:02:04.773Z] Gradle Test Run :connect:runtime:test > Gradle Test Executor 46 > org.apache.kafka.connect.util.TopicCreationTest > testTopicCreationWithSingleTransformation STARTED
[2024-03-10T04:02:04.773Z]
[2024-03-10T04:02:04.773Z] Gradle Test Run :connect:runtime:test > Gradle Test Executor 46 > org.apache.kafka.connect.util.TopicCreationTest > testTopicCreationWithSingleTransformation PASSED
[2024-03-10T04:02:04.773Z]
[2024-03-10T04:02:04.773Z] Gradle Test Run :connect:runtime:test > Gradle Test Executor 46 > org.apache.kafka.connect.util.TopicCreationTest > topicCreationWithDefaultGroupAndCustomProps STARTED
[2024-03-10T04:02:04.773Z]
[2024-03-10T04:02:04.773Z] Gradle Test Run :connect:runtime:test > Gradle Test Executor 46 > org.apache.kafka.connect.util.TopicCreationTest > topicCreationWithDefaultGroupAndCustomProps PASSED
[2024-03-10T04:02:04.773Z]
[2024-03-10T04:02:04.773Z] Gradle Test Run :connect:runtime:test > Gradle Test Executor 46 > org.apache.kafka.connect.util.TopicCreationTest > topicCreationWithTwoGroupsAndTwoTransformations STARTED
[2024-03-10T04:02:04.773Z]
[2024-03-10T04:02:04.773Z] Gradle Test Run :connect:runtime:test > Gradle Test Executor 46 > org.apache.kafka.connect.util.TopicCreationTest > topicCreationWithTwoGroupsAndTwoTransformations PASSED
[2024-03-10T04:02:04.773Z]
[2024-03-10T04:02:04.773Z] Gradle Test Run :connect:runtime:test > Gradle Test Executor 46 > org.apache.kafka.connect.util.TopicCreationTest > testTopicCreationWhenTopicCreationIsEnabled STARTED
[2024-03-10T04:02:04.773Z]
[2024-03-10T04:02:04.773Z] Gradle Test Run :connect:runtime:test > Gradle Test Executor 46 > org.apache.kafka.connect.util.TopicCreationTest > testTopicCreationWhenTopicCreationIsEnabled PASSED
[2024-03-10T04:02:04.773Z]
[2024-03-10T04:02:04.773Z] Gradle Test Run :connect:runtime:test > Gradle Test Executor 46 > org.apache.kafka.connect.util.TopicCreationTest > withDefaultTopicCreation STARTED
[2024-03-10T04:02:04.773Z]
[2024-03-10T04:02:04.773Z] Gradle Test Run :connect:runtime:test > Gradle Test Executor 46 > org.apache.kafka.connect.util.TopicCreationTest > withDefaultTopicCreation PASSED
[2024-03-10T04:02:04.773Z]
[2024-03-10T04:02:04.773Z] Gradle Test Run :connect:runtime:test > Gradle Test Executor 46 > org.apache.kafka.connect.util.TopicCreationTest > testTopicCreationWhenTopicCreationIsDisabled STARTED
[2024-03-10T04:02:04.773Z]
[2024-03-10T04:02:04.773Z] Gradle Test Run :connect:runtime:test > Gradle Test Executor 46 > org.apache.kafka.connect.util.TopicCreationTest > testTopicCreationWhenTopicCreationIsDisabled PASSED
[2024-03-10T04:02:04.773Z]
[2024-03-10T04:02:04.773Z] Gradle Test Run :connect:runtime:test > Gradle Test Executor 46 > org.apache.kafka.connect.util.TopicCreationTest > topicCreationWithTwoGroups STARTED
[2024-03-10T04:02:04.773Z]
[2024-03-10T04:02:04.773Z] Gradle Test Run :connect:runtime:test > Gradle Test Executor 46 > org.apache.kafka.connect.util.TopicCreationTest > topicCreationWithTwoGroups PASSED
[2024-03-10T04:02:04.773Z]
[2024-03-10T04:02:04.773Z] Gradle Test Run :connect:runtime:test > Gradle Test Executor 46 > org.apache.kafka.connect.util.TopicCreationTest > testEmptyTopicCreation STARTED
[2024-03-10T04:02:04.773Z]
[2024-03-10T04:02:04.773Z] Gradle Test Run :connect:runtime:test > Gradle Test Executor 46 > org.apache.kafka.connect.util.TopicCreationTest > testEmptyTopicCreation PASSED
[2024-03-10T04:02:28.364Z]
[2024-03-10T04:02:28.364Z] FAILURE: Build completed with 3 failures.
[2024-03-10T04:02:28.364Z]
[2024-03-10T04:02:28.364Z] 1: Task failed with an exception.
[2024-03-10T04:02:28.364Z] -----------
[2024-03-10T04:02:28.364Z] * What went wrong:
[2024-03-10T04:02:28.364Z] Execution failed for task ':core:test'.
[2024-03-10T04:02:28.364Z] > Process 'Gradle Test Executor 10' finished with non-zero exit value 137
[2024-03-10T04:02:28.364Z] This problem might be caused by incorrect test process configuration.
[2024-03-10T04:02:28.364Z] For more on test execution, please refer to https://docs.gradle.org/8.6/userguide/java_testing.html#sec:test_execution in the Gradle documentation.
[2024-03-10T04:02:28.365Z]
[2024-03-10T04:02:28.365Z] * Try:
[2024-03-10T04:02:28.365Z] > Run with --stacktrace option to get the stack trace.
[2024-03-10T04:02:28.365Z] > Run with --info or --debug option to get more log output.
[2024-03-10T04:02:28.365Z] > Get more help at https://help.gradle.org.
[2024-03-10T04:02:28.365Z] ==============================================================================
[2024-03-10T04:02:28.365Z]
[2024-03-10T04:02:28.365Z] 2: Task failed with an exception.
[2024-03-10T04:02:28.365Z] -----------
[2024-03-10T04:02:28.365Z] * What went wrong:
[2024-03-10T04:02:28.365Z] Execution failed for task ':streams:test'.
[2024-03-10T04:02:28.365Z] > Process 'Gradle Test Executor 28' finished with non-zero exit value 137
[2024-03-10T04:02:28.365Z] This problem might be caused by incorrect test process configuration.
[2024-03-10T04:02:28.365Z] For more on test execution, please refer to https://docs.gradle.org/8.6/userguide/java_testing.html#sec:test_execution in the Gradle documentation.
[2024-03-10T04:02:28.365Z]
[2024-03-10T04:02:28.365Z] * Try:
[2024-03-10T04:02:28.365Z] > Run with --stacktrace option to get the stack trace.
[2024-03-10T04:02:28.365Z] > Run with --info or --debug option to get more log output.
[2024-03-10T04:02:28.365Z] > Get more help at https://help.gradle.org.
[2024-03-10T04:02:28.365Z] ==============================================================================
[2024-03-10T04:02:28.365Z]
[2024-03-10T04:02:28.365Z] 3: Task failed with an exception.
[2024-03-10T04:02:28.365Z] -----------
[2024-03-10T04:02:28.365Z] * What went wrong:
[2024-03-10T04:02:28.365Z] Execution failed for task ':connect:mirror:test'.
[2024-03-10T04:02:28.365Z] > Process 'Gradle Test Executor 39' finished with non-zero exit value 137
[2024-03-10T04:02:28.365Z] This problem might be caused by incorrect test process configuration.
[2024-03-10T04:02:28.365Z] For more on test execution, please refer to https://docs.gradle.org/8.6/userguide/java_testing.html#sec:test_execution in the Gradle documentation.
[2024-03-10T04:02:28.365Z]
[2024-03-10T04:02:28.365Z] * Try:
[2024-03-10T04:02:28.365Z] > Run with --stacktrace option to get the stack trace.
[2024-03-10T04:02:28.365Z] > Run with --info or --debug option to get more log output.
[2024-03-10T04:02:28.365Z] > Get more help at https://help.gradle.org.
[2024-03-10T04:02:28.365Z] ==============================================================================
[2024-03-10T04:02:28.365Z]
[2024-03-10T04:02:28.365Z] Deprecated Gradle features were used in this build, making it incompatible with Gradle 9.0.
[2024-03-10T04:02:28.365Z]
[2024-03-10T04:02:28.365Z] You can use '--warning-mode all' to show the individual deprecation warnings and determine if they come from your own scripts or plugins.
[2024-03-10T04:02:28.365Z]
[2024-03-10T04:02:28.365Z] For more on this, please refer to https://docs.gradle.org/8.6/userguide/command_line_interface.html#sec:command_line_warnings in the Gradle documentation.
[2024-03-10T04:02:28.365Z]
[2024-03-10T04:02:28.365Z] BUILD FAILED in 4h 53m 17s
[2024-03-10T04:02:28.365Z] 321 actionable tasks: 119 executed, 202 up-to-date
[2024-03-10T04:02:29.264Z]
[2024-03-10T04:02:29.264Z] Publishing build scan...
[2024-03-10T04:02:34.201Z] https://ge.apache.org/s/nfdqv2irrhvaw
[2024-03-10T04:02:34.201Z]
[2024-03-10T04:02:34.201Z]
[2024-03-10T04:02:34.201Z] See the profiling report at: file:///home/jenkins/jenkins-agent/712657a4/workspace/Kafka_kafka_trunk/build/reports/profile/profile-2024-03-09-23-09-14.html
[2024-03-10T04:02:34.201Z] A fine-grained performance profile is available: use the --scan option.
[Pipeline] }
[Pipeline] // withEnv
[Pipeline] }
[Pipeline] // withEnv
[Pipeline] }
[Pipeline] // withEnv
[Pipeline] }
[Pipeline] // node
[Pipeline] }
[Pipeline] // timestamps
[Pipeline] }
[Pipeline] // timeout
[Pipeline] }
[Pipeline] // stage
[Pipeline] }
Failed in branch JDK 11 and Scala 2.13
[Pipeline] // parallel
[Pipeline] }
[Pipeline] // stage
[Pipeline] stage
[Pipeline] { (Declarative: Post Actions)
[Pipeline] script
[Pipeline] {
[Pipeline] node
Running on builds49 in /home/jenkins/jenkins-agent/workspace/Kafka_kafka_trunk
[Pipeline] {
[Pipeline] step
Jenkins build is still unstable: Kafka » Kafka Branch Builder » trunk #2712
Posted by Apache Jenkins Server <je...@builds.apache.org>.
See <https://ci-builds.apache.org/job/Kafka/job/kafka/job/trunk/2712/display/redirect>
Jenkins build is unstable: Kafka » Kafka Branch Builder » trunk #2711
Posted by Apache Jenkins Server <je...@builds.apache.org>.
See <https://ci-builds.apache.org/job/Kafka/job/kafka/job/trunk/2711/display/redirect>
Build failed in Jenkins: Kafka » Kafka Branch Builder » trunk #2710
Posted by Apache Jenkins Server <je...@builds.apache.org>.
See <https://ci-builds.apache.org/job/Kafka/job/kafka/job/trunk/2710/display/redirect>
Changes:
------------------------------------------
[...truncated 440673 lines...]
[2024-03-09T00:11:03.244Z] at app//org.junit.platform.engine.support.hierarchical.SameThreadHierarchicalTestExecutorService.submit(SameThreadHierarchicalTestExecutorService.java:35)
[2024-03-09T00:11:03.244Z] at app//org.junit.platform.engine.support.hierarchical.HierarchicalTestExecutor.execute(HierarchicalTestExecutor.java:57)
[2024-03-09T00:11:03.244Z] at app//org.junit.platform.engine.support.hierarchical.HierarchicalTestEngine.execute(HierarchicalTestEngine.java:54)
[2024-03-09T00:11:03.244Z] at app//org.junit.platform.launcher.core.EngineExecutionOrchestrator.execute(EngineExecutionOrchestrator.java:107)
[2024-03-09T00:11:03.244Z] at app//org.junit.platform.launcher.core.EngineExecutionOrchestrator.execute(EngineExecutionOrchestrator.java:88)
[2024-03-09T00:11:03.244Z] at app//org.junit.platform.launcher.core.EngineExecutionOrchestrator.lambda$execute$0(EngineExecutionOrchestrator.java:54)
[2024-03-09T00:11:03.244Z] at app//org.junit.platform.launcher.core.EngineExecutionOrchestrator.withInterceptedStreams(EngineExecutionOrchestrator.java:67)
[2024-03-09T00:11:03.244Z] at app//org.junit.platform.launcher.core.EngineExecutionOrchestrator.execute(EngineExecutionOrchestrator.java:52)
[2024-03-09T00:11:03.244Z] at app//org.junit.platform.launcher.core.DefaultLauncher.execute(DefaultLauncher.java:114)
[2024-03-09T00:11:03.244Z] at app//org.junit.platform.launcher.core.DefaultLauncher.execute(DefaultLauncher.java:86)
[2024-03-09T00:11:03.244Z] at app//org.junit.platform.launcher.core.DefaultLauncherSession$DelegatingLauncher.execute(DefaultLauncherSession.java:86)
[2024-03-09T00:11:03.244Z] at org.gradle.api.internal.tasks.testing.junitplatform.JUnitPlatformTestClassProcessor$CollectAllTestClassesExecutor.processAllTestClasses(JUnitPlatformTestClassProcessor.java:119)
[2024-03-09T00:11:03.244Z] at org.gradle.api.internal.tasks.testing.junitplatform.JUnitPlatformTestClassProcessor$CollectAllTestClassesExecutor.access$000(JUnitPlatformTestClassProcessor.java:94)
[2024-03-09T00:11:03.244Z] at org.gradle.api.internal.tasks.testing.junitplatform.JUnitPlatformTestClassProcessor.stop(JUnitPlatformTestClassProcessor.java:89)
[2024-03-09T00:11:03.244Z] at org.gradle.api.internal.tasks.testing.SuiteTestClassProcessor.stop(SuiteTestClassProcessor.java:62)
[2024-03-09T00:11:03.244Z] at java.base@11.0.16.1/jdk.internal.reflect.NativeMethodAccessorImpl.invoke0(Native Method)
[2024-03-09T00:11:03.244Z] at java.base@11.0.16.1/jdk.internal.reflect.NativeMethodAccessorImpl.invoke(NativeMethodAccessorImpl.java:62)
[2024-03-09T00:11:03.244Z] at java.base@11.0.16.1/jdk.internal.reflect.DelegatingMethodAccessorImpl.invoke(DelegatingMethodAccessorImpl.java:43)
[2024-03-09T00:11:03.244Z] at java.base@11.0.16.1/java.lang.reflect.Method.invoke(Method.java:566)
[2024-03-09T00:11:03.244Z] at org.gradle.internal.dispatch.ReflectionDispatch.dispatch(ReflectionDispatch.java:36)
[2024-03-09T00:11:03.244Z] at org.gradle.internal.dispatch.ReflectionDispatch.dispatch(ReflectionDispatch.java:24)
[2024-03-09T00:11:03.244Z] at org.gradle.internal.dispatch.ContextClassLoaderDispatch.dispatch(ContextClassLoaderDispatch.java:33)
[2024-03-09T00:11:03.244Z] at org.gradle.internal.dispatch.ProxyDispatchAdapter$DispatchingInvocationHandler.invoke(ProxyDispatchAdapter.java:94)
[2024-03-09T00:11:03.244Z] at com.sun.proxy.$Proxy2.stop(Unknown Source)
[2024-03-09T00:11:03.244Z] at org.gradle.api.internal.tasks.testing.worker.TestWorker$3.run(TestWorker.java:193)
[2024-03-09T00:11:03.244Z] at org.gradle.api.internal.tasks.testing.worker.TestWorker.executeAndMaintainThreadName(TestWorker.java:129)
[2024-03-09T00:11:03.244Z] at org.gradle.api.internal.tasks.testing.worker.TestWorker.execute(TestWorker.java:100)
[2024-03-09T00:11:03.244Z] at org.gradle.api.internal.tasks.testing.worker.TestWorker.execute(TestWorker.java:60)
[2024-03-09T00:11:03.244Z] at org.gradle.process.internal.worker.child.ActionExecutionWorker.execute(ActionExecutionWorker.java:56)
[2024-03-09T00:11:03.244Z] at org.gradle.process.internal.worker.child.SystemApplicationClassLoaderWorker.call(SystemApplicationClassLoaderWorker.java:113)
[2024-03-09T00:11:03.244Z] at org.gradle.process.internal.worker.child.SystemApplicationClassLoaderWorker.call(SystemApplicationClassLoaderWorker.java:65)
[2024-03-09T00:11:03.244Z] at app//worker.org.gradle.process.internal.worker.GradleWorkerMain.run(GradleWorkerMain.java:69)
[2024-03-09T00:11:03.244Z] at app//worker.org.gradle.process.internal.worker.GradleWorkerMain.main(GradleWorkerMain.java:74)
[2024-03-09T00:11:08.015Z]
[2024-03-09T00:11:08.015Z] Gradle Test Run :tools:test > Gradle Test Executor 107 > TopicCommandIntegrationTest > testDescribeWhenTopicDoesntExistWithIfExists(String) > testDescribeWhenTopicDoesntExistWithIfExists(String).zk STARTED
[2024-03-09T00:11:11.856Z]
[2024-03-09T00:11:11.856Z] Gradle Test Run :tools:test > Gradle Test Executor 107 > TopicCommandIntegrationTest > testDescribeWhenTopicDoesntExistWithIfExists(String) > testDescribeWhenTopicDoesntExistWithIfExists(String).zk PASSED
[2024-03-09T00:11:11.856Z]
[2024-03-09T00:11:11.856Z] Gradle Test Run :tools:test > Gradle Test Executor 107 > TopicCommandIntegrationTest > testDescribeWhenTopicDoesntExistWithIfExists(String) > testDescribeWhenTopicDoesntExistWithIfExists(String).kraft STARTED
[2024-03-09T00:11:14.767Z]
[2024-03-09T00:11:14.767Z] Gradle Test Run :tools:test > Gradle Test Executor 107 > TopicCommandIntegrationTest > testDescribeWhenTopicDoesntExistWithIfExists(String) > testDescribeWhenTopicDoesntExistWithIfExists(String).kraft PASSED
[2024-03-09T00:11:14.767Z]
[2024-03-09T00:11:14.767Z] Gradle Test Run :tools:test > Gradle Test Executor 107 > DeleteOffsetsConsumerGroupCommandIntegrationTest > testDeleteOffsetsOfEmptyConsumerGroupWithUnknownTopicOnly() > testDeleteOffsetsOfEmptyConsumerGroupWithUnknownTopicOnly(). STARTED
[2024-03-09T00:11:18.674Z]
[2024-03-09T00:11:18.674Z] Gradle Test Run :tools:test > Gradle Test Executor 107 > DeleteOffsetsConsumerGroupCommandIntegrationTest > testDeleteOffsetsOfEmptyConsumerGroupWithUnknownTopicOnly() > testDeleteOffsetsOfEmptyConsumerGroupWithUnknownTopicOnly(). PASSED
[2024-03-09T00:11:18.674Z]
[2024-03-09T00:11:18.674Z] Gradle Test Run :tools:test > Gradle Test Executor 107 > DeleteOffsetsConsumerGroupCommandIntegrationTest > testDeleteOffsetsOfEmptyConsumerGroupWithUnknownTopicOnly() > testDeleteOffsetsOfEmptyConsumerGroupWithUnknownTopicOnly(). STARTED
[2024-03-09T00:11:20.619Z]
[2024-03-09T00:11:20.619Z] Gradle Test Run :tools:test > Gradle Test Executor 107 > DeleteOffsetsConsumerGroupCommandIntegrationTest > testDeleteOffsetsOfEmptyConsumerGroupWithUnknownTopicOnly() > testDeleteOffsetsOfEmptyConsumerGroupWithUnknownTopicOnly(). PASSED
[2024-03-09T00:11:20.619Z]
[2024-03-09T00:11:20.619Z] Gradle Test Run :tools:test > Gradle Test Executor 107 > ReassignPartitionsIntegrationTest > testReassignmentWithAlterPartitionDisabled(String) > testReassignmentWithAlterPartitionDisabled(String).zk STARTED
[2024-03-09T00:11:25.803Z]
[2024-03-09T00:11:25.803Z] Gradle Test Run :tools:test > Gradle Test Executor 107 > ReassignPartitionsIntegrationTest > testReassignmentWithAlterPartitionDisabled(String) > testReassignmentWithAlterPartitionDisabled(String).zk PASSED
[2024-03-09T00:11:25.803Z]
[2024-03-09T00:11:25.803Z] Gradle Test Run :tools:test > Gradle Test Executor 107 > ReassignPartitionsIntegrationTest > testProduceAndConsumeWithReassignmentInProgress(String) > testProduceAndConsumeWithReassignmentInProgress(String).zk STARTED
[2024-03-09T00:11:33.640Z]
[2024-03-09T00:11:33.640Z] Gradle Test Run :tools:test > Gradle Test Executor 107 > ReassignPartitionsIntegrationTest > testProduceAndConsumeWithReassignmentInProgress(String) > testProduceAndConsumeWithReassignmentInProgress(String).zk PASSED
[2024-03-09T00:11:33.640Z]
[2024-03-09T00:11:33.640Z] Gradle Test Run :tools:test > Gradle Test Executor 107 > ReassignPartitionsIntegrationTest > testProduceAndConsumeWithReassignmentInProgress(String) > testProduceAndConsumeWithReassignmentInProgress(String).kraft STARTED
[2024-03-09T00:11:38.912Z]
[2024-03-09T00:11:38.912Z] Gradle Test Run :tools:test > Gradle Test Executor 107 > ReassignPartitionsIntegrationTest > testProduceAndConsumeWithReassignmentInProgress(String) > testProduceAndConsumeWithReassignmentInProgress(String).kraft PASSED
[2024-03-09T00:11:38.912Z]
[2024-03-09T00:11:38.912Z] Gradle Test Run :tools:test > Gradle Test Executor 107 > ReassignPartitionsIntegrationTest > testAlterReassignmentThrottle(String) > testAlterReassignmentThrottle(String).zk STARTED
[2024-03-09T00:11:43.780Z]
[2024-03-09T00:11:43.780Z] Gradle Test Run :tools:test > Gradle Test Executor 107 > ReassignPartitionsIntegrationTest > testAlterReassignmentThrottle(String) > testAlterReassignmentThrottle(String).zk PASSED
[2024-03-09T00:11:43.780Z]
[2024-03-09T00:11:43.780Z] Gradle Test Run :tools:test > Gradle Test Executor 107 > ReassignPartitionsIntegrationTest > testAlterReassignmentThrottle(String) > testAlterReassignmentThrottle(String).kraft STARTED
[2024-03-09T00:11:48.935Z]
[2024-03-09T00:11:48.935Z] Gradle Test Run :tools:test > Gradle Test Executor 107 > ReassignPartitionsIntegrationTest > testAlterReassignmentThrottle(String) > testAlterReassignmentThrottle(String).kraft PASSED
[2024-03-09T00:11:48.935Z]
[2024-03-09T00:11:48.935Z] Gradle Test Run :tools:test > Gradle Test Executor 107 > ReassignPartitionsIntegrationTest > testReassignment(String) > testReassignment(String).zk STARTED
[2024-03-09T00:11:51.585Z]
[2024-03-09T00:11:51.585Z] Gradle Test Run :tools:test > Gradle Test Executor 107 > ReassignPartitionsIntegrationTest > testReassignment(String) > testReassignment(String).zk PASSED
[2024-03-09T00:11:51.585Z]
[2024-03-09T00:11:51.585Z] Gradle Test Run :tools:test > Gradle Test Executor 107 > ReassignPartitionsIntegrationTest > testReassignment(String) > testReassignment(String).kraft STARTED
[2024-03-09T00:11:55.331Z]
[2024-03-09T00:11:55.331Z] Gradle Test Run :tools:test > Gradle Test Executor 107 > ReassignPartitionsIntegrationTest > testReassignment(String) > testReassignment(String).kraft PASSED
[2024-03-09T00:11:55.331Z]
[2024-03-09T00:11:55.331Z] Gradle Test Run :tools:test > Gradle Test Executor 107 > ReassignPartitionsIntegrationTest > testReassignmentCompletionDuringPartialUpgrade(String) > testReassignmentCompletionDuringPartialUpgrade(String).zk STARTED
[2024-03-09T00:11:57.284Z]
[2024-03-09T00:11:57.284Z] Gradle Test Run :tools:test > Gradle Test Executor 107 > ReassignPartitionsIntegrationTest > testReassignmentCompletionDuringPartialUpgrade(String) > testReassignmentCompletionDuringPartialUpgrade(String).zk PASSED
[2024-03-09T00:11:57.284Z]
[2024-03-09T00:11:57.284Z] Gradle Test Run :tools:test > Gradle Test Executor 107 > ReassignPartitionsIntegrationTest > testAlterLogDirReassignmentThrottle(String) > testAlterLogDirReassignmentThrottle(String).zk STARTED
[2024-03-09T00:12:05.157Z]
[2024-03-09T00:12:05.157Z] Gradle Test Run :tools:test > Gradle Test Executor 107 > ReassignPartitionsIntegrationTest > testAlterLogDirReassignmentThrottle(String) > testAlterLogDirReassignmentThrottle(String).zk PASSED
[2024-03-09T00:12:05.157Z]
[2024-03-09T00:12:05.157Z] Gradle Test Run :tools:test > Gradle Test Executor 107 > ReassignPartitionsIntegrationTest > testCancellation(String) > testCancellation(String).zk STARTED
[2024-03-09T00:12:08.162Z]
[2024-03-09T00:12:08.162Z] Gradle Test Run :tools:test > Gradle Test Executor 107 > ReassignPartitionsIntegrationTest > testCancellation(String) > testCancellation(String).zk PASSED
[2024-03-09T00:12:08.162Z]
[2024-03-09T00:12:08.162Z] Gradle Test Run :tools:test > Gradle Test Executor 107 > ReassignPartitionsIntegrationTest > testCancellation(String) > testCancellation(String).kraft STARTED
[2024-03-09T00:12:10.848Z]
[2024-03-09T00:12:10.848Z] Gradle Test Run :tools:test > Gradle Test Executor 107 > ReassignPartitionsIntegrationTest > testCancellation(String) > testCancellation(String).kraft PASSED
[2024-03-09T00:12:10.848Z]
[2024-03-09T00:12:10.848Z] Gradle Test Run :tools:test > Gradle Test Executor 107 > ReassignPartitionsIntegrationTest > testThrottledReassignment(String) > testThrottledReassignment(String).zk STARTED
[2024-03-09T00:12:14.346Z]
[2024-03-09T00:12:14.346Z] Gradle Test Run :tools:test > Gradle Test Executor 107 > ReassignPartitionsIntegrationTest > testThrottledReassignment(String) > testThrottledReassignment(String).zk PASSED
[2024-03-09T00:12:14.346Z]
[2024-03-09T00:12:14.346Z] Gradle Test Run :tools:test > Gradle Test Executor 107 > ReassignPartitionsIntegrationTest > testThrottledReassignment(String) > testThrottledReassignment(String).kraft STARTED
[2024-03-09T00:12:17.146Z]
[2024-03-09T00:12:17.146Z] Gradle Test Run :tools:test > Gradle Test Executor 107 > ReassignPartitionsIntegrationTest > testThrottledReassignment(String) > testThrottledReassignment(String).kraft PASSED
[2024-03-09T00:12:17.146Z]
[2024-03-09T00:12:17.146Z] Gradle Test Run :tools:test > Gradle Test Executor 107 > ReassignPartitionsIntegrationTest > testHighWaterMarkAfterPartitionReassignment(String) > testHighWaterMarkAfterPartitionReassignment(String).zk STARTED
[2024-03-09T00:12:18.973Z]
[2024-03-09T00:12:18.973Z] Gradle Test Run :tools:test > Gradle Test Executor 107 > ReassignPartitionsIntegrationTest > testHighWaterMarkAfterPartitionReassignment(String) > testHighWaterMarkAfterPartitionReassignment(String).zk PASSED
[2024-03-09T00:12:18.973Z]
[2024-03-09T00:12:18.973Z] Gradle Test Run :tools:test > Gradle Test Executor 107 > ReassignPartitionsIntegrationTest > testHighWaterMarkAfterPartitionReassignment(String) > testHighWaterMarkAfterPartitionReassignment(String).kraft STARTED
[2024-03-09T00:12:20.536Z]
[2024-03-09T00:12:20.536Z] Gradle Test Run :tools:test > Gradle Test Executor 107 > ReassignPartitionsIntegrationTest > testHighWaterMarkAfterPartitionReassignment(String) > testHighWaterMarkAfterPartitionReassignment(String).kraft PASSED
[2024-03-09T00:12:20.536Z]
[2024-03-09T00:12:20.536Z] Gradle Test Run :tools:test > Gradle Test Executor 107 > ReassignPartitionsIntegrationTest > testCancellationWithAddingReplicaInIsr(String) > testCancellationWithAddingReplicaInIsr(String).zk STARTED
[2024-03-09T00:12:22.434Z]
[2024-03-09T00:12:22.434Z] Gradle Test Run :tools:test > Gradle Test Executor 107 > ReassignPartitionsIntegrationTest > testCancellationWithAddingReplicaInIsr(String) > testCancellationWithAddingReplicaInIsr(String).zk PASSED
[2024-03-09T00:12:22.434Z]
[2024-03-09T00:12:22.434Z] Gradle Test Run :tools:test > Gradle Test Executor 107 > ReassignPartitionsIntegrationTest > testCancellationWithAddingReplicaInIsr(String) > testCancellationWithAddingReplicaInIsr(String).kraft STARTED
[2024-03-09T00:12:25.041Z]
[2024-03-09T00:12:25.041Z] Gradle Test Run :tools:test > Gradle Test Executor 107 > ReassignPartitionsIntegrationTest > testCancellationWithAddingReplicaInIsr(String) > testCancellationWithAddingReplicaInIsr(String).kraft PASSED
[2024-03-09T00:12:25.041Z]
[2024-03-09T00:12:25.041Z] Gradle Test Run :tools:test > Gradle Test Executor 107 > ReassignPartitionsIntegrationTest > testLogDirReassignment(String) > testLogDirReassignment(String).zk STARTED
[2024-03-09T00:12:30.096Z]
[2024-03-09T00:12:30.096Z] Gradle Test Run :tools:test > Gradle Test Executor 107 > ReassignPartitionsIntegrationTest > testLogDirReassignment(String) > testLogDirReassignment(String).zk PASSED
[2024-03-09T00:12:30.096Z]
[2024-03-09T00:12:30.096Z] Gradle Test Run :tools:test > Gradle Test Executor 107 > ReassignPartitionsIntegrationTest > executionError STARTED
[2024-03-09T00:12:30.096Z]
[2024-03-09T00:12:30.096Z] Gradle Test Run :tools:test > Gradle Test Executor 107 > ReassignPartitionsIntegrationTest > executionError PASSED
[2024-03-09T00:13:19.520Z]
[2024-03-09T00:13:19.520Z] Gradle Test Run :tools:test > Gradle Test Executor 106 > JmxToolTest > initializationError STARTED
[2024-03-09T00:13:19.520Z] org.apache.kafka.tools.JmxToolTest.initializationError failed, log available in /home/jenkins/jenkins-agent/712657a4/workspace/Kafka_kafka_trunk/tools/build/reports/testOutput/org.apache.kafka.tools.JmxToolTest.initializationError.test.stdout
[2024-03-09T00:13:19.520Z]
[2024-03-09T00:13:19.520Z] Gradle Test Run :tools:test > Gradle Test Executor 106 > JmxToolTest > initializationError FAILED
[2024-03-09T00:13:19.520Z] java.io.IOException: Cannot bind to URL [rmi://:44895/jmxrmi]: javax.naming.ServiceUnavailableException [Root exception is java.rmi.ConnectException: Connection refused to host: 20.115.7.55; nested exception is:
[2024-03-09T00:13:19.520Z] java.net.ConnectException: Connection timed out (Connection timed out)]
[2024-03-09T00:13:19.520Z] at java.management.rmi/javax.management.remote.rmi.RMIConnectorServer.newIOException(RMIConnectorServer.java:854)
[2024-03-09T00:13:19.520Z] at java.management.rmi/javax.management.remote.rmi.RMIConnectorServer.start(RMIConnectorServer.java:501)
[2024-03-09T00:13:19.520Z] at org.apache.kafka.tools.JmxToolTest.beforeAll(JmxToolTest.java:69)
[2024-03-09T00:13:19.520Z]
[2024-03-09T00:13:19.520Z] Caused by:
[2024-03-09T00:13:19.520Z] javax.naming.ServiceUnavailableException [Root exception is java.rmi.ConnectException: Connection refused to host: 20.115.7.55; nested exception is:
[2024-03-09T00:13:19.520Z] java.net.ConnectException: Connection timed out (Connection timed out)]
[2024-03-09T00:13:19.520Z] at jdk.naming.rmi/com.sun.jndi.rmi.registry.RegistryContext.bind(RegistryContext.java:162)
[2024-03-09T00:13:19.520Z] at java.naming/com.sun.jndi.toolkit.url.GenericURLContext.bind(GenericURLContext.java:243)
[2024-03-09T00:13:19.520Z] at java.naming/javax.naming.InitialContext.bind(InitialContext.java:417)
[2024-03-09T00:13:19.520Z] at java.management.rmi/javax.management.remote.rmi.RMIConnectorServer.bind(RMIConnectorServer.java:713)
[2024-03-09T00:13:19.520Z] at java.management.rmi/javax.management.remote.rmi.RMIConnectorServer.start(RMIConnectorServer.java:496)
[2024-03-09T00:13:19.520Z] ... 1 more
[2024-03-09T00:13:19.520Z]
[2024-03-09T00:13:19.520Z] Caused by:
[2024-03-09T00:13:19.520Z] java.rmi.ConnectException: Connection refused to host: 20.115.7.55; nested exception is:
[2024-03-09T00:13:19.520Z] java.net.ConnectException: Connection timed out (Connection timed out)
[2024-03-09T00:13:19.520Z] at java.rmi/sun.rmi.transport.tcp.TCPEndpoint.newSocket(TCPEndpoint.java:623)
[2024-03-09T00:13:19.520Z] at java.rmi/sun.rmi.transport.tcp.TCPChannel.createConnection(TCPChannel.java:209)
[2024-03-09T00:13:19.520Z] at java.rmi/sun.rmi.transport.tcp.TCPChannel.newConnection(TCPChannel.java:196)
[2024-03-09T00:13:19.520Z] at java.rmi/sun.rmi.server.UnicastRef.newCall(UnicastRef.java:343)
[2024-03-09T00:13:19.520Z] at java.rmi/sun.rmi.registry.RegistryImpl_Stub.bind(RegistryImpl_Stub.java:65)
[2024-03-09T00:13:19.520Z] at jdk.naming.rmi/com.sun.jndi.rmi.registry.RegistryContext.bind(RegistryContext.java:156)
[2024-03-09T00:13:19.520Z] ... 5 more
[2024-03-09T00:13:19.520Z]
[2024-03-09T00:13:19.520Z] Caused by:
[2024-03-09T00:13:19.520Z] java.net.ConnectException: Connection timed out (Connection timed out)
[2024-03-09T00:13:19.520Z] at java.base/java.net.PlainSocketImpl.socketConnect(Native Method)
[2024-03-09T00:13:19.520Z] at java.base/java.net.AbstractPlainSocketImpl.doConnect(AbstractPlainSocketImpl.java:412)
[2024-03-09T00:13:19.520Z] at java.base/java.net.AbstractPlainSocketImpl.connectToAddress(AbstractPlainSocketImpl.java:255)
[2024-03-09T00:13:19.520Z] at java.base/java.net.AbstractPlainSocketImpl.connect(AbstractPlainSocketImpl.java:237)
[2024-03-09T00:13:19.520Z] at java.base/java.net.SocksSocketImpl.connect(SocksSocketImpl.java:392)
[2024-03-09T00:13:19.520Z] at java.base/java.net.Socket.connect(Socket.java:609)
[2024-03-09T00:13:19.520Z] at java.base/java.net.Socket.connect(Socket.java:558)
[2024-03-09T00:13:19.520Z] at java.base/java.net.Socket.<init>(Socket.java:454)
[2024-03-09T00:13:19.520Z] at java.base/java.net.Socket.<init>(Socket.java:231)
[2024-03-09T00:13:19.520Z] at java.rmi/sun.rmi.transport.tcp.TCPDirectSocketFactory.createSocket(TCPDirectSocketFactory.java:40)
[2024-03-09T00:13:19.520Z] at java.rmi/sun.rmi.transport.tcp.TCPEndpoint.newSocket(TCPEndpoint.java:617)
[2024-03-09T00:13:19.520Z] ... 10 more
[2024-03-09T00:13:19.520Z]
[2024-03-09T00:13:19.520Z] 658 tests completed, 6 failed
[2024-03-09T00:13:21.377Z] There were failing tests. See the report at: file:///home/jenkins/jenkins-agent/712657a4/workspace/Kafka_kafka_trunk/tools/build/reports/tests/test/index.html
[2024-03-09T00:13:23.164Z]
[2024-03-09T00:13:23.164Z] FAILURE: Build completed with 2 failures.
[2024-03-09T00:13:23.164Z]
[2024-03-09T00:13:23.164Z] 1: Task failed with an exception.
[2024-03-09T00:13:23.164Z] -----------
[2024-03-09T00:13:23.164Z] * What went wrong:
[2024-03-09T00:13:23.164Z] Execution failed for task ':core:test'.
[2024-03-09T00:13:23.164Z] > Process 'Gradle Test Executor 10' finished with non-zero exit value 137
[2024-03-09T00:13:23.164Z] This problem might be caused by incorrect test process configuration.
[2024-03-09T00:13:23.164Z] For more on test execution, please refer to https://docs.gradle.org/8.6/userguide/java_testing.html#sec:test_execution in the Gradle documentation.
[2024-03-09T00:13:23.164Z]
[2024-03-09T00:13:23.164Z] * Try:
[2024-03-09T00:13:23.164Z] > Run with --stacktrace option to get the stack trace.
[2024-03-09T00:13:23.164Z] > Run with --info or --debug option to get more log output.
[2024-03-09T00:13:23.164Z] > Get more help at https://help.gradle.org.
[2024-03-09T00:13:23.164Z] ==============================================================================
[2024-03-09T00:13:23.164Z]
[2024-03-09T00:13:23.164Z] 2: Task failed with an exception.
[2024-03-09T00:13:23.164Z] -----------
[2024-03-09T00:13:23.164Z] * What went wrong:
[2024-03-09T00:13:23.164Z] Execution failed for task ':streams:test'.
[2024-03-09T00:13:23.164Z] > Process 'Gradle Test Executor 25' finished with non-zero exit value 137
[2024-03-09T00:13:23.164Z] This problem might be caused by incorrect test process configuration.
[2024-03-09T00:13:23.164Z] For more on test execution, please refer to https://docs.gradle.org/8.6/userguide/java_testing.html#sec:test_execution in the Gradle documentation.
[2024-03-09T00:13:23.164Z]
[2024-03-09T00:13:23.164Z] * Try:
[2024-03-09T00:13:23.164Z] > Run with --stacktrace option to get the stack trace.
[2024-03-09T00:13:23.164Z] > Run with --info or --debug option to get more log output.
[2024-03-09T00:13:23.164Z] > Get more help at https://help.gradle.org.
[2024-03-09T00:13:23.164Z] ==============================================================================
[2024-03-09T00:13:23.164Z]
[2024-03-09T00:13:23.164Z] Deprecated Gradle features were used in this build, making it incompatible with Gradle 9.0.
[2024-03-09T00:13:23.164Z]
[2024-03-09T00:13:23.164Z] You can use '--warning-mode all' to show the individual deprecation warnings and determine if they come from your own scripts or plugins.
[2024-03-09T00:13:23.164Z]
[2024-03-09T00:13:23.164Z] For more on this, please refer to https://docs.gradle.org/8.6/userguide/command_line_interface.html#sec:command_line_warnings in the Gradle documentation.
[2024-03-09T00:13:23.164Z]
[2024-03-09T00:13:23.164Z] BUILD FAILED in 6h 7m 30s
[2024-03-09T00:13:23.164Z] 321 actionable tasks: 119 executed, 202 up-to-date
[2024-03-09T00:13:23.164Z]
[2024-03-09T00:13:23.164Z] Publishing build scan...
[2024-03-09T00:13:25.983Z] https://ge.apache.org/s/q6aeg2hbrf2ss
[2024-03-09T00:13:25.983Z]
[2024-03-09T00:13:25.983Z]
[2024-03-09T00:13:25.983Z] See the profiling report at: file:///home/jenkins/jenkins-agent/712657a4/workspace/Kafka_kafka_trunk/build/reports/profile/profile-2024-03-08-18-05-57.html
[2024-03-09T00:13:25.983Z] A fine-grained performance profile is available: use the --scan option.
[Pipeline] }
[Pipeline] // withEnv
[Pipeline] }
[Pipeline] // withEnv
[Pipeline] }
[Pipeline] // withEnv
[Pipeline] }
[Pipeline] // node
[Pipeline] }
[Pipeline] // timestamps
[Pipeline] }
[Pipeline] // timeout
[Pipeline] }
[Pipeline] // stage
[Pipeline] }
Failed in branch JDK 11 and Scala 2.13
[Pipeline] // parallel
[Pipeline] }
[Pipeline] // stage
[Pipeline] stage
[Pipeline] { (Declarative: Post Actions)
[Pipeline] script
[Pipeline] {
[Pipeline] node
Still waiting to schedule task
Waiting for next available executor on ‘ubuntu’
Running on builds47 in /home/jenkins/jenkins-agent/workspace/Kafka_kafka_trunk
[Pipeline] {
[Pipeline] step
Jenkins build is still unstable: Kafka » Kafka Branch Builder » trunk #2709
Posted by Apache Jenkins Server <je...@builds.apache.org>.
See <https://ci-builds.apache.org/job/Kafka/job/kafka/job/trunk/2709/display/redirect>
Jenkins build is still unstable: Kafka » Kafka Branch Builder » trunk #2708
Posted by Apache Jenkins Server <je...@builds.apache.org>.
See <https://ci-builds.apache.org/job/Kafka/job/kafka/job/trunk/2708/display/redirect>
Jenkins build is unstable: Kafka » Kafka Branch Builder » trunk #2707
Posted by Apache Jenkins Server <je...@builds.apache.org>.
See <https://ci-builds.apache.org/job/Kafka/job/kafka/job/trunk/2707/display/redirect>
Build failed in Jenkins: Kafka » Kafka Branch Builder » trunk #2706
Posted by Apache Jenkins Server <je...@builds.apache.org>.
See <https://ci-builds.apache.org/job/Kafka/job/kafka/job/trunk/2706/display/redirect>
Changes:
------------------------------------------
[...truncated 453303 lines...]
[2024-03-07T15:22:23.259Z] > Task :server:compileTestJava
[2024-03-07T15:22:23.259Z] > Task :server:testClasses
[2024-03-07T15:22:24.360Z] > Task :server-common:compileTestJava
[2024-03-07T15:22:24.360Z] > Task :server-common:testClasses
[2024-03-07T15:22:26.547Z] > Task :raft:compileTestJava
[2024-03-07T15:22:26.547Z] > Task :raft:testClasses
[2024-03-07T15:22:28.629Z]
[2024-03-07T15:22:28.629Z] > Task :clients:javadoc
[2024-03-07T15:22:28.629Z] /home/jenkins/jenkins-agent/workspace/Kafka_kafka_trunk/clients/src/main/java/org/apache/kafka/clients/admin/ScramMechanism.java:32: warning - Tag @see: missing final '>': "<a href="https://cwiki.apache.org/confluence/display/KAFKA/KIP-554%3A+Add+Broker-side+SCRAM+Config+API">KIP-554: Add Broker-side SCRAM Config API</a>
[2024-03-07T15:22:28.629Z]
[2024-03-07T15:22:28.629Z] This code is duplicated in org.apache.kafka.common.security.scram.internals.ScramMechanism.
[2024-03-07T15:22:28.629Z] The type field in both files must match and must not change. The type field
[2024-03-07T15:22:28.629Z] is used both for passing ScramCredentialUpsertion and for the internal
[2024-03-07T15:22:28.629Z] UserScramCredentialRecord. Do not change the type field."
[2024-03-07T15:22:29.729Z]
[2024-03-07T15:22:29.729Z] > Task :core:compileScala
[2024-03-07T15:22:30.830Z] > Task :group-coordinator:compileTestJava
[2024-03-07T15:22:30.830Z] > Task :group-coordinator:testClasses
[2024-03-07T15:22:30.830Z] > Task :streams:generateMetadataFileForMavenJavaPublication
[2024-03-07T15:22:32.420Z]
[2024-03-07T15:22:32.420Z] > Task :clients:javadoc
[2024-03-07T15:22:32.420Z] /home/jenkins/jenkins-agent/workspace/Kafka_kafka_trunk/clients/src/main/java/org/apache/kafka/common/security/oauthbearer/secured/package-info.java:21: warning - Tag @link: reference not found: org.apache.kafka.common.security.oauthbearer
[2024-03-07T15:22:32.420Z] 2 warnings
[2024-03-07T15:22:32.420Z]
[2024-03-07T15:22:32.420Z] > Task :clients:javadocJar
[2024-03-07T15:22:32.420Z] > Task :clients:srcJar
[2024-03-07T15:22:33.553Z] > Task :clients:testJar
[2024-03-07T15:22:33.553Z] > Task :clients:testSrcJar
[2024-03-07T15:22:33.553Z] > Task :clients:publishMavenJavaPublicationToMavenLocal
[2024-03-07T15:22:33.553Z] > Task :clients:publishToMavenLocal
[2024-03-07T15:22:33.553Z] > Task :connect:api:generateMetadataFileForMavenJavaPublication
[2024-03-07T15:22:33.553Z] > Task :connect:api:compileTestJava UP-TO-DATE
[2024-03-07T15:22:33.553Z] > Task :connect:api:testClasses UP-TO-DATE
[2024-03-07T15:22:33.553Z] > Task :connect:api:testJar
[2024-03-07T15:22:33.553Z] > Task :connect:api:testSrcJar
[2024-03-07T15:22:33.553Z] > Task :connect:api:publishMavenJavaPublicationToMavenLocal
[2024-03-07T15:22:33.553Z] > Task :connect:api:publishToMavenLocal
[2024-03-07T15:22:34.768Z] > Task :metadata:compileTestJava
[2024-03-07T15:22:34.768Z] > Task :metadata:testClasses
[2024-03-07T15:22:39.414Z] > Task :streams:javadoc
[2024-03-07T15:22:39.414Z] > Task :streams:javadocJar
[2024-03-07T15:22:40.580Z] > Task :streams:srcJar
[2024-03-07T15:22:40.580Z] > Task :streams:processTestResources UP-TO-DATE
[2024-03-07T15:23:29.364Z] > Task :core:classes
[2024-03-07T15:23:29.364Z] > Task :core:compileTestJava NO-SOURCE
[2024-03-07T15:23:58.148Z] > Task :core:compileTestScala
[2024-03-07T15:25:05.862Z] > Task :core:testClasses
[2024-03-07T15:25:30.688Z] > Task :streams:compileTestJava
[2024-03-07T15:27:05.313Z] > Task :streams:testClasses
[2024-03-07T15:27:05.313Z] > Task :streams:testJar
[2024-03-07T15:27:05.313Z] > Task :streams:testSrcJar
[2024-03-07T15:27:05.313Z] > Task :streams:publishMavenJavaPublicationToMavenLocal
[2024-03-07T15:27:05.313Z] > Task :streams:publishToMavenLocal
[2024-03-07T15:27:05.313Z]
[2024-03-07T15:27:05.313Z] Deprecated Gradle features were used in this build, making it incompatible with Gradle 9.0.
[2024-03-07T15:27:05.313Z]
[2024-03-07T15:27:05.313Z] You can use '--warning-mode all' to show the individual deprecation warnings and determine if they come from your own scripts or plugins.
[2024-03-07T15:27:05.313Z]
[2024-03-07T15:27:05.313Z] For more on this, please refer to https://docs.gradle.org/8.6/userguide/command_line_interface.html#sec:command_line_warnings in the Gradle documentation.
[2024-03-07T15:27:05.313Z]
[2024-03-07T15:27:05.313Z] BUILD SUCCESSFUL in 5m 24s
[2024-03-07T15:27:05.313Z] 96 actionable tasks: 41 executed, 55 up-to-date
[2024-03-07T15:27:05.313Z]
[2024-03-07T15:27:05.313Z] Publishing build scan...
[2024-03-07T15:27:05.313Z] https://ge.apache.org/s/n2jijyo6pijxi
[2024-03-07T15:27:05.313Z]
[Pipeline] sh
[2024-03-07T15:27:08.876Z] + grep ^version= gradle.properties
[2024-03-07T15:27:08.876Z] + cut -d= -f 2
[Pipeline] dir
[2024-03-07T15:27:09.760Z] Running in /home/jenkins/jenkins-agent/workspace/Kafka_kafka_trunk/streams/quickstart
[Pipeline] {
[Pipeline] sh
[2024-03-07T15:27:12.130Z] + mvn clean install -Dgpg.skip
[2024-03-07T15:27:13.405Z] [INFO] Scanning for projects...
[2024-03-07T15:27:14.814Z] [INFO] ------------------------------------------------------------------------
[2024-03-07T15:27:14.814Z] [INFO] Reactor Build Order:
[2024-03-07T15:27:14.814Z] [INFO]
[2024-03-07T15:27:14.814Z] [INFO] Kafka Streams :: Quickstart [pom]
[2024-03-07T15:27:14.814Z] [INFO] streams-quickstart-java [maven-archetype]
[2024-03-07T15:27:14.814Z] [INFO]
[2024-03-07T15:27:14.814Z] [INFO] ----------------< org.apache.kafka:streams-quickstart >-----------------
[2024-03-07T15:27:14.814Z] [INFO] Building Kafka Streams :: Quickstart 3.8.0-SNAPSHOT [1/2]
[2024-03-07T15:27:14.814Z] [INFO] from pom.xml
[2024-03-07T15:27:14.814Z] [INFO] --------------------------------[ pom ]---------------------------------
[2024-03-07T15:27:14.814Z] [INFO]
[2024-03-07T15:27:14.814Z] [INFO] --- clean:3.0.0:clean (default-clean) @ streams-quickstart ---
[2024-03-07T15:27:14.814Z] [INFO]
[2024-03-07T15:27:14.814Z] [INFO] --- remote-resources:1.5:process (process-resource-bundles) @ streams-quickstart ---
[2024-03-07T15:27:14.814Z] [INFO]
[2024-03-07T15:27:14.814Z] [INFO] --- site:3.5.1:attach-descriptor (attach-descriptor) @ streams-quickstart ---
[2024-03-07T15:27:15.945Z] [INFO]
[2024-03-07T15:27:15.945Z] [INFO] --- gpg:1.6:sign (sign-artifacts) @ streams-quickstart ---
[2024-03-07T15:27:15.945Z] [INFO]
[2024-03-07T15:27:15.945Z] [INFO] --- install:2.5.2:install (default-install) @ streams-quickstart ---
[2024-03-07T15:27:15.945Z] [INFO] Installing /home/jenkins/jenkins-agent/workspace/Kafka_kafka_trunk/streams/quickstart/pom.xml to /home/jenkins/.m2/repository/org/apache/kafka/streams-quickstart/3.8.0-SNAPSHOT/streams-quickstart-3.8.0-SNAPSHOT.pom
[2024-03-07T15:27:15.945Z] [INFO]
[2024-03-07T15:27:15.945Z] [INFO] --------------< org.apache.kafka:streams-quickstart-java >--------------
[2024-03-07T15:27:15.945Z] [INFO] Building streams-quickstart-java 3.8.0-SNAPSHOT [2/2]
[2024-03-07T15:27:15.945Z] [INFO] from java/pom.xml
[2024-03-07T15:27:15.945Z] [INFO] --------------------------[ maven-archetype ]---------------------------
[2024-03-07T15:27:15.945Z] [INFO]
[2024-03-07T15:27:15.945Z] [INFO] --- clean:3.0.0:clean (default-clean) @ streams-quickstart-java ---
[2024-03-07T15:27:15.945Z] [INFO]
[2024-03-07T15:27:15.945Z] [INFO] --- remote-resources:1.5:process (process-resource-bundles) @ streams-quickstart-java ---
[2024-03-07T15:27:15.945Z] [INFO]
[2024-03-07T15:27:15.945Z] [INFO] --- resources:2.7:resources (default-resources) @ streams-quickstart-java ---
[2024-03-07T15:27:15.945Z] [INFO] Using 'UTF-8' encoding to copy filtered resources.
[2024-03-07T15:27:15.945Z] [INFO] Copying 6 resources
[2024-03-07T15:27:15.945Z] [INFO] Copying 3 resources
[2024-03-07T15:27:15.945Z] [INFO]
[2024-03-07T15:27:15.945Z] [INFO] --- resources:2.7:testResources (default-testResources) @ streams-quickstart-java ---
[2024-03-07T15:27:15.945Z] [INFO] Using 'UTF-8' encoding to copy filtered resources.
[2024-03-07T15:27:15.945Z] [INFO] Copying 2 resources
[2024-03-07T15:27:15.945Z] [INFO] Copying 3 resources
[2024-03-07T15:27:15.945Z] [INFO]
[2024-03-07T15:27:15.945Z] [INFO] --- archetype:2.2:jar (default-jar) @ streams-quickstart-java ---
[2024-03-07T15:27:16.651Z] [INFO] Building archetype jar: /home/jenkins/jenkins-agent/workspace/Kafka_kafka_trunk/streams/quickstart/java/target/streams-quickstart-java-3.8.0-SNAPSHOT
[2024-03-07T15:27:16.651Z] [INFO]
[2024-03-07T15:27:16.651Z] [INFO] --- site:3.5.1:attach-descriptor (attach-descriptor) @ streams-quickstart-java ---
[2024-03-07T15:27:16.651Z] [INFO]
[2024-03-07T15:27:16.651Z] [INFO] --- archetype:2.2:integration-test (default-integration-test) @ streams-quickstart-java ---
[2024-03-07T15:27:16.651Z] [WARNING] Parameter 'skip' (user property 'archetype.test.skip') is read-only, must not be used in configuration
[2024-03-07T15:27:16.651Z] [INFO]
[2024-03-07T15:27:16.651Z] [INFO] --- gpg:1.6:sign (sign-artifacts) @ streams-quickstart-java ---
[2024-03-07T15:27:16.651Z] [INFO]
[2024-03-07T15:27:16.651Z] [INFO] --- install:2.5.2:install (default-install) @ streams-quickstart-java ---
[2024-03-07T15:27:16.651Z] [INFO] Installing /home/jenkins/jenkins-agent/workspace/Kafka_kafka_trunk/streams/quickstart/java/target/streams-quickstart-java-3.8.0-SNAPSHOT.jar to /home/jenkins/.m2/repository/org/apache/kafka/streams-quickstart-java/3.8.0-SNAPSHOT/streams-quickstart-java-3.8.0-SNAPSHOT.jar
[2024-03-07T15:27:16.651Z] [INFO] Installing /home/jenkins/jenkins-agent/workspace/Kafka_kafka_trunk/streams/quickstart/java/pom.xml to /home/jenkins/.m2/repository/org/apache/kafka/streams-quickstart-java/3.8.0-SNAPSHOT/streams-quickstart-java-3.8.0-SNAPSHOT.pom
[2024-03-07T15:27:16.651Z] [INFO]
[2024-03-07T15:27:16.651Z] [INFO] --- archetype:2.2:update-local-catalog (default-update-local-catalog) @ streams-quickstart-java ---
[2024-03-07T15:27:16.651Z] [INFO] ------------------------------------------------------------------------
[2024-03-07T15:27:16.651Z] [INFO] Reactor Summary for Kafka Streams :: Quickstart 3.8.0-SNAPSHOT:
[2024-03-07T15:27:16.651Z] [INFO]
[2024-03-07T15:27:16.651Z] [INFO] Kafka Streams :: Quickstart ........................ SUCCESS [ 2.035 s]
[2024-03-07T15:27:16.651Z] [INFO] streams-quickstart-java ............................ SUCCESS [ 0.617 s]
[2024-03-07T15:27:16.651Z] [INFO] ------------------------------------------------------------------------
[2024-03-07T15:27:16.651Z] [INFO] BUILD SUCCESS
[2024-03-07T15:27:16.651Z] [INFO] ------------------------------------------------------------------------
[2024-03-07T15:27:16.651Z] [INFO] Total time: 3.030 s
[2024-03-07T15:27:16.651Z] [INFO] Finished at: 2024-03-07T15:27:16Z
[2024-03-07T15:27:16.651Z] [INFO] ------------------------------------------------------------------------
[Pipeline] dir
[2024-03-07T15:27:16.652Z] Running in /home/jenkins/jenkins-agent/workspace/Kafka_kafka_trunk/streams/quickstart/test-streams-archetype
[Pipeline] {
[Pipeline] sh
[2024-03-07T15:27:18.922Z] + echo Y
[2024-03-07T15:27:18.922Z] + mvn archetype:generate -DarchetypeCatalog=local -DarchetypeGroupId=org.apache.kafka -DarchetypeArtifactId=streams-quickstart-java -DarchetypeVersion=3.8.0-SNAPSHOT -DgroupId=streams.examples -DartifactId=streams.examples -Dversion=0.1 -Dpackage=myapps
[2024-03-07T15:27:21.089Z] [INFO] Scanning for projects...
[2024-03-07T15:27:21.089Z] [INFO]
[2024-03-07T15:27:21.089Z] [INFO] ------------------< org.apache.maven:standalone-pom >-------------------
[2024-03-07T15:27:21.089Z] [INFO] Building Maven Stub Project (No POM) 1
[2024-03-07T15:27:21.089Z] [INFO] --------------------------------[ pom ]---------------------------------
[2024-03-07T15:27:21.089Z] [INFO]
[2024-03-07T15:27:21.089Z] [INFO] >>> archetype:3.2.1:generate (default-cli) > generate-sources @ standalone-pom >>>
[2024-03-07T15:27:21.089Z] [INFO]
[2024-03-07T15:27:21.089Z] [INFO] <<< archetype:3.2.1:generate (default-cli) < generate-sources @ standalone-pom <<<
[2024-03-07T15:27:21.089Z] [INFO]
[2024-03-07T15:27:21.089Z] [INFO]
[2024-03-07T15:27:21.089Z] [INFO] --- archetype:3.2.1:generate (default-cli) @ standalone-pom ---
[2024-03-07T15:27:22.360Z] [INFO] Generating project in Interactive mode
[2024-03-07T15:27:22.360Z] [WARNING] Archetype not found in any catalog. Falling back to central repository.
[2024-03-07T15:27:22.360Z] [WARNING] Add a repository with id 'archetype' in your settings.xml if archetype's repository is elsewhere.
[2024-03-07T15:27:22.360Z] [INFO] Using property: groupId = streams.examples
[2024-03-07T15:27:22.360Z] [INFO] Using property: artifactId = streams.examples
[2024-03-07T15:27:22.360Z] [INFO] Using property: version = 0.1
[2024-03-07T15:27:22.360Z] [INFO] Using property: package = myapps
[2024-03-07T15:27:22.360Z] Confirm properties configuration:
[2024-03-07T15:27:22.360Z] groupId: streams.examples
[2024-03-07T15:27:22.360Z] artifactId: streams.examples
[2024-03-07T15:27:22.360Z] version: 0.1
[2024-03-07T15:27:22.360Z] package: myapps
[2024-03-07T15:27:22.360Z] Y: : [INFO] ----------------------------------------------------------------------------
[2024-03-07T15:27:22.360Z] [INFO] Using following parameters for creating project from Archetype: streams-quickstart-java:3.8.0-SNAPSHOT
[2024-03-07T15:27:22.360Z] [INFO] ----------------------------------------------------------------------------
[2024-03-07T15:27:22.360Z] [INFO] Parameter: groupId, Value: streams.examples
[2024-03-07T15:27:22.360Z] [INFO] Parameter: artifactId, Value: streams.examples
[2024-03-07T15:27:22.360Z] [INFO] Parameter: version, Value: 0.1
[2024-03-07T15:27:22.360Z] [INFO] Parameter: package, Value: myapps
[2024-03-07T15:27:22.360Z] [INFO] Parameter: packageInPathFormat, Value: myapps
[2024-03-07T15:27:22.360Z] [INFO] Parameter: package, Value: myapps
[2024-03-07T15:27:22.360Z] [INFO] Parameter: version, Value: 0.1
[2024-03-07T15:27:22.360Z] [INFO] Parameter: groupId, Value: streams.examples
[2024-03-07T15:27:22.360Z] [INFO] Parameter: artifactId, Value: streams.examples
[2024-03-07T15:27:22.360Z] [INFO] Project created from Archetype in dir: /home/jenkins/jenkins-agent/workspace/Kafka_kafka_trunk/streams/quickstart/test-streams-archetype/streams.examples
[2024-03-07T15:27:22.360Z] [INFO] ------------------------------------------------------------------------
[2024-03-07T15:27:22.360Z] [INFO] BUILD SUCCESS
[2024-03-07T15:27:22.360Z] [INFO] ------------------------------------------------------------------------
[2024-03-07T15:27:22.360Z] [INFO] Total time: 1.787 s
[2024-03-07T15:27:22.360Z] [INFO] Finished at: 2024-03-07T15:27:21Z
[2024-03-07T15:27:22.360Z] [INFO] ------------------------------------------------------------------------
[Pipeline] dir
[2024-03-07T15:27:23.415Z] Running in /home/jenkins/jenkins-agent/workspace/Kafka_kafka_trunk/streams/quickstart/test-streams-archetype/streams.examples
[Pipeline] {
[Pipeline] sh
[2024-03-07T15:27:26.707Z] + mvn compile
[2024-03-07T15:27:28.116Z] [INFO] Scanning for projects...
[2024-03-07T15:27:28.116Z] [INFO]
[2024-03-07T15:27:28.116Z] [INFO] -----------------< streams.examples:streams.examples >------------------
[2024-03-07T15:27:28.116Z] [INFO] Building Kafka Streams Quickstart :: Java 0.1
[2024-03-07T15:27:28.116Z] [INFO] from pom.xml
[2024-03-07T15:27:28.116Z] [INFO] --------------------------------[ jar ]---------------------------------
[2024-03-07T15:27:28.116Z] [INFO]
[2024-03-07T15:27:28.116Z] [INFO] --- resources:3.3.1:resources (default-resources) @ streams.examples ---
[2024-03-07T15:27:28.116Z] [INFO] Copying 1 resource from src/main/resources to target/classes
[2024-03-07T15:27:28.116Z] [INFO]
[2024-03-07T15:27:28.116Z] [INFO] --- compiler:3.1:compile (default-compile) @ streams.examples ---
[2024-03-07T15:27:29.526Z] [INFO] Changes detected - recompiling the module!
[2024-03-07T15:27:29.526Z] [INFO] Compiling 3 source files to /home/jenkins/jenkins-agent/workspace/Kafka_kafka_trunk/streams/quickstart/test-streams-archetype/streams.examples/target/classes
[2024-03-07T15:27:29.526Z] [INFO] ------------------------------------------------------------------------
[2024-03-07T15:27:29.526Z] [INFO] BUILD SUCCESS
[2024-03-07T15:27:29.526Z] [INFO] ------------------------------------------------------------------------
[2024-03-07T15:27:29.526Z] [INFO] Total time: 2.154 s
[2024-03-07T15:27:29.526Z] [INFO] Finished at: 2024-03-07T15:27:29Z
[2024-03-07T15:27:29.526Z] [INFO] ------------------------------------------------------------------------
[Pipeline] }
[Pipeline] // dir
[Pipeline] }
[Pipeline] // dir
[Pipeline] }
[Pipeline] // dir
[Pipeline] }
[Pipeline] // withEnv
[Pipeline] }
[Pipeline] // withEnv
[Pipeline] }
[Pipeline] // withEnv
[Pipeline] }
[Pipeline] // node
[Pipeline] }
[Pipeline] // timestamps
[Pipeline] }
[Pipeline] // timeout
[Pipeline] }
[Pipeline] // stage
[Pipeline] }
[Pipeline] // parallel
[Pipeline] }
[Pipeline] // stage
[Pipeline] stage
[Pipeline] { (Declarative: Post Actions)
[Pipeline] script
[Pipeline] {
[Pipeline] node
Still waiting to schedule task
Waiting for next available executor on ‘ubuntu’
Running on builds32 in /home/jenkins/jenkins-agent/workspace/Kafka_kafka_trunk
[Pipeline] {
[Pipeline] step
Jenkins build is still unstable: Kafka » Kafka Branch Builder » trunk #2705
Posted by Apache Jenkins Server <je...@builds.apache.org>.
See <https://ci-builds.apache.org/job/Kafka/job/kafka/job/trunk/2705/display/redirect>
Jenkins build is still unstable: Kafka » Kafka Branch Builder » trunk #2704
Posted by Apache Jenkins Server <je...@builds.apache.org>.
See <https://ci-builds.apache.org/job/Kafka/job/kafka/job/trunk/2704/display/redirect>