You are viewing a plain text version of this content. The canonical link for it is here.
Posted to dev@lucene.apache.org by Policeman Jenkins Server <je...@thetaphi.de> on 2018/09/20 11:21:34 UTC

[JENKINS] Lucene-Solr-7.x-Linux (64bit/jdk1.8.0_172) - Build # 2776 - Unstable!

Build: https://jenkins.thetaphi.de/job/Lucene-Solr-7.x-Linux/2776/
Java: 64bit/jdk1.8.0_172 -XX:-UseCompressedOops -XX:+UseConcMarkSweepGC

1 tests failed.
FAILED:  org.apache.solr.cloud.TestWithCollection.testAddReplicaWithPolicy

Error Message:
Error from server at https://127.0.0.1:43629/solr: Collection: testMoveReplicaMainCollection_abc is co-located with collection: testMoveReplicaMainCollection_xyz remove the link using modify collection API or delete the co-located collection: testMoveReplicaMainCollection_xyz

Stack Trace:
org.apache.solr.client.solrj.impl.HttpSolrClient$RemoteSolrException: Error from server at https://127.0.0.1:43629/solr: Collection: testMoveReplicaMainCollection_abc is co-located with collection: testMoveReplicaMainCollection_xyz remove the link using modify collection API or delete the co-located collection: testMoveReplicaMainCollection_xyz
	at __randomizedtesting.SeedInfo.seed([AEBD9C0133E3AE84:35E7555B94AB3108]:0)
	at org.apache.solr.client.solrj.impl.HttpSolrClient.executeMethod(HttpSolrClient.java:643)
	at org.apache.solr.client.solrj.impl.HttpSolrClient.request(HttpSolrClient.java:255)
	at org.apache.solr.client.solrj.impl.HttpSolrClient.request(HttpSolrClient.java:244)
	at org.apache.solr.client.solrj.impl.LBHttpSolrClient.doRequest(LBHttpSolrClient.java:483)
	at org.apache.solr.client.solrj.impl.LBHttpSolrClient.request(LBHttpSolrClient.java:413)
	at org.apache.solr.client.solrj.impl.CloudSolrClient.sendRequest(CloudSolrClient.java:1107)
	at org.apache.solr.client.solrj.impl.CloudSolrClient.requestWithRetryOnStaleState(CloudSolrClient.java:884)
	at org.apache.solr.client.solrj.impl.CloudSolrClient.request(CloudSolrClient.java:817)
	at org.apache.solr.client.solrj.SolrRequest.process(SolrRequest.java:194)
	at org.apache.solr.client.solrj.SolrRequest.process(SolrRequest.java:211)
	at org.apache.solr.cloud.MiniSolrCloudCluster.deleteAllCollections(MiniSolrCloudCluster.java:461)
	at org.apache.solr.cloud.TestWithCollection.setUp(TestWithCollection.java:94)
	at sun.reflect.GeneratedMethodAccessor36.invoke(Unknown Source)
	at sun.reflect.DelegatingMethodAccessorImpl.invoke(DelegatingMethodAccessorImpl.java:43)
	at java.lang.reflect.Method.invoke(Method.java:498)
	at com.carrotsearch.randomizedtesting.RandomizedRunner.invoke(RandomizedRunner.java:1742)
	at com.carrotsearch.randomizedtesting.RandomizedRunner$9.evaluate(RandomizedRunner.java:969)
	at com.carrotsearch.randomizedtesting.RandomizedRunner$10.evaluate(RandomizedRunner.java:985)
	at com.carrotsearch.randomizedtesting.rules.SystemPropertiesRestoreRule$1.evaluate(SystemPropertiesRestoreRule.java:57)
	at org.apache.lucene.util.TestRuleSetupTeardownChained$1.evaluate(TestRuleSetupTeardownChained.java:49)
	at org.apache.lucene.util.AbstractBeforeAfterRule$1.evaluate(AbstractBeforeAfterRule.java:45)
	at org.apache.lucene.util.TestRuleThreadAndTestName$1.evaluate(TestRuleThreadAndTestName.java:48)
	at org.apache.lucene.util.TestRuleIgnoreAfterMaxFailures$1.evaluate(TestRuleIgnoreAfterMaxFailures.java:64)
	at org.apache.lucene.util.TestRuleMarkFailure$1.evaluate(TestRuleMarkFailure.java:47)
	at com.carrotsearch.randomizedtesting.rules.StatementAdapter.evaluate(StatementAdapter.java:36)
	at com.carrotsearch.randomizedtesting.ThreadLeakControl$StatementRunner.run(ThreadLeakControl.java:368)
	at com.carrotsearch.randomizedtesting.ThreadLeakControl.forkTimeoutingTask(ThreadLeakControl.java:817)
	at com.carrotsearch.randomizedtesting.ThreadLeakControl$3.evaluate(ThreadLeakControl.java:468)
	at com.carrotsearch.randomizedtesting.RandomizedRunner.runSingleTest(RandomizedRunner.java:944)
	at com.carrotsearch.randomizedtesting.RandomizedRunner$5.evaluate(RandomizedRunner.java:830)
	at com.carrotsearch.randomizedtesting.RandomizedRunner$6.evaluate(RandomizedRunner.java:880)
	at com.carrotsearch.randomizedtesting.RandomizedRunner$7.evaluate(RandomizedRunner.java:891)
	at com.carrotsearch.randomizedtesting.rules.StatementAdapter.evaluate(StatementAdapter.java:36)
	at com.carrotsearch.randomizedtesting.rules.SystemPropertiesRestoreRule$1.evaluate(SystemPropertiesRestoreRule.java:57)
	at org.apache.lucene.util.AbstractBeforeAfterRule$1.evaluate(AbstractBeforeAfterRule.java:45)
	at com.carrotsearch.randomizedtesting.rules.StatementAdapter.evaluate(StatementAdapter.java:36)
	at org.apache.lucene.util.TestRuleStoreClassName$1.evaluate(TestRuleStoreClassName.java:41)
	at com.carrotsearch.randomizedtesting.rules.NoShadowingOrOverridesOnMethodsRule$1.evaluate(NoShadowingOrOverridesOnMethodsRule.java:40)
	at com.carrotsearch.randomizedtesting.rules.NoShadowingOrOverridesOnMethodsRule$1.evaluate(NoShadowingOrOverridesOnMethodsRule.java:40)
	at com.carrotsearch.randomizedtesting.rules.StatementAdapter.evaluate(StatementAdapter.java:36)
	at com.carrotsearch.randomizedtesting.rules.StatementAdapter.evaluate(StatementAdapter.java:36)
	at com.carrotsearch.randomizedtesting.rules.StatementAdapter.evaluate(StatementAdapter.java:36)
	at org.apache.lucene.util.TestRuleAssertionsRequired$1.evaluate(TestRuleAssertionsRequired.java:53)
	at org.apache.lucene.util.TestRuleMarkFailure$1.evaluate(TestRuleMarkFailure.java:47)
	at org.apache.lucene.util.TestRuleIgnoreAfterMaxFailures$1.evaluate(TestRuleIgnoreAfterMaxFailures.java:64)
	at org.apache.lucene.util.TestRuleIgnoreTestSuites$1.evaluate(TestRuleIgnoreTestSuites.java:54)
	at com.carrotsearch.randomizedtesting.rules.StatementAdapter.evaluate(StatementAdapter.java:36)
	at com.carrotsearch.randomizedtesting.ThreadLeakControl$StatementRunner.run(ThreadLeakControl.java:368)
	at java.lang.Thread.run(Thread.java:748)




Build Log:
[...truncated 14219 lines...]
   [junit4] Suite: org.apache.solr.cloud.TestWithCollection
   [junit4]   2> 1962742 INFO  (SUITE-TestWithCollection-seed#[AEBD9C0133E3AE84]-worker) [    ] o.a.s.SolrTestCaseJ4 SecureRandom sanity checks: test.solr.allowed.securerandom=null & java.security.egd=file:/dev/./urandom
   [junit4]   2> Creating dataDir: /home/jenkins/workspace/Lucene-Solr-7.x-Linux/solr/build/solr-core/test/J0/temp/solr.cloud.TestWithCollection_AEBD9C0133E3AE84-001/init-core-data-001
   [junit4]   2> 1962743 WARN  (SUITE-TestWithCollection-seed#[AEBD9C0133E3AE84]-worker) [    ] o.a.s.SolrTestCaseJ4 startTrackingSearchers: numOpens=616 numCloses=616
   [junit4]   2> 1962744 INFO  (SUITE-TestWithCollection-seed#[AEBD9C0133E3AE84]-worker) [    ] o.a.s.SolrTestCaseJ4 Using PointFields (NUMERIC_POINTS_SYSPROP=true) w/NUMERIC_DOCVALUES_SYSPROP=false
   [junit4]   2> 1962745 INFO  (SUITE-TestWithCollection-seed#[AEBD9C0133E3AE84]-worker) [    ] o.a.s.SolrTestCaseJ4 Randomized ssl (true) and clientAuth (true) via: @org.apache.solr.util.RandomizeSSL(reason=, ssl=NaN, value=NaN, clientAuth=NaN)
   [junit4]   2> 1962745 INFO  (SUITE-TestWithCollection-seed#[AEBD9C0133E3AE84]-worker) [    ] o.a.s.c.MiniSolrCloudCluster Starting cluster of 2 servers in /home/jenkins/workspace/Lucene-Solr-7.x-Linux/solr/build/solr-core/test/J0/temp/solr.cloud.TestWithCollection_AEBD9C0133E3AE84-001/tempDir-001
   [junit4]   2> 1962746 INFO  (SUITE-TestWithCollection-seed#[AEBD9C0133E3AE84]-worker) [    ] o.a.s.c.ZkTestServer STARTING ZK TEST SERVER
   [junit4]   2> 1962746 INFO  (Thread-4765) [    ] o.a.s.c.ZkTestServer client port:0.0.0.0/0.0.0.0:0
   [junit4]   2> 1962746 INFO  (Thread-4765) [    ] o.a.s.c.ZkTestServer Starting server
   [junit4]   2> 1962748 ERROR (Thread-4765) [    ] o.a.z.s.ZooKeeperServer ZKShutdownHandler is not registered, so ZooKeeper server won't take any action on ERROR or SHUTDOWN server state changes
   [junit4]   2> 1962846 INFO  (SUITE-TestWithCollection-seed#[AEBD9C0133E3AE84]-worker) [    ] o.a.s.c.ZkTestServer start zk server on port:32899
   [junit4]   2> 1962848 INFO  (zkConnectionManagerCallback-5316-thread-1) [    ] o.a.s.c.c.ConnectionManager zkClient has connected
   [junit4]   2> 1962856 INFO  (jetty-launcher-5313-thread-1) [    ] o.e.j.s.Server jetty-9.4.11.v20180605; built: 2018-06-05T18:24:03.829Z; git: d5fc0523cfa96bfebfbda19606cad384d772f04c; jvm 1.8.0_172-b11
   [junit4]   2> 1962857 INFO  (jetty-launcher-5313-thread-2) [    ] o.e.j.s.Server jetty-9.4.11.v20180605; built: 2018-06-05T18:24:03.829Z; git: d5fc0523cfa96bfebfbda19606cad384d772f04c; jvm 1.8.0_172-b11
   [junit4]   2> 1962893 INFO  (jetty-launcher-5313-thread-1) [    ] o.e.j.s.session DefaultSessionIdManager workerName=node0
   [junit4]   2> 1962893 INFO  (jetty-launcher-5313-thread-1) [    ] o.e.j.s.session No SessionScavenger set, using defaults
   [junit4]   2> 1962893 INFO  (jetty-launcher-5313-thread-1) [    ] o.e.j.s.session node0 Scavenging every 660000ms
   [junit4]   2> 1962893 INFO  (jetty-launcher-5313-thread-2) [    ] o.e.j.s.session DefaultSessionIdManager workerName=node0
   [junit4]   2> 1962894 INFO  (jetty-launcher-5313-thread-2) [    ] o.e.j.s.session No SessionScavenger set, using defaults
   [junit4]   2> 1962894 INFO  (jetty-launcher-5313-thread-2) [    ] o.e.j.s.session node0 Scavenging every 600000ms
   [junit4]   2> 1962894 INFO  (jetty-launcher-5313-thread-1) [    ] o.e.j.s.h.ContextHandler Started o.e.j.s.ServletContextHandler@1a9bce60{/solr,null,AVAILABLE}
   [junit4]   2> 1962895 INFO  (jetty-launcher-5313-thread-2) [    ] o.e.j.s.h.ContextHandler Started o.e.j.s.ServletContextHandler@7c0c1333{/solr,null,AVAILABLE}
   [junit4]   2> 1962896 INFO  (jetty-launcher-5313-thread-1) [    ] o.e.j.s.AbstractConnector Started ServerConnector@15b23e8b{SSL,[ssl, http/1.1]}{127.0.0.1:44249}
   [junit4]   2> 1962896 INFO  (jetty-launcher-5313-thread-2) [    ] o.e.j.s.AbstractConnector Started ServerConnector@21eb061f{SSL,[ssl, http/1.1]}{127.0.0.1:43629}
   [junit4]   2> 1962896 INFO  (jetty-launcher-5313-thread-2) [    ] o.e.j.s.Server Started @1962931ms
   [junit4]   2> 1962896 INFO  (jetty-launcher-5313-thread-1) [    ] o.e.j.s.Server Started @1962931ms
   [junit4]   2> 1962896 INFO  (jetty-launcher-5313-thread-2) [    ] o.a.s.c.s.e.JettySolrRunner Jetty properties: {hostContext=/solr, hostPort=43629}
   [junit4]   2> 1962896 INFO  (jetty-launcher-5313-thread-1) [    ] o.a.s.c.s.e.JettySolrRunner Jetty properties: {hostContext=/solr, hostPort=44249}
   [junit4]   2> 1962896 ERROR (jetty-launcher-5313-thread-2) [    ] o.a.s.u.StartupLoggingUtils Missing Java Option solr.log.dir. Logging may be missing or incomplete.
   [junit4]   2> 1962896 ERROR (jetty-launcher-5313-thread-1) [    ] o.a.s.u.StartupLoggingUtils Missing Java Option solr.log.dir. Logging may be missing or incomplete.
   [junit4]   2> 1962896 INFO  (jetty-launcher-5313-thread-2) [    ] o.a.s.s.SolrDispatchFilter Using logger factory org.apache.logging.slf4j.Log4jLoggerFactory
   [junit4]   2> 1962896 INFO  (jetty-launcher-5313-thread-1) [    ] o.a.s.s.SolrDispatchFilter Using logger factory org.apache.logging.slf4j.Log4jLoggerFactory
   [junit4]   2> 1962896 INFO  (jetty-launcher-5313-thread-2) [    ] o.a.s.s.SolrDispatchFilter  ___      _       Welcome to Apache Solr? version 7.6.0
   [junit4]   2> 1962896 INFO  (jetty-launcher-5313-thread-1) [    ] o.a.s.s.SolrDispatchFilter  ___      _       Welcome to Apache Solr? version 7.6.0
   [junit4]   2> 1962896 INFO  (jetty-launcher-5313-thread-2) [    ] o.a.s.s.SolrDispatchFilter / __| ___| |_ _   Starting in cloud mode on port null
   [junit4]   2> 1962896 INFO  (jetty-launcher-5313-thread-1) [    ] o.a.s.s.SolrDispatchFilter / __| ___| |_ _   Starting in cloud mode on port null
   [junit4]   2> 1962896 INFO  (jetty-launcher-5313-thread-2) [    ] o.a.s.s.SolrDispatchFilter \__ \/ _ \ | '_|  Install dir: null
   [junit4]   2> 1962896 INFO  (jetty-launcher-5313-thread-1) [    ] o.a.s.s.SolrDispatchFilter \__ \/ _ \ | '_|  Install dir: null
   [junit4]   2> 1962896 INFO  (jetty-launcher-5313-thread-2) [    ] o.a.s.s.SolrDispatchFilter |___/\___/_|_|    Start time: 2018-09-20T10:44:16.757Z
   [junit4]   2> 1962896 INFO  (jetty-launcher-5313-thread-1) [    ] o.a.s.s.SolrDispatchFilter |___/\___/_|_|    Start time: 2018-09-20T10:44:16.757Z
   [junit4]   2> 1962906 INFO  (zkConnectionManagerCallback-5320-thread-1) [    ] o.a.s.c.c.ConnectionManager zkClient has connected
   [junit4]   2> 1962906 INFO  (zkConnectionManagerCallback-5319-thread-1) [    ] o.a.s.c.c.ConnectionManager zkClient has connected
   [junit4]   2> 1962907 INFO  (jetty-launcher-5313-thread-2) [    ] o.a.s.s.SolrDispatchFilter solr.xml found in ZooKeeper. Loading...
   [junit4]   2> 1962907 INFO  (jetty-launcher-5313-thread-1) [    ] o.a.s.s.SolrDispatchFilter solr.xml found in ZooKeeper. Loading...
   [junit4]   2> 1962976 INFO  (jetty-launcher-5313-thread-2) [    ] o.a.s.c.ZkContainer Zookeeper client=127.0.0.1:32899/solr
   [junit4]   2> 1962977 INFO  (zkConnectionManagerCallback-5324-thread-1) [    ] o.a.s.c.c.ConnectionManager zkClient has connected
   [junit4]   2> 1962978 INFO  (zkConnectionManagerCallback-5326-thread-1) [    ] o.a.s.c.c.ConnectionManager zkClient has connected
   [junit4]   2> 1963048 INFO  (jetty-launcher-5313-thread-1) [    ] o.a.s.c.ZkContainer Zookeeper client=127.0.0.1:32899/solr
   [junit4]   2> 1963053 INFO  (jetty-launcher-5313-thread-2) [n:127.0.0.1:43629_solr    ] o.a.s.c.OverseerElectionContext I am going to be the leader 127.0.0.1:43629_solr
   [junit4]   2> 1963054 INFO  (jetty-launcher-5313-thread-2) [n:127.0.0.1:43629_solr    ] o.a.s.c.Overseer Overseer (id=72256557024018436-127.0.0.1:43629_solr-n_0000000000) starting
   [junit4]   2> 1963058 INFO  (zkConnectionManagerCallback-5332-thread-1) [    ] o.a.s.c.c.ConnectionManager zkClient has connected
   [junit4]   2> 1963066 INFO  (zkConnectionManagerCallback-5334-thread-1) [    ] o.a.s.c.c.ConnectionManager zkClient has connected
   [junit4]   2> 1963071 INFO  (jetty-launcher-5313-thread-1) [n:127.0.0.1:44249_solr    ] o.a.s.c.ZkController Register node as live in ZooKeeper:/live_nodes/127.0.0.1:44249_solr
   [junit4]   2> 1963083 INFO  (zkCallback-5325-thread-1) [    ] o.a.s.c.c.ZkStateReader Updated live nodes from ZooKeeper... (0) -> (1)
   [junit4]   2> 1963085 INFO  (zkCallback-5333-thread-1) [    ] o.a.s.c.c.ZkStateReader Updated live nodes from ZooKeeper... (0) -> (1)
   [junit4]   2> 1963086 INFO  (zkConnectionManagerCallback-5339-thread-1) [    ] o.a.s.c.c.ConnectionManager zkClient has connected
   [junit4]   2> 1963087 INFO  (jetty-launcher-5313-thread-2) [n:127.0.0.1:43629_solr    ] o.a.s.c.c.ZkStateReader Updated live nodes from ZooKeeper... (0) -> (1)
   [junit4]   2> 1963088 INFO  (jetty-launcher-5313-thread-2) [n:127.0.0.1:43629_solr    ] o.a.s.c.s.i.ZkClientClusterStateProvider Cluster at 127.0.0.1:32899/solr ready
   [junit4]   2> 1963088 INFO  (OverseerStateUpdate-72256557024018436-127.0.0.1:43629_solr-n_0000000000) [n:127.0.0.1:43629_solr    ] o.a.s.c.Overseer Starting to work on the main queue : 127.0.0.1:43629_solr
   [junit4]   2> 1963090 DEBUG (OverseerAutoScalingTriggerThread-72256557024018436-127.0.0.1:43629_solr-n_0000000000) [    ] o.a.s.c.a.OverseerTriggerThread Adding .auto_add_replicas and .scheduled_maintenance triggers
   [junit4]   2> 1963090 DEBUG (OverseerAutoScalingTriggerThread-72256557024018436-127.0.0.1:43629_solr-n_0000000000) [    ] o.a.s.c.a.OverseerTriggerThread Refreshing /autoscaling.json with znode version 1
   [junit4]   2> 1963090 INFO  (jetty-launcher-5313-thread-2) [n:127.0.0.1:43629_solr    ] o.a.s.c.TransientSolrCoreCacheDefault Allocating transient cache for 2147483647 transient cores
   [junit4]   2> 1963090 DEBUG (OverseerAutoScalingTriggerThread-72256557024018436-127.0.0.1:43629_solr-n_0000000000) [    ] o.a.s.c.a.OverseerTriggerThread Current znodeVersion 1, lastZnodeVersion -1
   [junit4]   2> 1963090 INFO  (jetty-launcher-5313-thread-2) [n:127.0.0.1:43629_solr    ] o.a.s.c.ZkController Register node as live in ZooKeeper:/live_nodes/127.0.0.1:43629_solr
   [junit4]   2> 1963090 DEBUG (OverseerAutoScalingTriggerThread-72256557024018436-127.0.0.1:43629_solr-n_0000000000) [    ] o.a.s.c.a.OverseerTriggerThread Processed trigger updates upto znodeVersion 1
   [junit4]   2> 1963090 DEBUG (OverseerStateUpdate-72256557024018436-127.0.0.1:43629_solr-n_0000000000) [n:127.0.0.1:43629_solr    ] o.a.s.c.o.NodeMutator DownNode state invoked for node: 127.0.0.1:43629_solr
   [junit4]   2> 1963091 INFO  (zkCallback-5333-thread-1) [    ] o.a.s.c.c.ZkStateReader Updated live nodes from ZooKeeper... (1) -> (2)
   [junit4]   2> 1963091 INFO  (zkCallback-5325-thread-1) [    ] o.a.s.c.c.ZkStateReader Updated live nodes from ZooKeeper... (1) -> (2)
   [junit4]   2> 1963091 INFO  (zkCallback-5338-thread-1) [    ] o.a.s.c.c.ZkStateReader Updated live nodes from ZooKeeper... (1) -> (2)
   [junit4]   2> 1963092 DEBUG (OverseerAutoScalingTriggerThread-72256557024018436-127.0.0.1:43629_solr-n_0000000000) [    ] o.a.s.c.a.NodeLostTrigger NodeLostTrigger .auto_add_replicas - Initial livenodes: [127.0.0.1:43629_solr, 127.0.0.1:44249_solr]
   [junit4]   2> 1963092 DEBUG (OverseerAutoScalingTriggerThread-72256557024018436-127.0.0.1:43629_solr-n_0000000000) [    ] o.a.s.c.a.OverseerTriggerThread -- clean old nodeAdded markers
   [junit4]   2> 1963093 DEBUG (OverseerAutoScalingTriggerThread-72256557024018436-127.0.0.1:43629_solr-n_0000000000) [    ] o.a.s.c.a.OverseerTriggerThread Current znodeVersion 1, lastZnodeVersion 1
   [junit4]   2> 1963093 DEBUG (ScheduledTrigger-6541-thread-1) [    ] o.a.s.c.a.NodeLostTrigger Running NodeLostTrigger: .auto_add_replicas with currently live nodes: 2
   [junit4]   2> 1963102 INFO  (jetty-launcher-5313-thread-2) [n:127.0.0.1:43629_solr    ] o.a.s.h.a.MetricsHistoryHandler No .system collection, keeping metrics history in memory.
   [junit4]   2> 1963114 INFO  (zkConnectionManagerCallback-5347-thread-1) [    ] o.a.s.c.c.ConnectionManager zkClient has connected
   [junit4]   2> 1963115 INFO  (jetty-launcher-5313-thread-1) [n:127.0.0.1:44249_solr    ] o.a.s.c.c.ZkStateReader Updated live nodes from ZooKeeper... (0) -> (2)
   [junit4]   2> 1963115 INFO  (jetty-launcher-5313-thread-1) [n:127.0.0.1:44249_solr    ] o.a.s.c.s.i.ZkClientClusterStateProvider Cluster at 127.0.0.1:32899/solr ready
   [junit4]   2> 1963116 INFO  (jetty-launcher-5313-thread-1) [n:127.0.0.1:44249_solr    ] o.a.s.h.a.MetricsHistoryHandler No .system collection, keeping metrics history in memory.
   [junit4]   2> 1963122 INFO  (jetty-launcher-5313-thread-2) [n:127.0.0.1:43629_solr    ] o.a.s.m.r.SolrJmxReporter JMX monitoring for 'solr_43629.solr.node' (registry 'solr.node') enabled at server: com.sun.jmx.mbeanserver.JmxMBeanServer@4fa4c48d
   [junit4]   2> 1963125 INFO  (jetty-launcher-5313-thread-1) [n:127.0.0.1:44249_solr    ] o.a.s.m.r.SolrJmxReporter JMX monitoring for 'solr_44249.solr.node' (registry 'solr.node') enabled at server: com.sun.jmx.mbeanserver.JmxMBeanServer@4fa4c48d
   [junit4]   2> 1963139 INFO  (jetty-launcher-5313-thread-2) [n:127.0.0.1:43629_solr    ] o.a.s.m.r.SolrJmxReporter JMX monitoring for 'solr_43629.solr.jvm' (registry 'solr.jvm') enabled at server: com.sun.jmx.mbeanserver.JmxMBeanServer@4fa4c48d
   [junit4]   2> 1963139 INFO  (jetty-launcher-5313-thread-2) [n:127.0.0.1:43629_solr    ] o.a.s.m.r.SolrJmxReporter JMX monitoring for 'solr_43629.solr.jetty' (registry 'solr.jetty') enabled at server: com.sun.jmx.mbeanserver.JmxMBeanServer@4fa4c48d
   [junit4]   2> 1963140 INFO  (jetty-launcher-5313-thread-2) [n:127.0.0.1:43629_solr    ] o.a.s.c.CorePropertiesLocator Found 0 core definitions underneath /home/jenkins/workspace/Lucene-Solr-7.x-Linux/solr/build/solr-core/test/J0/temp/solr.cloud.TestWithCollection_AEBD9C0133E3AE84-001/tempDir-001/node2/.
   [junit4]   2> 1963140 INFO  (jetty-launcher-5313-thread-1) [n:127.0.0.1:44249_solr    ] o.a.s.m.r.SolrJmxReporter JMX monitoring for 'solr_44249.solr.jvm' (registry 'solr.jvm') enabled at server: com.sun.jmx.mbeanserver.JmxMBeanServer@4fa4c48d
   [junit4]   2> 1963140 INFO  (jetty-launcher-5313-thread-1) [n:127.0.0.1:44249_solr    ] o.a.s.m.r.SolrJmxReporter JMX monitoring for 'solr_44249.solr.jetty' (registry 'solr.jetty') enabled at server: com.sun.jmx.mbeanserver.JmxMBeanServer@4fa4c48d
   [junit4]   2> 1963141 INFO  (jetty-launcher-5313-thread-1) [n:127.0.0.1:44249_solr    ] o.a.s.c.CorePropertiesLocator Found 0 core definitions underneath /home/jenkins/workspace/Lucene-Solr-7.x-Linux/solr/build/solr-core/test/J0/temp/solr.cloud.TestWithCollection_AEBD9C0133E3AE84-001/tempDir-001/node1/.
   [junit4]   2> 1963193 INFO  (zkConnectionManagerCallback-5350-thread-1) [    ] o.a.s.c.c.ConnectionManager zkClient has connected
   [junit4]   2> 1963203 INFO  (zkConnectionManagerCallback-5355-thread-1) [    ] o.a.s.c.c.ConnectionManager zkClient has connected
   [junit4]   2> 1963204 INFO  (SUITE-TestWithCollection-seed#[AEBD9C0133E3AE84]-worker) [    ] o.a.s.c.c.ZkStateReader Updated live nodes from ZooKeeper... (0) -> (2)
   [junit4]   2> 1963204 INFO  (SUITE-TestWithCollection-seed#[AEBD9C0133E3AE84]-worker) [    ] o.a.s.c.s.i.ZkClientClusterStateProvider Cluster at 127.0.0.1:32899/solr ready
   [junit4]   2> 1963241 INFO  (TEST-TestWithCollection.testMultipleWithCollections-seed#[AEBD9C0133E3AE84]) [    ] o.a.s.SolrTestCaseJ4 ###Starting testMultipleWithCollections
   [junit4]   2> 1963241 DEBUG (zkCallback-5338-thread-1) [    ] o.a.s.c.a.OverseerTriggerThread Refreshing /autoscaling.json with znode version 2
   [junit4]   2> 1963241 DEBUG (OverseerAutoScalingTriggerThread-72256557024018436-127.0.0.1:43629_solr-n_0000000000) [    ] o.a.s.c.a.OverseerTriggerThread Processed trigger updates upto znodeVersion 2
   [junit4]   2> 1963242 INFO  (TEST-TestWithCollection.testMultipleWithCollections-seed#[AEBD9C0133E3AE84]) [    ] o.a.s.c.c.ZkStateReader Updated live nodes from ZooKeeper... (0) -> (2)
   [junit4]   2> 1963245 DEBUG (OverseerAutoScalingTriggerThread-72256557024018436-127.0.0.1:43629_solr-n_0000000000) [    ] o.a.s.c.a.OverseerTriggerThread -- clean old nodeLost markers
   [junit4]   2> 1963245 DEBUG (OverseerAutoScalingTriggerThread-72256557024018436-127.0.0.1:43629_solr-n_0000000000) [    ] o.a.s.c.a.OverseerTriggerThread -- clean old nodeAdded markers
   [junit4]   2> 1963245 DEBUG (OverseerAutoScalingTriggerThread-72256557024018436-127.0.0.1:43629_solr-n_0000000000) [    ] o.a.s.c.a.OverseerTriggerThread Current znodeVersion 2, lastZnodeVersion 2
   [junit4]   2> 1963246 INFO  (zkConnectionManagerCallback-5359-thread-1) [    ] o.a.s.c.c.ConnectionManager zkClient has connected
   [junit4]   2> 1963247 INFO  (TEST-TestWithCollection.testMultipleWithCollections-seed#[AEBD9C0133E3AE84]) [    ] o.e.j.s.Server jetty-9.4.11.v20180605; built: 2018-06-05T18:24:03.829Z; git: d5fc0523cfa96bfebfbda19606cad384d772f04c; jvm 1.8.0_172-b11
   [junit4]   2> 1963249 INFO  (TEST-TestWithCollection.testMultipleWithCollections-seed#[AEBD9C0133E3AE84]) [    ] o.e.j.s.session DefaultSessionIdManager workerName=node0
   [junit4]   2> 1963249 INFO  (TEST-TestWithCollection.testMultipleWithCollections-seed#[AEBD9C0133E3AE84]) [    ] o.e.j.s.session No SessionScavenger set, using defaults
   [junit4]   2> 1963249 INFO  (TEST-TestWithCollection.testMultipleWithCollections-seed#[AEBD9C0133E3AE84]) [    ] o.e.j.s.session node0 Scavenging every 660000ms
   [junit4]   2> 1963250 INFO  (TEST-TestWithCollection.testMultipleWithCollections-seed#[AEBD9C0133E3AE84]) [    ] o.e.j.s.h.ContextHandler Started o.e.j.s.ServletContextHandler@247fca36{/solr,null,AVAILABLE}
   [junit4]   2> 1963250 INFO  (TEST-TestWithCollection.testMultipleWithCollections-seed#[AEBD9C0133E3AE84]) [    ] o.e.j.s.AbstractConnector Started ServerConnector@106d8c1e{SSL,[ssl, http/1.1]}{127.0.0.1:41219}
   [junit4]   2> 1963250 INFO  (TEST-TestWithCollection.testMultipleWithCollections-seed#[AEBD9C0133E3AE84]) [    ] o.e.j.s.Server Started @1963285ms
   [junit4]   2> 1963250 INFO  (TEST-TestWithCollection.testMultipleWithCollections-seed#[AEBD9C0133E3AE84]) [    ] o.a.s.c.s.e.JettySolrRunner Jetty properties: {hostContext=/solr, hostPort=41219}
   [junit4]   2> 1963250 ERROR (TEST-TestWithCollection.testMultipleWithCollections-seed#[AEBD9C0133E3AE84]) [    ] o.a.s.u.StartupLoggingUtils Missing Java Option solr.log.dir. Logging may be missing or incomplete.
   [junit4]   2> 1963250 INFO  (TEST-TestWithCollection.testMultipleWithCollections-seed#[AEBD9C0133E3AE84]) [    ] o.a.s.s.SolrDispatchFilter Using logger factory org.apache.logging.slf4j.Log4jLoggerFactory
   [junit4]   2> 1963250 INFO  (TEST-TestWithCollection.testMultipleWithCollections-seed#[AEBD9C0133E3AE84]) [    ] o.a.s.s.SolrDispatchFilter  ___      _       Welcome to Apache Solr? version 7.6.0
   [junit4]   2> 1963250 INFO  (TEST-TestWithCollection.testMultipleWithCollections-seed#[AEBD9C0133E3AE84]) [    ] o.a.s.s.SolrDispatchFilter / __| ___| |_ _   Starting in cloud mode on port null
   [junit4]   2> 1963250 INFO  (TEST-TestWithCollection.testMultipleWithCollections-seed#[AEBD9C0133E3AE84]) [    ] o.a.s.s.SolrDispatchFilter \__ \/ _ \ | '_|  Install dir: null
   [junit4]   2> 1963250 INFO  (TEST-TestWithCollection.testMultipleWithCollections-seed#[AEBD9C0133E3AE84]) [    ] o.a.s.s.SolrDispatchFilter |___/\___/_|_|    Start time: 2018-09-20T10:44:17.111Z
   [junit4]   2> 1963252 INFO  (zkConnectionManagerCallback-5361-thread-1) [    ] o.a.s.c.c.ConnectionManager zkClient has connected
   [junit4]   2> 1963252 INFO  (TEST-TestWithCollection.testMultipleWithCollections-seed#[AEBD9C0133E3AE84]) [    ] o.a.s.s.SolrDispatchFilter solr.xml found in ZooKeeper. Loading...
   [junit4]   2> 1963366 INFO  (TEST-TestWithCollection.testMultipleWithCollections-seed#[AEBD9C0133E3AE84]) [    ] o.a.s.c.ZkContainer Zookeeper client=127.0.0.1:32899/solr
   [junit4]   2> 1963367 INFO  (zkConnectionManagerCallback-5365-thread-1) [    ] o.a.s.c.c.ConnectionManager zkClient has connected
   [junit4]   2> 1963368 INFO  (zkConnectionManagerCallback-5367-thread-1) [    ] o.a.s.c.c.ConnectionManager zkClient has connected
   [junit4]   2> 1963371 INFO  (TEST-TestWithCollection.testMultipleWithCollections-seed#[AEBD9C0133E3AE84]) [n:127.0.0.1:41219_solr    ] o.a.s.c.c.ZkStateReader Updated live nodes from ZooKeeper... (0) -> (2)
   [junit4]   2> 1963375 INFO  (TEST-TestWithCollection.testMultipleWithCollections-seed#[AEBD9C0133E3AE84]) [n:127.0.0.1:41219_solr    ] o.a.s.c.TransientSolrCoreCacheDefault Allocating transient cache for 2147483647 transient cores
   [junit4]   2> 1963375 INFO  (TEST-TestWithCollection.testMultipleWithCollections-seed#[AEBD9C0133E3AE84]) [n:127.0.0.1:41219_solr    ] o.a.s.c.ZkController Register node as live in ZooKeeper:/live_nodes/127.0.0.1:41219_solr
   [junit4]   2> 1963375 DEBUG (OverseerStateUpdate-72256557024018436-127.0.0.1:43629_solr-n_0000000000) [n:127.0.0.1:43629_solr    ] o.a.s.c.o.NodeMutator DownNode state invoked for node: 127.0.0.1:41219_solr
   [junit4]   2> 1963375 INFO  (zkCallback-5338-thread-1) [    ] o.a.s.c.c.ZkStateReader Updated live nodes from ZooKeeper... (2) -> (3)
   [junit4]   2> 1963375 INFO  (zkCallback-5333-thread-1) [    ] o.a.s.c.c.ZkStateReader Updated live nodes from ZooKeeper... (2) -> (3)
   [junit4]   2> 1963375 INFO  (zkCallback-5325-thread-1) [    ] o.a.s.c.c.ZkStateReader Updated live nodes from ZooKeeper... (2) -> (3)
   [junit4]   2> 1963375 INFO  (zkCallback-5366-thread-1) [    ] o.a.s.c.c.ZkStateReader Updated live nodes from ZooKeeper... (2) -> (3)
   [junit4]   2> 1963376 INFO  (zkCallback-5354-thread-2) [    ] o.a.s.c.c.ZkStateReader Updated live nodes from ZooKeeper... (2) -> (3)
   [junit4]   2> 1963376 INFO  (zkCallback-5354-thread-1) [    ] o.a.s.c.c.ZkStateReader Updated live nodes from ZooKeeper... (2) -> (3)
   [junit4]   2> 1963376 INFO  (zkCallback-5346-thread-1) [    ] o.a.s.c.c.ZkStateReader Updated live nodes from ZooKeeper... (2) -> (3)
   [junit4]   2> 1963390 INFO  (zkConnectionManagerCallback-5374-thread-1) [    ] o.a.s.c.c.ConnectionManager zkClient has connected
   [junit4]   2> 1963391 INFO  (TEST-TestWithCollection.testMultipleWithCollections-seed#[AEBD9C0133E3AE84]) [n:127.0.0.1:41219_solr    ] o.a.s.c.c.ZkStateReader Updated live nodes from ZooKeeper... (0) -> (3)
   [junit4]   2> 1963391 INFO  (TEST-TestWithCollection.testMultipleWithCollections-seed#[AEBD9C0133E3AE84]) [n:127.0.0.1:41219_solr    ] o.a.s.c.s.i.ZkClientClusterStateProvider Cluster at 127.0.0.1:32899/solr ready
   [junit4]   2> 1963391 INFO  (TEST-TestWithCollection.testMultipleWithCollections-seed#[AEBD9C0133E3AE84]) [n:127.0.0.1:41219_solr    ] o.a.s.h.a.MetricsHistoryHandler No .system collection, keeping metrics history in memory.
   [junit4]   2> 1963405 INFO  (TEST-TestWithCollection.testMultipleWithCollections-seed#[AEBD9C0133E3AE84]) [n:127.0.0.1:41219_solr    ] o.a.s.m.r.SolrJmxReporter JMX monitoring for 'solr_41219.solr.node' (registry 'solr.node') enabled at server: com.sun.jmx.mbeanserver.JmxMBeanServer@4fa4c48d
   [junit4]   2> 1963413 INFO  (TEST-TestWithCollection.testMultipleWithCollections-seed#[AEBD9C0133E3AE84]) [n:127.0.0.1:41219_solr    ] o.a.s.m.r.SolrJmxReporter JMX monitoring for 'solr_41219.solr.jvm' (registry 'solr.jvm') enabled at server: com.sun.jmx.mbeanserver.JmxMBeanServer@4fa4c48d
   [junit4]   2> 1963414 INFO  (TEST-TestWithCollection.testMultipleWithCollections-seed#[AEBD9C0133E3AE84]) [n:127.0.0.1:41219_solr    ] o.a.s.m.r.SolrJmxReporter JMX monitoring for 'solr_41219.solr.jetty' (registry 'solr.jetty') enabled at server: com.sun.jmx.mbeanserver.JmxMBeanServer@4fa4c48d
   [junit4]   2> 1963415 INFO  (TEST-TestWithCollection.testMultipleWithCollections-seed#[AEBD9C0133E3AE84]) [n:127.0.0.1:41219_solr    ] o.a.s.c.CorePropertiesLocator Found 0 core definitions underneath /home/jenkins/workspace/Lucene-Solr-7.x-Linux/solr/build/solr-core/test/J0/temp/solr.cloud.TestWithCollection_AEBD9C0133E3AE84-001/tempDir-001/node3/.
   [junit4]   2> 1963448 INFO  (TEST-TestWithCollection.testMultipleWithCollections-seed#[AEBD9C0133E3AE84]) [    ] o.e.j.s.Server jetty-9.4.11.v20180605; built: 2018-06-05T18:24:03.829Z; git: d5fc0523cfa96bfebfbda19606cad384d772f04c; jvm 1.8.0_172-b11
   [junit4]   2> 1963453 INFO  (TEST-TestWithCollection.testMultipleWithCollections-seed#[AEBD9C0133E3AE84]) [    ] o.e.j.s.session DefaultSessionIdManager workerName=node0
   [junit4]   2> 1963453 INFO  (TEST-TestWithCollection.testMultipleWithCollections-seed#[AEBD9C0133E3AE84]) [    ] o.e.j.s.session No SessionScavenger set, using defaults
   [junit4]   2> 1963453 INFO  (TEST-TestWithCollection.testMultipleWithCollections-seed#[AEBD9C0133E3AE84]) [    ] o.e.j.s.session node0 Scavenging every 660000ms
   [junit4]   2> 1963454 INFO  (TEST-TestWithCollection.testMultipleWithCollections-seed#[AEBD9C0133E3AE84]) [    ] o.e.j.s.h.ContextHandler Started o.e.j.s.ServletContextHandler@1be4065e{/solr,null,AVAILABLE}
   [junit4]   2> 1963454 INFO  (TEST-TestWithCollection.testMultipleWithCollections-seed#[AEBD9C0133E3AE84]) [    ] o.e.j.s.AbstractConnector Started ServerConnector@5c4f06b6{SSL,[ssl, http/1.1]}{127.0.0.1:37167}
   [junit4]   2> 1963455 INFO  (TEST-TestWithCollection.testMultipleWithCollections-seed#[AEBD9C0133E3AE84]) [    ] o.e.j.s.Server Started @1963489ms
   [junit4]   2> 1963455 INFO  (TEST-TestWithCollection.testMultipleWithCollections-seed#[AEBD9C0133E3AE84]) [    ] o.a.s.c.s.e.JettySolrRunner Jetty properties: {hostContext=/solr, hostPort=37167}
   [junit4]   2> 1963455 ERROR (TEST-TestWithCollection.testMultipleWithCollections-seed#[AEBD9C0133E3AE84]) [    ] o.a.s.u.StartupLoggingUtils Missing Java Option solr.log.dir. Logging may be missing or incomplete.
   [junit4]   2> 1963455 INFO  (TEST-TestWithCollection.testMultipleWithCollections-seed#[AEBD9C0133E3AE84]) [    ] o.a.s.s.SolrDispatchFilter Using logger factory org.apache.logging.slf4j.Log4jLoggerFactory
   [junit4]   2> 1963455 INFO  (TEST-TestWithCollection.testMultipleWithCollections-seed#[AEBD9C0133E3AE84]) [    ] o.a.s.s.SolrDispatchFilter  ___      _       Welcome to Apache Solr? version 7.6.0
   [junit4]   2> 1963455 INFO  (TEST-TestWithCollection.testMultipleWithCollections-seed#[AEBD9C0133E3AE84]) [    ] o.a.s.s.SolrDispatchFilter / __| ___| |_ _   Starting in cloud mode on port null
   [junit4]   2> 1963455 INFO  (TEST-TestWithCollection.testMultipleWithCollections-seed#[AEBD9C0133E3AE84]) [    ] o.a.s.s.SolrDispatchFilter \__ \/ _ \ | '_|  Install dir: null
   [junit4]   2> 1963455 INFO  (TEST-TestWithCollection.testMultipleWithCollections-seed#[AEBD9C0133E3AE84]) [    ] o.a.s.s.SolrDispatchFilter |___/\___/_|_|    Start time: 2018-09-20T10:44:17.316Z
   [junit4]   2> 1963456 INFO  (zkConnectionManagerCallback-5377-thread-1) [    ] o.a.s.c.c.ConnectionManager zkClient has connected
   [junit4]   2> 1963457 INFO  (TEST-TestWithCollection.testMultipleWithCollections-seed#[AEBD9C0133E3AE84]) [    ] o.a.s.s.SolrDispatchFilter solr.xml found in ZooKeeper. Loading...
   [junit4]   2> 1963576 INFO  (TEST-TestWithCollection.testMultipleWithCollections-seed#[AEBD9C0133E3AE84]) [    ] o.a.s.c.ZkContainer Zookeeper client=127.0.0.1:32899/solr
   [junit4]   2> 1963577 INFO  (zkConnectionManagerCallback-5381-thread-1) [    ] o.a.s.c.c.ConnectionManager zkClient has connected
   [junit4]   2> 1963582 INFO  (zkConnectionManagerCallback-5383-thread-1) [    ] o.a.s.c.c.ConnectionManager zkClient has connected
   [junit4]   2> 1963586 INFO  (TEST-TestWithCollection.testMultipleWithCollections-seed#[AEBD9C0133E3AE84]) [    ] o.a.s.c.c.ZkStateReader Updated live nodes from ZooKeeper... (0) -> (3)
   [junit4]   2> 1963589 INFO  (TEST-TestWithCollection.testMultipleWithCollections-seed#[AEBD9C0133E3AE84]) [    ] o.a.s.c.TransientSolrCoreCacheDefault Allocating transient cache for 2147483647 transient cores
   [junit4]   2> 1963589 INFO  (TEST-TestWithCollection.testMultipleWithCollections-seed#[AEBD9C0133E3AE84]) [    ] o.a.s.c.ZkController Register node as live in ZooKeeper:/live_nodes/127.0.0.1:37167_solr
   [junit4]   2> 1963589 DEBUG (OverseerStateUpdate-72256557024018436-127.0.0.1:43629_solr-n_0000000000) [n:127.0.0.1:43629_solr    ] o.a.s.c.o.NodeMutator DownNode state invoked for node: 127.0.0.1:37167_solr
   [junit4]   2> 1963589 INFO  (zkCallback-5338-thread-1) [    ] o.a.s.c.c.ZkStateReader Updated live nodes from ZooKeeper... (3) -> (4)
   [junit4]   2> 1963589 INFO  (zkCallback-5325-thread-1) [    ] o.a.s.c.c.ZkStateReader Updated live nodes from ZooKeeper... (3) -> (4)
   [junit4]   2> 1963589 INFO  (zkCallback-5346-thread-1) [    ] o.a.s.c.c.ZkStateReader Updated live nodes from ZooKeeper... (3) -> (4)
   [junit4]   2> 1963589 INFO  (zkCallback-5366-thread-1) [    ] o.a.s.c.c.ZkStateReader Updated live nodes from ZooKeeper... (3) -> (4)
   [junit4]   2> 1963590 INFO  (zkCallback-5373-thread-1) [    ] o.a.s.c.c.ZkStateReader Updated live nodes from ZooKeeper... (3) -> (4)
   [junit4]   2> 1963590 INFO  (zkCallback-5382-thread-1) [    ] o.a.s.c.c.ZkStateReader Updated live nodes from ZooKeeper... (3) -> (4)
   [junit4]   2> 1963590 INFO  (zkCallback-5333-thread-1) [    ] o.a.s.c.c.ZkStateReader Updated live nodes from ZooKeeper... (3) -> (4)
   [junit4]   2> 1963590 INFO  (zkCallback-5354-thread-2) [    ] o.a.s.c.c.ZkStateReader Updated live nodes from ZooKeeper... (3) -> (4)
   [junit4]   2> 1963590 INFO  (zkCallback-5354-thread-1) [    ] o.a.s.c.c.ZkStateReader Updated live nodes from ZooKeeper... (3) -> (4)
   [junit4]   2> 1963609 INFO  (zkConnectionManagerCallback-5390-thread-1) [    ] o.a.s.c.c.ConnectionManager zkClient has connected
   [junit4]   2> 1963610 INFO  (TEST-TestWithCollection.testMultipleWithCollections-seed#[AEBD9C0133E3AE84]) [    ] o.a.s.c.c.ZkStateReader Updated live nodes from ZooKeeper... (0) -> (4)
   [junit4]   2> 1963610 INFO  (TEST-TestWithCollection.testMultipleWithCollections-seed#[AEBD9C0133E3AE84]) [    ] o.a.s.c.s.i.ZkClientClusterStateProvider Cluster at 127.0.0.1:32899/solr ready
   [junit4]   2> 1963610 INFO  (TEST-TestWithCollection.testMultipleWithCollections-seed#[AEBD9C0133E3AE84]) [    ] o.a.s.h.a.MetricsHistoryHandler No .system collection, keeping metrics history in memory.
   [junit4]   2> 1963623 INFO  (TEST-TestWithCollection.testMultipleWithCollections-seed#[AEBD9C0133E3AE84]) [    ] o.a.s.m.r.SolrJmxReporter JMX monitoring for 'solr_37167.solr.node' (registry 'solr.node') enabled at server: com.sun.jmx.mbeanserver.JmxMBeanServer@4fa4c48d
   [junit4]   2> 1963631 INFO  (TEST-TestWithCollection.testMultipleWithCollections-seed#[AEBD9C0133E3AE84]) [    ] o.a.s.m.r.SolrJmxReporter JMX monitoring for 'solr_37167.solr.jvm' (registry 'solr.jvm') enabled at server: com.sun.jmx.mbeanserver.JmxMBeanServer@4fa4c48d
   [junit4]   2> 1963631 INFO  (TEST-TestWithCollection.testMultipleWithCollections-seed#[AEBD9C0133E3AE84]) [    ] o.a.s.m.r.SolrJmxReporter JMX monitoring for 'solr_37167.solr.jetty' (registry 'solr.jetty') enabled at server: com.sun.jmx.mbeanserver.JmxMBeanServer@4fa4c48d
   [junit4]   2> 1963632 INFO  (TEST-TestWithCollection.testMultipleWithCollections-seed#[AEBD9C0133E3AE84]) [    ] o.a.s.c.CorePropertiesLocator Found 0 core definitions underneath /home/jenkins/workspace/Lucene-Solr-7.x-Linux/solr/build/solr-core/test/J0/temp/solr.cloud.TestWithCollection_AEBD9C0133E3AE84-001/tempDir-001/node4/.
   [junit4]   2> 1963671 INFO  (zkConnectionManagerCallback-5393-thread-1) [    ] o.a.s.c.c.ConnectionManager zkClient has connected
   [junit4]   2> 1963703 INFO  (qtp1926775567-19357) [n:127.0.0.1:37167_solr    ] o.a.s.s.HttpSolrCall [admin] webapp=null path=/admin/metrics params={prefix=CONTAINER.fs.usableSpace,CORE.coreName&wt=javabin&version=2&group=solr.node,solr.core} status=0 QTime=0
   [junit4]   2> 1963718 INFO  (qtp739120267-19327) [n:127.0.0.1:41219_solr    ] o.a.s.s.HttpSolrCall [admin] webapp=null path=/admin/metrics params={prefix=CONTAINER.fs.usableSpace,CORE.coreName&wt=javabin&version=2&group=solr.node,solr.core} status=0 QTime=0
   [junit4]   2> 1963725 INFO  (qtp14897804-19257) [n:127.0.0.1:43629_solr    ] o.a.s.s.HttpSolrCall [admin] webapp=null path=/admin/metrics params={prefix=CONTAINER.fs.usableSpace,CORE.coreName&wt=javabin&version=2&group=solr.node,solr.core} status=0 QTime=0
   [junit4]   2> 1963738 INFO  (qtp543022447-19250) [n:127.0.0.1:44249_solr    ] o.a.s.s.HttpSolrCall [admin] webapp=null path=/admin/metrics params={prefix=CONTAINER.fs.usableSpace,CORE.coreName&wt=javabin&version=2&group=solr.node,solr.core} status=0 QTime=0
   [junit4]   2> 1963739 DEBUG (qtp14897804-19254) [n:127.0.0.1:43629_solr    ] o.a.s.c.a.AutoScalingHandler Verified autoscaling configuration
   [junit4]   2> 1963739 INFO  (qtp14897804-19254) [n:127.0.0.1:43629_solr    ] o.a.s.s.HttpSolrCall [admin] webapp=null path=/cluster/autoscaling params={wt=javabin&version=2} status=0 QTime=53
   [junit4]   2> 1963739 DEBUG (zkCallback-5338-thread-1) [    ] o.a.s.c.a.OverseerTriggerThread Refreshing /autoscaling.json with znode version 3
   [junit4]   2> 1963739 INFO  (TEST-TestWithCollection.testMultipleWithCollections-seed#[AEBD9C0133E3AE84]) [    ] o.a.s.c.TestWithCollection Chosen node 127.0.0.1:43629_solr for collection testMultipleWithCollections_abc
   [junit4]   2> 1963740 DEBUG (OverseerAutoScalingTriggerThread-72256557024018436-127.0.0.1:43629_solr-n_0000000000) [    ] o.a.s.c.a.OverseerTriggerThread Processed trigger updates upto znodeVersion 3
   [junit4]   2> 1963740 DEBUG (OverseerAutoScalingTriggerThread-72256557024018436-127.0.0.1:43629_solr-n_0000000000) [    ] o.a.s.c.a.OverseerTriggerThread -- clean old nodeLost markers
   [junit4]   2> 1963740 DEBUG (OverseerAutoScalingTriggerThread-72256557024018436-127.0.0.1:43629_solr-n_0000000000) [    ] o.a.s.c.a.OverseerTriggerThread -- clean old nodeAdded markers
   [junit4]   2> 1963740 DEBUG (OverseerAutoScalingTriggerThread-72256557024018436-127.0.0.1:43629_solr-n_0000000000) [    ] o.a.s.c.a.OverseerTriggerThread Current znodeVersion 3, lastZnodeVersion 3
   [junit4]   2> 1963741 INFO  (qtp1926775567-19357) [n:127.0.0.1:37167_solr    ] o.a.s.h.a.CollectionsHandler Invoked Collection Action :create with params pullReplicas=0&name=testMultipleWithCollections_abc&nrtReplicas=1&action=CREATE&numShards=1&tlogReplicas=0&createNodeSet=127.0.0.1:43629_solr&wt=javabin&version=2 and sendToOCPQueue=true
   [junit4]   2> 1963742 INFO  (OverseerThreadFactory-6543-thread-1-processing-n:127.0.0.1:43629_solr) [n:127.0.0.1:43629_solr    ] o.a.s.c.a.c.CreateCollectionCmd Create collection testMultipleWithCollections_abc
   [junit4]   2> 1963743 INFO  (OverseerThreadFactory-6543-thread-1-processing-n:127.0.0.1:43629_solr) [n:127.0.0.1:43629_solr    ] o.a.s.c.c.ZkConfigManager Copying zk node /configs/_default/protwords.txt to /configs/testMultipleWithCollections_abc.AUTOCREATED/protwords.txt
   [junit4]   2> 1963743 INFO  (OverseerThreadFactory-6543-thread-1-processing-n:127.0.0.1:43629_solr) [n:127.0.0.1:43629_solr    ] o.a.s.c.c.ZkConfigManager Copying zk node /configs/_default/managed-schema to /configs/testMultipleWithCollections_abc.AUTOCREATED/managed-schema
   [junit4]   2> 1963744 INFO  (OverseerThreadFactory-6543-thread-1-processing-n:127.0.0.1:43629_solr) [n:127.0.0.1:43629_solr    ] o.a.s.c.c.ZkConfigManager Copying zk node /configs/_default/solrconfig.xml to /configs/testMultipleWithCollections_abc.AUTOCREATED/solrconfig.xml
   [junit4]   2> 1963745 INFO  (OverseerThreadFactory-6543-thread-1-processing-n:127.0.0.1:43629_solr) [n:127.0.0.1:43629_solr    ] o.a.s.c.c.ZkConfigManager Copying zk node /configs/_default/synonyms.txt to /configs/testMultipleWithCollections_abc.AUTOCREATED/synonyms.txt
   [junit4]   2> 1963745 INFO  (OverseerThreadFactory-6543-thread-1-processing-n:127.0.0.1:43629_solr) [n:127.0.0.1:43629_solr    ] o.a.s.c.c.ZkConfigManager Copying zk node /configs/_default/stopwords.txt to /configs/testMultipleWithCollections_abc.AUTOCREATED/stopwords.txt
   [junit4]   2> 1963746 INFO  (OverseerThreadFactory-6543-thread-1-processing-n:127.0.0.1:43629_solr) [n:127.0.0.1:43629_solr    ] o.a.s.c.c.ZkConfigManager Copying zk node /configs/_default/lang/contractions_it.txt to /configs/testMultipleWithCollections_abc.AUTOCREATED/lang/contractions_it.txt
   [junit4]   2> 1963747 INFO  (OverseerThreadFactory-6543-thread-1-processing-n:127.0.0.1:43629_solr) [n:127.0.0.1:43629_solr    ] o.a.s.c.c.ZkConfigManager Copying zk node /configs/_default/lang/stemdict_nl.txt to /configs/testMultipleWithCollections_abc.AUTOCREATED/lang/stemdict_nl.txt
   [junit4]   2> 1963748 INFO  (OverseerThreadFactory-6543-thread-1-processing-n:127.0.0.1:43629_solr) [n:127.0.0.1:43629_solr    ] o.a.s.c.c.ZkConfigManager Copying zk node /configs/_default/lang/stopwords_hy.txt to /configs/testMultipleWithCollections_abc.AUTOCREATED/lang/stopwords_hy.txt
   [junit4]   2> 1963749 INFO  (OverseerThreadFactory-6543-thread-1-processing-n:127.0.0.1:43629_solr) [n:127.0.0.1:43629_solr    ] o.a.s.c.c.ZkConfigManager Copying zk node /configs/_default/lang/stopwords_no.txt to /configs/testMultipleWithCollections_abc.AUTOCREATED/lang/stopwords_no.txt
   [junit4]   2> 1963749 INFO  (OverseerThreadFactory-6543-thread-1-processing-n:127.0.0.1:43629_solr) [n:127.0.0.1:43629_solr    ] o.a.s.c.c.ZkConfigManager Copying zk node /configs/_default/lang/contractions_ca.txt to /configs/testMultipleWithCollections_abc.AUTOCREATED/lang/contractions_ca.txt
   [junit4]   2> 1963750 INFO  (OverseerThreadFactory-6543-thread-1-processing-n:127.0.0.1:43629_solr) [n:127.0.0.1:43629_solr    ] o.a.s.c.c.ZkConfigManager Copying zk node /configs/_default/lang/stopwords_id.txt to /configs/testMultipleWithCollections_abc.AUTOCREATED/lang/stopwords_id.txt
   [junit4]   2> 1963751 INFO  (OverseerThreadFactory-6543-thread-1-processing-n:127.0.0.1:43629_solr) [n:127.0.0.1:43629_solr    ] o.a.s.c.c.ZkConfigManager Copying zk node /configs/_default/lang/stopwords_ga.txt to /configs/testMultipleWithCollections_abc.AUTOCREATED/lang/stopwords_ga.txt
   [junit4]   2> 1963752 INFO  (OverseerThreadFactory-6543-thread-1-processing-n:127.0.0.1:43629_solr) [n:127.0.0.1:43629_solr    ] o.a.s.c.c.ZkConfigManager Copying zk node /configs/_default/lang/stopwords_hi.txt to /configs/testMultipleWithCollections_abc.AUTOCREATED/lang/stopwords_hi.txt
   [junit4]   2> 1963752 INFO  (OverseerThreadFactory-6543-thread-1-processing-n:127.0.0.1:43629_solr) [n:127.0.0.1:43629_solr    ] o.a.s.c.c.ZkConfigManager Copying zk node /configs/_default/lang/stopwords_da.txt to /configs/testMultipleWithCollections_abc.AUTOCREATED/lang/stopwords_da.txt
   [junit4]   2> 1963753 INFO  (OverseerThreadFactory-6543-thread-1-processing-n:127.0.0.1:43629_solr) [n:127.0.0.1:43629_solr    ] o.a.s.c.c.ZkConfigManager Copying zk node /configs/_default/lang/stopwords_ja.txt to /configs/testMultipleWithCollections_abc.AUTOCREATED/lang/stopwords_ja.txt
   [junit4]   2> 1963753 INFO  (OverseerThreadFactory-6543-thread-1-processing-n:127.0.0.1:43629_solr) [n:127.0.0.1:43629_solr    ] o.a.s.c.c.ZkConfigManager Copying zk node /configs/_default/lang/stopwords_pt.txt to /configs/testMultipleWithCollections_abc.AUTOCREATED/lang/stopwords_pt.txt
   [junit4]   2> 1963754 INFO  (OverseerThreadFactory-6543-thread-1-processing-n:127.0.0.1:43629_solr) [n:127.0.0.1:43629_solr    ] o.a.s.c.c.ZkConfigManager Copying zk node /configs/_default/lang/stopwords_hu.txt to /configs/testMultipleWithCollections_abc.AUTOCREATED/lang/stopwords_hu.txt
   [junit4]   2> 1963754 INFO  (OverseerThreadFactory-6543-thread-1-processing-n:127.0.0.1:43629_solr) [n:127.0.0.1:43629_solr    ] o.a.s.c.c.ZkConfigManager Copying zk node /configs/_default/lang/stopwords_el.txt to /configs/testMultipleWithCollections_abc.AUTOCREATED/lang/stopwords_el.txt
   [junit4]   2> 1963755 INFO  (OverseerThreadFactory-6543-thread-1-processing-n:127.0.0.1:43629_solr) [n:127.0.0.1:43629_solr    ] o.a.s.c.c.ZkConfigManager Copying zk node /configs/_default/lang/stopwords_ru.txt to /configs/testMultipleWithCollections_abc.AUTOCREATED/lang/stopwords_ru.txt
   [junit4]   2> 1963757 INFO  (OverseerThreadFactory-6543-thread-1-processing-n:127.0.0.1:43629_solr) [n:127.0.0.1:43629_solr    ] o.a.s.c.c.ZkConfigManager Copying zk node /configs/_default/lang/stopwords_tr.txt to /configs/testMultipleWithCollections_abc.AUTOCREATED/lang/stopwords_tr.txt
   [junit4]   2> 1963758 INFO  (OverseerThreadFactory-6543-thread-1-processing-n:127.0.0.1:43629_solr) [n:127.0.0.1:43629_solr    ] o.a.s.c.c.ZkConfigManager Copying zk node /configs/_default/lang/stopwords_ar.txt to /configs/testMultipleWithCollections_abc.AUTOCREATED/lang/stopwords_ar.txt
   [junit4]   2> 1963759 INFO  (OverseerThreadFactory-6543-thread-1-processing-n:127.0.0.1:43629_solr) [n:127.0.0.1:43629_solr    ] o.a.s.c.c.ZkConfigManager Copying zk node /configs/_default/lang/userdict_ja.txt to /configs/testMultipleWithCollections_abc.AUTOCREATED/lang/userdict_ja.txt
   [junit4]   2> 1963759 INFO  (OverseerThreadFactory-6543-thread-1-processing-n:127.0.0.1:43629_solr) [n:127.0.0.1:43629_solr    ] o.a.s.c.c.ZkConfigManager Copying zk node /configs/_default/lang/stopwords_eu.txt to /configs/testMultipleWithCollections_abc.AUTOCREATED/lang/stopwords_eu.txt
   [junit4]   2> 1963760 INFO  (OverseerThreadFactory-6543-thread-1-processing-n:127.0.0.1:43629_solr) [n:127.0.0.1:43629_solr    ] o.a.s.c.c.ZkConfigManager Copying zk node /configs/_default/lang/stopwords_it.txt to /configs/testMultipleWithCollections_abc.AUTOCREATED/lang/stopwords_it.txt
   [junit4]   2> 1963762 INFO  (OverseerThreadFactory-6543-thread-1-processing-n:127.0.0.1:43629_solr) [n:127.0.0.1:43629_solr    ] o.a.s.c.c.ZkConfigManager Copying zk node /configs/_default/lang/stopwords_cz.txt to /configs/testMultipleWithCollections_abc.AUTOCREATED/lang/stopwords_cz.txt
   [junit4]   2> 1963762 INFO  (OverseerThreadFactory-6543-thread-1-processing-n:127.0.0.1:43629_solr) [n:127.0.0.1:43629_solr    ] o.a.s.c.c.ZkConfigManager Copying zk node /configs/_default/lang/stoptags_ja.txt to /configs/testMultipleWithCollections_abc.AUTOCREATED/lang/stoptags_ja.txt
   [junit4]   2> 1963763 INFO  (OverseerThreadFactory-6543-thread-1-processing-n:127.0.0.1:43629_solr) [n:127.0.0.1:43629_solr    ] o.a.s.c.c.ZkConfigManager Copying zk node /configs/_default/lang/contractions_fr.txt to /configs/testMultipleWithCollections_abc.AUTOCREATED/lang/contractions_fr.txt
   [junit4]   2> 1963764 INFO  (OverseerThreadFactory-6543-thread-1-processing-n:127.0.0.1:43629_solr) [n:127.0.0.1:43629_solr    ] o.a.s.c.c.ZkConfigManager Copying zk node /configs/_default/lang/stopwords_de.txt to /configs/testMultipleWithCollections_abc.AUTOCREATED/lang/stopwords_de.txt
   [junit4]   2> 1963766 INFO  (OverseerThreadFactory-6543-thread-1-processing-n:127.0.0.1:43629_solr) [n:127.0.0.1:43629_solr    ] o.a.s.c.c.ZkConfigManager Copying zk node /configs/_default/lang/stopwords_fa.txt to /configs/testMultipleWithCollections_abc.AUTOCREATED/lang/stopwords_fa.txt
   [junit4]   2> 1963767 INFO  (OverseerThreadFactory-6543-thread-1-processing-n:127.0.0.1:43629_solr) [n:127.0.0.1:43629_solr    ] o.a.s.c.c.ZkConfigManager Copying zk node /configs/_default/lang/contractions_ga.txt to /configs/testMultipleWithCollections_abc.AUTOCREATED/lang/contractions_ga.txt
   [junit4]   2> 1963767 INFO  (OverseerThreadFactory-6543-thread-1-processing-n:127.0.0.1:43629_solr) [n:127.0.0.1:43629_solr    ] o.a.s.c.c.ZkConfigManager Copying zk node /configs/_default/lang/stopwords_ca.txt to /configs/testMultipleWithCollections_abc.AUTOCREATED/lang/stopwords_ca.txt
   [junit4]   2> 1963768 INFO  (OverseerThreadFactory-6543-thread-1-processing-n:127.0.0.1:43629_solr) [n:127.0.0.1:43629_solr    ] o.a.s.c.c.ZkConfigManager Copying zk node /configs/_default/lang/stopwords_nl.txt to /configs/testMultipleWithCollections_abc.AUTOCREATED/lang/stopwords_nl.txt
   [junit4]   2> 1963769 INFO  (OverseerThreadFactory-6543-thread-1-processing-n:127.0.0.1:43629_solr) [n:127.0.0.1:43629_solr    ] o.a.s.c.c.ZkConfigManager Copying zk node /configs/_default/lang/stopwords_bg.txt to /configs/testMultipleWithCollections_abc.AUTOCREATED/lang/stopwords_bg.txt
   [junit4]   2> 1963769 INFO  (OverseerThreadFactory-6543-thread-1-processing-n:127.0.0.1:43629_solr) [n:127.0.0.1:43629_solr    ] o.a.s.c.c.ZkConfigManager Copying zk node /configs/_default/lang/stopwords_lv.txt to /configs/testMultipleWithCollections_abc.AUTOCREATED/lang/stopwords_lv.txt
   [junit4]   2> 1963770 INFO  (OverseerThreadFactory-6543-thread-1-processing-n:127.0.0.1:43629_solr) [n:127.0.0.1:43629_solr    ] o.a.s.c.c.ZkConfigManager Copying zk node /configs/_default/lang/stopwords_en.txt to /configs/testMultipleWithCollections_abc.AUTOCREATED/lang/stopwords_en.txt
   [junit4]   2> 1963771 INFO  (OverseerThreadFactory-6543-thread-1-processing-n:127.0.0.1:43629_solr) [n:127.0.0.1:43629_solr    ] o.a.s.c.c.ZkConfigManager Copying zk node /configs/_default/lang/stopwords_es.txt to /configs/testMultipleWithCollections_abc.AUTOCREATED/lang/stopwords_es.txt
   [junit4]   2> 1963771 INFO  (OverseerThreadFactory-6543-thread-1-processing-n:127.0.0.1:43629_solr) [n:127.0.0.1:43629_solr    ] o.a.s.c.c.ZkConfigManager Copying zk node /configs/_default/lang/stopwords_th.txt to /configs/testMultipleWithCollections_abc.AUTOCREATED/lang/stopwords_th.txt
   [junit4]   2> 1963772 INFO  (OverseerThreadFactory-6543-thread-1-processing-n:127.0.0.1:43629_solr) [n:127.0.0.1:43629_solr    ] o.a.s.c.c.ZkConfigManager Copying zk node /configs/_default/lang/stopwords_ro.txt to /configs/testMultipleWithCollections_abc.AUTOCREATED/lang/stopwords_ro.txt
   [junit4]   2> 1963773 INFO  (OverseerThreadFactory-6543-thread-1-processing-n:127.0.0.1:43629_solr) [n:127.0.0.1:43629_solr    ] o.a.s.c.c.ZkConfigManager Copying zk node /configs/_default/lang/stopwords_fr.txt to /configs/testMultipleWithCollections_abc.AUTOCREATED/lang/stopwords_fr.txt
   [junit4]   2> 1963773 INFO  (OverseerThreadFactory-6543-thread-1-processing-n:127.0.0.1:43629_solr) [n:127.0.0.1:43629_solr    ] o.a.s.c.c.ZkConfigManager Copying zk node /configs/_default/lang/stopwords_sv.txt to /configs/testMultipleWithCollections_abc.AUTOCREATED/lang/stopwords_sv.txt
   [junit4]   2> 1963774 INFO  (OverseerThreadFactory-6543-thread-1-processing-n:127.0.0.1:43629_solr) [n:127.0.0.1:43629_solr    ] o.a.s.c.c.ZkConfigManager Copying zk node /configs/_default/lang/stopwords_fi.txt to /configs/testMultipleWithCollections_abc.AUTOCREATED/lang/stopwords_fi.txt
   [junit4]   2> 1963774 INFO  (OverseerThreadFactory-6543-thread-1-processing-n:127.0.0.1:43629_solr) [n:127.0.0.1:43629_solr    ] o.a.s.c.c.ZkConfigManager Copying zk node /configs/_default/lang/hyphenations_ga.txt to /configs/testMultipleWithCollections_abc.AUTOCREATED/lang/hyphenations_ga.txt
   [junit4]   2> 1963775 INFO  (OverseerThreadFactory-6543-thread-1-processing-n:127.0.0.1:43629_solr) [n:127.0.0.1:43629_solr    ] o.a.s.c.c.ZkConfigManager Copying zk node /configs/_default/lang/stopwords_gl.txt to /configs/testMultipleWithCollections_abc.AUTOCREATED/lang/stopwords_gl.txt
   [junit4]   2> 1963776 INFO  (OverseerThreadFactory-6543-thread-1-processing-n:127.0.0.1:43629_solr) [n:127.0.0.1:43629_solr    ] o.a.s.c.c.ZkConfigManager Copying zk node /configs/_default/params.json to /configs/testMultipleWithCollections_abc.AUTOCREATED/params.json
   [junit4]   2> 1963778 DEBUG (OverseerStateUpdate-72256557024018436-127.0.0.1:43629_solr-n_0000000000) [n:127.0.0.1:43629_solr    ] o.a.s.c.o.ClusterStateMutator building a new cName: testMultipleWithCollections_abc
   [junit4]   2> 1963778 DEBUG (OverseerStateUpdate-72256557024018436-127.0.0.1:43629_solr-n_0000000000) [n:127.0.0.1:43629_solr    ] o.a.s.c.o.ZkStateWriter going to create_collection /collections/testMultipleWithCollections_abc/state.json
   [junit4]   2> 1963879 DEBUG (OverseerThreadFactory-6543-thread-1-processing-n:127.0.0.1:43629_solr) [n:127.0.0.1:43629_solr    ] o.a.s.c.s.c.a.PolicyHelper Creating a new session
   [junit4]   2> 1963880 INFO  (qtp14897804-19389) [n:127.0.0.1:43629_solr    ] o.a.s.s.HttpSolrCall [admin] webapp=null path=/admin/metrics params={prefix=CONTAINER.fs.usableSpace,CONTAINER.fs.totalSpace,CORE.coreName&wt=javabin&version=2&group=solr.node,solr.core} status=0 QTime=0
   [junit4]   2> 1963882 INFO  (qtp1926775567-19359) [n:127.0.0.1:37167_solr    ] o.a.s.s.HttpSolrCall [admin] webapp=null path=/admin/metrics params={prefix=CONTAINER.fs.usableSpace,CONTAINER.fs.totalSpace,CORE.coreName&wt=javabin&version=2&group=solr.node,solr.core} status=0 QTime=0
   [junit4]   2> 1963883 INFO  (qtp543022447-19251) [n:127.0.0.1:44249_solr    ] o.a.s.s.HttpSolrCall [admin] webapp=null path=/admin/metrics params={prefix=CONTAINER.fs.usableSpace,CONTAINER.fs.totalSpace,CORE.coreName&wt=javabin&version=2&group=solr.node,solr.core} status=0 QTime=0
   [junit4]   2> 1963885 INFO  (qtp739120267-19328) [n:127.0.0.1:41219_solr    ] o.a.s.s.HttpSolrCall [admin] webapp=null path=/admin/metrics params={prefix=CONTAINER.fs.usableSpace,CONTAINER.fs.totalSpace,CORE.coreName&wt=javabin&version=2&group=solr.node,solr.core} status=0 QTime=0
   [junit4]   2> 1963885 DEBUG (OverseerThreadFactory-6543-thread-1-processing-n:127.0.0.1:43629_solr) [n:127.0.0.1:43629_solr    ] o.a.s.c.s.c.a.PolicyHelper New session created 
   [junit4]   2> 1963889 INFO  (OverseerThreadFactory-6543-thread-1-processing-n:127.0.0.1:43629_solr) [n:127.0.0.1:43629_solr    ] o.a.s.c.s.c.a.PolicyHelper returnSession, curr-time 3035935378 sessionWrapper.createTime 3035935374690959, this.sessionWrapper.createTime 3035935374690959 
   [junit4]   2> 1963892 INFO  (OverseerStateUpdate-72256557024018436-127.0.0.1:43629_solr-n_0000000000) [n:127.0.0.1:43629_solr    ] o.a.s.c.o.SliceMutator createReplica() {
   [junit4]   2>   "operation":"ADDREPLICA",
   [junit4]   2>   "collection":"testMultipleWithCollections_abc",
   [junit4]   2>   "shard":"shard1",
   [junit4]   2>   "core":"testMultipleWithCollections_abc_shard1_replica_n1",
   [junit4]   2>   "state":"down",
   [junit4]   2>   "base_url":"https://127.0.0.1:43629/solr",
   [junit4]   2>   "type":"NRT",
   [junit4]   2>   "waitForFinalState":"false"} 
   [junit4]   2> 1963892 DEBUG (OverseerStateUpdate-72256557024018436-127.0.0.1:43629_solr-n_0000000000) [n:127.0.0.1:43629_solr    ] o.a.s.c.o.SliceMutator Old Slice: shard1:{
   [junit4]   2>   "range":"80000000-7fffffff",
   [junit4]   2>   "state":"active",
   [junit4]   2>   "replicas":{}}
   [junit4]   2> 1963892 DEBUG (OverseerStateUpdate-72256557024018436-127.0.0.1:43629_solr-n_0000000000) [n:127.0.0.1:43629_solr    ] o.a.s.c.o.SliceMutator New Slice: shard1:{
   [junit4]   2>   "range":"80000000-7fffffff",
   [junit4]   2>   "state":"active",
   [junit4]   2>   "replicas":{"core_node2":{
   [junit4]   2>       "core":"testMultipleWithCollections_abc_shard1_replica_n1",
   [junit4]   2>       "base_url":"https://127.0.0.1:43629/solr",
   [junit4]   2>       "state":"down",
   [junit4]   2>       "node_name":null,
   [junit4]   2>       "type":"NRT"}}}
   [junit4]   2> 1963992 DEBUG (OverseerStateUpdate-72256557024018436-127.0.0.1:43629_solr-n_0000000000) [n:127.0.0.1:43629_solr    ] o.a.s.c.o.ZkStateWriter going to update_collection /collections/testMultipleWithCollections_abc/state.json version: 0
   [junit4]   2> 1964100 INFO  (qtp14897804-19257) [n:127.0.0.1:43629_solr    x:testMultipleWithCollections_abc_shard1_replica_n1] o.a.s.h.a.CoreAdminOperation core create command qt=/admin/cores&coreNodeName=core_node2&collection.configName=testMultipleWithCollections_abc.AUTOCREATED&newCollection=true&name=testMultipleWithCollections_abc_shard1_replica_n1&action=CREATE&numShards=1&collection=testMultipleWithCollections_abc&shard=shard1&wt=javabin&version=2&replicaType=NRT
   [junit4]   2> 1964104 DEBUG (OverseerStateUpdate-72256557024018436-127.0.0.1:43629_solr-n_0000000000) [n:127.0.0.1:43629_solr    ] o.a.s.c.o.ReplicaMutator Update state numShards=1 message={
   [junit4]   2>   "core":"testMultipleWithCollections_abc_shard1_replica_n1",
   [junit4]   2>   "core_node_name":"core_node2",
   [junit4]   2>   "roles":null,
   [junit4]   2>   "base_url":"https://127.0.0.1:43629/solr",
   [junit4]   2>   "node_name":"127.0.0.1:43629_solr",
   [junit4]   2>   "numShards":"1",
   [junit4]   2>   "state":"down",
   [junit4]   2>   "shard":"shard1",
   [junit4]   2>   "collection":"testMultipleWithCollections_abc",
   [junit4]   2>   "type":"NRT",
   [junit4]   2>   "force_set_state":"false",
   [junit4]   2>   "operation":"state"}
   [junit4]   2> 1964104 DEBUG (OverseerStateUpdate-72256557024018436-127.0.0.1:43629_solr-n_0000000000) [n:127.0.0.1:43629_solr    ] o.a.s.c.o.ReplicaMutator Will update state for replica: core_node2:{"core":"testMultipleWithCollections_abc_shard1_replica_n1","base_url":"https://127.0.0.1:43629/solr","node_name":"127.0.0.1:43629_solr","state":"down","type":"NRT","force_set_state":"false"}
   [junit4]   2> 1964104 DEBUG (OverseerStateUpdate-72256557024018436-127.0.0.1:43629_solr-n_0000000000) [n:127.0.0.1:43629_solr    ] o.a.s.c.o.ReplicaMutator Collection is now: DocCollection(testMultipleWithCollections_abc//collections/testMultipleWithCollections_abc/state.json/1)={
   [junit4]   2>   "pullReplicas":"0",
   [junit4]   2>   "replicationFactor":"1",
   [junit4]   2>   "router":{"name":"compositeId"},
   [junit4]   2>   "maxShardsPerNode":"1",
   [junit4]   2>   "autoAddReplicas":"false",
   [junit4]   2>   "nrtReplicas":"1",
   [junit4]   2>   "tlogReplicas":"0",
   [junit4]   2>   "shards":{"shard1":{
   [junit4]   2>       "range":"80000000-7fffffff",
   [junit4]   2>       "state":"active",
   [junit4]   2>       "replicas":{"core_node2":{
   [junit4]   2>           "core":"testMultipleWithCollections_abc_shard1_replica_n1",
   [junit4]   2>           "base_url":"https://127.0.0.1:43629/solr",
   [junit4]   2>           "node_name":"127.0.0.1:43629_solr",
   [junit4]   2>           "state":"down",
   [junit4]   2>           "type":"NRT",
   [junit4]   2>           "force_set_state":"false"}}}}}
   [junit4]   2> 1964205 DEBUG (OverseerStateUpdate-72256557024018436-127.0.0.1:43629_solr-n_0000000000) [n:127.0.0.1:43629_solr    ] o.a.s.c.o.ZkStateWriter going to update_collection /collections/testMultipleWithCollections_abc/state.json version: 1
   [junit4]   2> 1965112 INFO  (qtp14897804-19257) [n:127.0.0.1:43629_solr c:testMultipleWithCollections_abc s:shard1 r:core_node2 x:testMultipleWithCollections_abc_shard1_replica_n1] o.a.s.c.RequestParams conf resource params.json loaded . version : 0 
   [junit4]   2> 1965112 INFO  (qtp14897804-19257) [n:127.0.0.1:43629_solr c:testMultipleWithCollections_abc s:shard1 r:core_node2 x:testMultipleWithCollections_abc_shard1_replica_n1] o.a.s.c.RequestParams request params refreshed to version 0
   [junit4]   2> 1965112 WARN  (qtp14897804-19257) [n:127.0.0.1:43629_solr c:testMultipleWithCollections_abc s:shard1 r:core_node2 x:testMultipleWithCollections_abc_shard1_replica_n1] o.a.s.c.SolrConfig Couldn't add files from /home/jenkins/workspace/Lucene-Solr-7.x-Linux/solr/build/solr-core/test/J0/temp/solr.cloud.TestWithCollection_AEBD9C0133E3AE84-001/tempDir-001/node2/testMultipleWithCollections_abc_shard1_replica_n1/../../../../contrib/extraction/lib filtered by .*\.jar to classpath: /home/jenkins/workspace/Lucene-Solr-7.x-Linux/solr/build/solr-core/test/J0/temp/solr.cloud.TestWithCollection_AEBD9C0133E3AE84-001/tempDir-001/node2/testMultipleWithCollections_abc_shard1_replica_n1/../../../../contrib/extraction/lib
   [junit4]   2> 1965112 WARN  (qtp14897804-19257) [n:127.0.0.1:43629_solr c:testMultipleWithCollections_abc s:shard1 r:core_node2 x:testMultipleWithCollections_abc_shard1_replica_n1] o.a.s.c.SolrConfig Couldn't add files from /home/jenkins/workspace/Lucene-Solr-7.x-Linux/solr/build/solr-core/test/J0/temp/solr.cloud.TestWithCollection_AEBD9C0133E3AE84-001/tempDir-001/node2/testMultipleWithCollections_abc_shard1_replica_n1/../../../../dist filtered by solr-cell-\d.*\.jar to classpath: /home/jenkins/workspace/Lucene-Solr-7.x-Linux/solr/build/solr-core/test/J0/temp/solr.cloud.TestWithCollection_AEBD9C0133E3AE84-001/tempDir-001/node2/testMultipleWithCollections_abc_shard1_replica_n1/../../../../dist
   [junit4]   2> 1965113 WARN  (qtp14897804-19257) [n:127.0.0.1:43629_solr c:testMultipleWithCollections_abc s:shard1 r:core_node2 x:testMultipleWithCollections_abc_shard1_replica_n1] o.a.s.c.SolrConfig Couldn't add files from /home/jenkins/workspace/Lucene-Solr-7.x-Linux/solr/build/solr-core/test/J0/temp/solr.cloud.TestWithCollection_AEBD9C0133E3AE84-001/tempDir-001/node2/testMultipleWithCollections_abc_shard1_replica_n1/../../../../contrib/clustering/lib filtered by .*\.jar to classpath: /home/jenkins/workspace/Lucene-Solr-7.x-Linux/solr/build/solr-core/test/J0/temp/solr.cloud.TestWithCollection_AEBD9C0133E3AE84-001/tempDir-001/node2/testMultipleWithCollections_abc_shard1_replica_n1/../../../../contrib/clustering/lib
   [junit4]   2> 1965113 WARN  (qtp14897804-19257) [n:127.0.0.1:43629_solr c:testMultipleWithCollections_abc s:shard1 r:core_node2 x:testMultipleWithCollections_abc_shard1_replica_n1] o.a.s.c.SolrConfig Couldn't add files from /home/jenkins/workspace/Lucene-Solr-7.x-Linux/solr/build/solr-core/test/J0/temp/solr.cloud.TestWithCollection_AEBD9C0133E3AE84-001/tempDir-001/node2/testMultipleWithCollections_abc_shard1_replica_n1/../../../../dist filtered by solr-clustering-\d.*\.jar to classpath: /home/jenkins/workspace/Lucene-Solr-7.x-Linux/solr/build/solr-core/test/J0/temp/solr.cloud.TestWithCollection_AEBD9C0133E3AE84-001/tempDir-001/node2/testMultipleWithCollections_abc_shard1_replica_n1/../../../../dist
   [junit4]   2> 1965113 WARN  (qtp14897804-19257) [n:127.0.0.1:43629_solr c:testMultipleWithCollections_abc s:shard1 r:core_node2 x:testMultipleWithCollections_abc_shard1_replica_n1] o.a.s.c.SolrConfig Couldn't add files from /home/jenkins/workspace/Lucene-Solr-7.x-Linux/solr/build/solr-core/test/J0/temp/solr.cloud.TestWithCollection_AEBD9C0133E3AE84-001/tempDir-001/node2/testMultipleWithCollections_abc_shard1_replica_n1/../../../../contrib/langid/lib filtered by .*\.jar to classpath: /home/jenkins/workspace/Lucene-Solr-7.x-Linux/solr/build/solr-core/test/J0/temp/solr.cloud.TestWithCollection_AEBD9C0133E3AE84-001/tempDir-001/node2/testMultipleWithCollections_abc_shard1_replica_n1/../../../../contrib/langid/lib
   [junit4]   2> 1965113 WARN  (qtp14897804-19257) [n:127.0.0.1:43629_solr c:testMultipleWithCollections_abc s:shard1 r:core_node2 x:testMultipleWithCollections_abc_shard1_replica_n1] o.a.s.c.SolrConfig Couldn't add files from /home/jenkins/workspace/Lucene-Solr-7.x-Linux/solr/build/solr-core/test/J0/temp/solr.cloud.TestWithCollection_AEBD9C0133E3AE84-001/tempDir-001/node2/testMultipleWithCollections_abc_shard1_replica_n1/../../../../dist filtered by solr-langid-\d.*\.jar to classpath: /home/jenkins/workspace/Lucene-Solr-7.x-Linux/solr/build/solr-core/test/J0/temp/solr.cloud.TestWithCollection_AEBD9C0133E3AE84-001/tempDir-001/node2/testMultipleWithCollections_abc_shard1_replica_n1/../../../../dist
   [junit4]   2> 1965113 WARN  (qtp14897804-19257) [n:127.0.0.1:43629_solr c:testMultipleWithCollections_abc s:shard1 r:core_node2 x:testMultipleWithCollections_abc_shard1_replica_n1] o.a.s.c.SolrConfig Couldn't add files from /home/jenkins/workspace/Lucene-Solr-7.x-Linux/solr/build/solr-core/test/J0/temp/solr.cloud.TestWithCollection_AEBD9C0133E3AE84-001/tempDir-001/node2/testMultipleWithCollections_abc_shard1_replica_n1/../../../../contrib/velocity/lib filtered by .*\.jar to classpath: /home/jenkins/workspace/Lucene-Solr-7.x-Linux/solr/build/solr-core/test/J0/temp/solr.cloud.TestWithCollection_AEBD9C0133E3AE84-001/tempDir-001/node2/testMultipleWithCollections_abc_shard1_replica_n1/../../../../contrib/velocity/lib
   [junit4]   2> 1965113 WARN  (qtp14897804-19257) [n:127.0.0.1:43629_solr c:testMultipleWithCollections_abc s:shard1 r:core_node2 x:testMultipleWithCollections_abc_shard1_replica_n1] o.a.s.c.SolrConfig Couldn't add files from /home/jenkins/workspace/Lucene-Solr-7.x-Linux/solr/build/solr-core/test/J0/temp/solr.cloud.TestWithCollection_AEBD9C0133E3AE84-001/tempDir-001/node2/testMultipleWithCollections_abc_shard1_replica_n1/../../../../dist filtered by solr-velocity-\d.*\.jar to classpath: /home/jenkins/workspace/Lucene-Solr-7.x-Linux/solr/build/solr-core/test/J0/temp/solr.cloud.TestWithCollection_AEBD9C0133E3AE84-001/tempDir-001/node2/testMultipleWithCollections_abc_shard1_replica_n1/../../../../dist
   [junit4]   2> 1965121 INFO  (qtp14897804-19257) [n:127.0.0.1:43629_solr c:testMultipleWithCollections_abc s:shard1 r:core_node2 x:testMultipleWithCollections_abc_shard1_replica_n1] o.a.s.c.SolrConfig Using Lucene MatchVersion: 7.6.0
   [junit4]   2> 1965139 INFO  (qtp14897804-19257) [n:127.0.0.1:43629_solr c:testMultipleWithCollections_abc s:shard1 r:core_node2 x:testMultipleWithCollections_abc_shard1_replica_n1] o.a.s.s.IndexSchema [testMultipleWithCollections_abc_shard1_replica_n1] Schema name=default-config
   [junit4]   2> 1965283 INFO  (qtp14897804-19257) [n:127.0.0.1:43629_solr c:testMultipleWithCollections_abc s:shard1 r:core_node2 x:testMultipleWithCollections_abc_shard1_replica_n1] o.a.s.s.IndexSchema Loaded schema default-config/1.6 with uniqueid field id
   [junit4]   2> 1965296 INFO  (qtp14897804-19257) [n:127.0.0.1:43629_solr c:testMultipleWithCollections_abc s:shard1 r:core_node2 x:testMultipleWithCollections_abc_shard1_replica_n1] o.a.s.c.CoreContainer Creating SolrCore 'testMultipleWithCollections_abc_shard1_replica_n1' using configuration from collection testMultipleWithCollections_abc, trusted=true
   [junit4]   2> 1965297 INFO  (qtp14897804-19257) [n:127.0.0.1:43629_solr c:testMultipleWithCollections_abc s:shard1 r:core_node2 x:testMultipleWithCollections_abc_shard1_replica_n1] o.a.s.m.r.SolrJmxReporter JMX monitoring for 'solr_43629.solr.core.testMultipleWithCollections_abc.shard1.replica_n1' (registry 'solr.core.testMultipleWithCollections_abc.shard1.replica_n1') enabled at server: com.sun.jmx.mbeanserver.JmxMBeanServer@4fa4c48d
   [junit4]   2> 1965297 INFO  (qtp14897804-19257) [n:127.0.0.1:43629_solr c:testMultipleWithCollections_abc s:shard1 r:core_node2 x:testMultipleWithCollections_abc_shard1_replica_n1] o.a.s.c.SolrCore [[testMultipleWithCollections_abc_shard1_replica_n1] ] Opening new SolrCore at [/home/jenkins/workspace/Lucene-Solr-7.x-Linux/solr/build/solr-core/test/J0/temp/solr.cloud.TestWithCollection_AEBD9C0133E3AE84-001/tempDir-001/node2/testMultipleWithCollections_abc_shard1_replica_n1], dataDir=[/home/jenkins/workspace/Lucene-Solr-7.x-Linux/solr/build/solr-core/test/J0/temp/solr.cloud.TestWithCollection_AEBD9C0133E3AE84-001/tempDir-001/node2/./testMultipleWithCollections_abc_shard1_replica_n1/data/]
   [junit4]   2> 1965300 INFO  (qtp14897804-19257) [n:127.0.0.1:43629_solr c:testMultipleWithCollections_abc s:shard1 r:core_node2 x:testMultipleWithCollections_abc_shard1_replica_n1] o.a.s.r.XSLTResponseWriter xsltCacheLifetimeSeconds=5
   [junit4]   2> 1965340 INFO  (qtp14897804-19257) [n:127.0.0.1:43629_solr c:testMultipleWithCollections_abc s:shard1 r:core_node2 x:testMultipleWithCollections_abc_shard1_replica_n1] o.a.s.u.UpdateHandler Using UpdateLog implementation: org.apache.solr.update.UpdateLog
   [junit4]   2> 1965341 INFO  (qtp14897804-19257) [n:127.0.0.1:43629_solr c:testMultipleWithCollections_abc s:shard1 r:core_node2 x:testMultipleWithCollections_abc_shard1_replica_n1] o.a.s.u.UpdateLog Initializing UpdateLog: dataDir= defaultSyncLevel=FLUSH numRecordsToKeep=100 maxNumLogsToKeep=10 numVersionBuckets=65536
   [junit4]   2> 1965342 INFO  (qtp14897804-19257) [n:127.0.0.1:43629_solr c:testMultipleWithCollections_abc s:shard1 r:core_node2 x:testMultipleWithCollections_abc_shard1_replica_n1] o.a.s.u.CommitTracker Hard AutoCommit: if uncommitted for 15000ms; 
   [junit4]   2> 1965342 INFO  (qtp14897804-19257) [n:127.0.0.1:43629_solr c:testMultipleWithCollections_abc s:shard1 r:core_node2 x:testMultipleWithCollections_abc_shard1_replica_n1] o.a.s.u.CommitTracker Soft AutoCommit: disabled
   [junit4]   2> 1965343 INFO  (qtp14897804-19257) [n:127.0.0.1:43629_solr c:testMultipleWithCollections_abc s:shard1 r:core_node2 x:testMultipleWithCollections_abc_shard1_replica_n1] o.a.s.s.SolrIndexSearcher Opening [Searcher@7bbf171b[testMultipleWithCollections_abc_shard1_replica_n1] main]
   [junit4]   2> 1965343 INFO  (qtp14897804-19257) [n:127.0.0.1:43629_solr c:testMultipleWithCollections_abc s:shard1 r:core_node2 x:testMultipleWithCollections_abc_shard1_replica_n1] o.a.s.r.ManagedResourceStorage Configured ZooKeeperStorageIO with znodeBase: /configs/testMultipleWithCollections_abc.AUTOCREATED
   [junit4]   2> 1965344 INFO  (qtp14897804-19257) [n:127.0.0.1:43629_solr c:testMultipleWithCollections_abc s:shard1 r:core_node2 x:testMultipleWithCollections_abc_shard1_replica_n1] o.a.s.r.ManagedResourceStorage Loaded null at path _rest_managed.json using ZooKeeperStorageIO:path=/configs/testMultipleWithCollections_abc.AUTOCREATED
   [junit4]   2> 1965344 INFO  (qtp14897804-19257) [n:127.0.0.1:43629_solr c:testMultipleWithCollections_abc s:shard1 r:core_node2 x:testMultipleWithCollections_abc_shard1_replica_n1] o.a.s.s.ZkIndexSchemaReader Creating ZooKeeper watch for the managed schema at /configs/testMultipleWithCollections_abc.AUTOCREATED/managed-schema
   [junit4]   2> 1965344 INFO  (qtp14897804-19257) [n:127.0.0.1:43629_solr c:testMultipleWithCollections_abc s:shard1 r:core_node2 x:testMultipleWithCollections_abc_shard1_replica_n1] o.a.s.s.ZkIndexSchemaReader Current schema version 0 is already the latest
   [junit4]   2> 1965344 INFO  (qtp14897804-19257) [n:127.0.0.1:43629_solr c:testMultipleWithCollections_abc s:shard1 r:core_node2 x:testMultipleWithCollections_abc_shard1_replica_n1] o.a.s.h.c.SpellCheckComponent Initializing spell checkers
   [junit4]   2> 1965345 INFO  (qtp14897804-19257) [n:127.0.0.1:43629_solr c:testMultipleWithCollections_abc s:shard1 r:core_node2 x:testMultipleWithCollections_abc_shard1_replica_n1] o.a.s.s.DirectSolrSpellChecker init: {name=default,field=_text_,classname=solr.DirectSolrSpellChecker,distanceMeasure=internal,accuracy=0.5,maxEdits=2,minPrefix=1,maxInspections=5,minQueryLength=4,maxQueryFrequency=0.01}
   [junit4]   2> 1965346 INFO  (qtp14897804-19257) [n:127.0.0.1:43629_solr c:testMultipleWithCollections_abc s:shard1 r:core_node2 x:testMultipleWithCollections_abc_shard1_replica_n1] o.a.s.h.ReplicationHandler Commits will be reserved for 10000ms.
   [junit4]   2> 1965346 INFO  (qtp14897804-19257) [n:127.0.0.1:43629_solr c:testMultipleWithCollections_abc s:shard1 r:core_node2 x:testMultipleWithCollections_abc_shard1_replica_n1] o.a.s.u.UpdateLog Could not find max version in index or recent updates, using new clock 1612122957238239232
   [junit4]   2> 1965346 INFO  (searcherExecutor-6570-thread-1-processing-n:127.0.0.1:43629_solr x:testMultipleWithCollections_abc_shard1_replica_n1 c:testMultipleWithCollections_abc s:shard1 r:core_node2) [n:127.0.0.1:43629_solr c:testMultipleWithCollections_abc s:shard1 r:core_node2 x:testMultipleWithCollections_abc_shard1_replica_n1] o.a.s.c.QuerySenderListener QuerySenderListener sending requests to Searcher@7bbf171b[testMultipleWithCollections_abc_shard1_replica_n1] main{ExitableDirectoryReader(UninvertingDirectoryReader())}
   [junit4]   2> 1965346 INFO  (searcherExecutor-6570-thread-1-processing-n:127.0.0.1:43629_solr x:testMultipleWithCollections_abc_shard1_replica_n1 c:testMultipleWithCollections_abc s:shard1 r:core_node2) [n:127.0.0.1:43629_solr c:testMultipleWithCollections_abc s:shard1 r:core_node2 x:testMultipleWithCollections_abc_shard1_replica_n1] o.a.s.c.QuerySenderListener QuerySenderListener done.
   [junit4]   2> 1965346 INFO  (searcherExecutor-6570-thread-1-processing-n:127.0.0.1:43629_solr x:testMultipleWithCollections_abc_shard1_replica_n1 c:testMultipleWithCollections_abc s:shard1 r:core_node2) [n:127.0.0.1:43629_solr c:testMultipleWithCollections_abc s:shard1 r:core_node2 x:testMultipleWithCollections_abc_shard1_replica_n1] o.a.s.h.c.SpellCheckComponent Loading spell index for spellchecker: default
   [junit4]   2> 1965347 INFO  (searcherExecutor-6570-thread-1-processing-n:127.0.0.1:43629_solr x:testMultipleWithCollections_abc_shard1_replica_n1 c:testMultipleWithCollections_abc s:shard1 r:core_node2) [n:127.0.0.1:43629_solr c:testMultipleWithCollections_abc s:shard1 r:core_node2 x:testMultipleWithCollections_abc_shard1_replica_n1] o.a.s.c.SolrCore [testMultipleWithCollections_abc_shard1_replica_n1] Registered new searcher Searcher@7bbf171b[testMultipleWithCollections_abc_shard1_replica_n1] main{ExitableDirectoryReader(UninvertingDirectoryReader())}
   [junit4]   2> 1965350 INFO  (qtp14897804-19257) [n:127.0.0.1:43629_solr c:testMultipleWithCollections_abc s:shard1 r:core_node2 x:testMultipleWithCollections_abc_shard1_replica_n1] o.a.s.c.ZkShardTerms Successful update of terms at /collections/testMultipleWithCollections_abc/terms/shard1 to Terms{values={core_node2=0}, version=0}
   [junit4]   2> 1965352 INFO  (qtp14897804-19257) [n:127.0.0.1:43629_solr c:testMultipleWithCollections_abc s:shard1 r:core_node2 x:testMultipleWithCollections_abc_shard1_replica_n1] o.a.s.c.ShardLeaderElectionContext Enough replicas found to continue.
   [junit4]   2> 1965352 INFO  (qtp14897804-19257) [n:127.0.0.1:43629_solr c:testMultipleWithCollections_abc s:shard1 r:core_node2 x:testMultipleWithCollections_abc_shard1_replica_n1] o.a.s.c.ShardLeaderElectionContext I may be the new leader - try and sync
   [junit4]   2> 1965352 INFO  (qtp14897804-19257) [n:127.0.0.1:43629_solr c:testMultipleWithCollections_abc s:shard1 r:core_node2 x:testMultipleWithCollections_abc_shard1_replica_n1] o.a.s.c.SyncStrategy Sync replicas to https://127.0.0.1:43629/solr/testMultipleWithCollections_abc_shard1_replica_n1/
   [junit4]   2> 1965352 INFO  (qtp14897804-19257) [n:127.0.0.1:43629_solr c:testMultipleWithCollections_abc s:shard1 r:core_node2 x:testMultipleWithCollections_abc_shard1_replica_n1] o.a.s.c.SyncStrategy Sync Success - now sync replicas to me
   [junit4]   2> 1965352 INFO  (qtp14897804-19257) [n:127.0.0.1:43629_solr c:testMultipleWithCollections_abc s:shard1 r:core_node2 x:testMultipleWithCollections_abc_shard1_replica_n1] o.a.s.c.SyncStrategy https://127.0.0.1:43629/solr/testMultipleWithCollections_abc_shard1_replica_n1/ has no replicas
   [junit4]   2> 1965352 INFO  (qtp14897804-19257) [n:127.0.0.1:43629_solr c:testMultipleWithCollections_abc s:shard1 r:core_node2 x:testMultipleWithCollections_abc_shard1_replica_n1] o.a.s.c.ShardLeaderElectionContext Found all replicas participating in election, clear LIR
   [junit4]   2> 1965355 INFO  (qtp14897804-19257) [n:127.0.0.1:43629_solr c:testMultipleWithCollections_abc s:shard1 r:core_node2 x:testMultipleWithCollections_abc_shard1_replica_n1] o.a.s.c.ShardLeaderElectionContext I am the new leader: https://127.0.0.1:43629/solr/testMultipleWithCollections_abc_shard1_replica_n1/ shard1
   [junit4]   2> 1965455 DEBUG (OverseerStateUpdate-72256557024018436-127.0.0.1:43629_solr-n_0000000000) [n:127.0.0.1:43629_solr    ] o.a.s.c.o.ZkStateWriter going to update_collection /collections/testMultipleWithCollections_abc/state.json version: 2
   [junit4]   2> 1965456 INFO  (qtp14897804-19257) [n:127.0.0.1:43629_solr c:testMultipleWithCollections_abc s:shard1 r:core_node2 x:testMultipleWithCollections_abc_shard1_replica_n1] o.a.s.c.ZkController I am the leader, no recovery necessary
   [junit4]   2> 1965457 DEBUG (OverseerStateUpdate-72256557024018436-127.0.0.1:43629_solr-n_0000000000) [n:127.0.0.1:43629_solr    ] o.a.s.c.o.ReplicaMutator Update state numShards=1 message={
   [junit4]   2>   "core":"testMultipleWithCollections_abc_shard1_replica_n1",
   [junit4]   2>   "core_node_name":"core_node2",
   [junit4]   2>   "roles":null,
   [junit4]   2>   "base_url":"https://127.0.0.1:43629/solr",
   [junit4]   2>   "node_name":"127.0.0.1:43629_solr",
   [junit4]   2>   "numShards":"1",
   [junit4]   2>   "state":"active",
   [junit4]   2>   "shard":"shard1",
   [junit4]   2>   "collection":"testMultipleWithCollections_abc",
   [junit4]   2>   "type":"NRT",
   [junit4]   2>   "force_set_state":"false",
   [junit4]   2>   "operation":"state"}
   [junit4]   2> 1965457 DEBUG (OverseerStateUpdate-72256557024018436-127.0.0.1:43629_solr-n_0000000000) [n:127.0.0.1:43629_solr    ] o.a.s.c.o.ReplicaMutator Will update state for replica: core_node2:{"core":"testMultipleWithCollections_abc_shard1_replica_n1","base_url":"https://127.0.0.1:43629/solr","node_name":"127.0.0.1:43629_solr","state":"active","type":"NRT","force_set_state":"false","leader":"true"}
   [junit4]   2> 1965457 DEBUG (OverseerStateUpdate-72256557024018436-127.0.0.1:43629_solr-n_0000000000) [n:127.0.0.1:43629_solr    ] o.a.s.c.o.ReplicaMutator Collection is now: DocCollection(testMultipleWithCollections_abc//collections/testMultipleWithCollections_abc/state.json/3)={
   [junit4]   2>   "pullReplicas":"0",
   [junit4]   2>   "replicationFactor":"1",
   [junit4]   2>   "router":{"name":"compositeId"},
   [junit4]   2>   "maxShardsPerNode":"1",
   [junit4]   2>   "autoAddReplicas":"false",
   [junit4]   2>   "nrtReplicas":"1",
   [junit4]   2>   "tlogReplicas":"0",
   [junit4]   2>   "shards":{"shard1":{
   [junit4]   2>       "range":"80000000-7fffffff",
   [junit4]   2>       "state":"active",
   [junit4]   2>       "replicas":{"core_node2":{
   [junit4]   2>           "core":"testMultipleWithCollections_abc_shard1_replica_n1",
   [junit4]   2>           "base_url":"https://127.0.0.1:43629/solr",
   [junit4]   2>           "node_name":"127.0.0.1:43629_solr",
   [junit4]   2>           "state":"active",
   [junit4]   2>           "type":"NRT",
   [junit4]   2>           "force_set_state":"false",
   [junit4]   2>           "leader":"true"}}}}}
   [junit4]   2> 1965493 INFO  (qtp14897804-19257) [n:127.0.0.1:43629_solr c:testMultipleWithCollections_abc s:shard1 r:core_node2 x:testMultipleWithCollections_abc_shard1_replica_n1] o.a.s.s.HttpSolrCall [admin] webapp=null path=/admin/cores params={qt=/admin/cores&coreNodeName=core_node2&collection.configName=testMultipleWithCollections_abc.AUTOCREATED&newCollection=true&name=testMultipleWithCollections_abc_shard1_replica_n1&action=CREATE&numShards=1&collection=testMultipleWithCollections_abc&shard=shard1&wt=javabin&version=2&replicaType=NRT} status=0 QTime=1393
   [junit4]   2> 1965494 DEBUG (OverseerThreadFactory-6543-thread-1-processing-n:127.0.0.1:43629_solr) [n:127.0.0.1:43629_solr    ] o.a.s.c.s.c.a.PolicyHelper session set to NULL
   [junit4]   2> 1965495 INFO  (qtp1926775567-19357) [n:127.0.0.1:37167_solr    ] o.a.s.h.a.CollectionsHandler Wait for new collection to be active for at most 30 seconds. Check all shard replicas
   [junit4]   2> 1965558 DEBUG (OverseerStateUpdate-72256557024018436-127.0.0.1:43629_solr-n_0000000000) [n:127.0.0.1:43629_solr    ] o.a.s.c.o.ZkStateWriter going to update_collection /collections/testMultipleWithCollections_abc/state.json version: 3
   [junit4]   2> 1965558 INFO  (zkCallback-5325-thread-1) [    ] o.a.s.c.c.ZkStateReader A cluster state change: [WatchedEvent state:SyncConnected type:NodeDataChanged path:/collections/testMultipleWithCollections_abc/state.json] for collection [testMultipleWithCollections_abc] has occurred - updating... (live nodes size: [4])
   [junit4]   2> 1965744 INFO  (OverseerCollectionConfigSetProcessor-72256557024018436-127.0.0.1:43629_solr-n_0000000000) [n:127.0.0.1:43629_solr    ] o.a.s.c.OverseerTaskQueue Response ZK path: /overseer/collection-queue-work/qnr-0000000000 doesn't exist.  Requestor may have disconnected from ZooKeeper
   [junit4]   2> 1966496 INFO  (qtp1926775567-19357) [n:127.0.0.1:37167_solr    ] o.a.s.s.HttpSolrCall [admin] webapp=null path=/admin/collections params={pullReplicas=0&name=testMultipleWithCollections_abc&nrtReplicas=1&action=CREATE&numShards=1&tlogReplicas=0&createNodeSet=127.0.0.1:43629_solr&wt=javabin&version=2} status=0 QTime=2754
   [junit4]   2> 1966497 INFO  (qtp14897804-19255) [n:127.0.0.1:43629_solr    ] o.a.s.h.a.CollectionsHandler Invoked Collection Action :create with params pullReplicas=0&withCollection=testMultipleWithCollections_abc&name=testMultipleWithCollections_xyz&nrtReplicas=1&action=CREATE&numShards=1&tlogReplicas=0&wt=javabin&version=2 and sendToOCPQueue=true
   [junit4]   2> 1966498 INFO  (OverseerThreadFactory-6543-thread-2-processing-n:127.0.0.1:43629_solr) [n:127.0.0.1:43629_solr    ] o.a.s.c.a.c.CreateCollectionCmd Create collection testMultipleWithCollections_xyz
   [junit4]   2> 1966500 INFO  (OverseerThreadFactory-6543-thread-2-processing-n:127.0.0.1:43629_solr) [n:127.0.0.1:43629_solr    ] o.a.s.c.c.ZkConfigManager Copying zk node /configs/_default/protwords.txt to /configs/testMultipleWithCollections_xyz.AUTOCREATED/protwords.txt
   [junit4]   2> 1966500 INFO  (OverseerThreadFactory-6543-thread-2-processing-n:127.0.0.1:43629_solr) [n:127.0.0.1:43629_solr    ] o.a.s.c.c.ZkConfigManager Copying zk node /configs/_default/managed-schema to /configs/testMultipleWithCollections_xyz.AUTOCREATED/managed-schema
   [junit4]   2> 1966501 INFO  (OverseerThreadFactory-6543-thread-2-processing-n:127.0.0.1:43629_solr) [n:127.0.0.1:43629_solr    ] o.a.s.c.c.ZkConfigManager Copying zk node /configs/_default/solrconfig.xml to /configs/testMultipleWithCollections_xyz.AUTOCREATED/solrconfig.xml
   [junit4]   2> 1966502 INFO  (OverseerThreadFactory-6543-thread-2-processing-n:127.0.0.1:43629_solr) [n:127.0.0.1:43629_solr    ] o.a.s.c.c.ZkConfigManager Copying zk node /configs/_default/synonyms.txt to /configs/testMultipleWithCollections_xyz.AUTOCREATED/synonyms.txt
   [junit4]   2> 1966503 INFO  (OverseerThreadFactory-6543-thread-2-processing-n:127.0.0.1:43629_solr) [n:127.0.0.1:43629_solr    ] o.a.s.c.c.ZkConfigManager Copying zk node /configs/_default/stopwords.txt to /configs/testMultipleWithCollections_xyz.AUTOCREATED/stopwords.txt
   [junit4]   2> 1966503 INFO  (OverseerThreadFactory-6543-thread-2-processing-n:127.0.0.1:43629_solr) [n:127.0.0.1:43629_solr    ] o.a.s.c.c.ZkConfigManager Copying zk node /configs/_default/lang/contractions_it.txt to /configs/testMultipleWithCollections_xyz.AUTOCREATED/lang/contractions_it.txt
   [junit4]   2> 1966504 INFO  (OverseerThreadFactory-6543-thread-2-processing-n:127.0.0.1:43629_solr) [n:127.0.0.1:43629_solr    ] o.a.s.c.c.ZkConfigManager Copying zk node /configs/_default/lang/stemdict_nl.txt to /configs/testMultipleWithCollections_xyz.AUTOCREATED/lang/stemdict_nl.txt
   [junit4]   2> 1966505 INFO  (OverseerThreadFactory-6543-thread-2-processing-n:127.0.0.1:43629_solr) [n:127.0.0.1:43629_solr    ] o.a.s.c.c.ZkConfigManager Copying zk node /configs/_default/lang/stopwords_hy.txt to /configs/testMultipleWithCollections_xyz.AUTOCREATED/lang/stopwords_hy.txt
   [junit4]   2> 1966506 INFO  (OverseerThreadFactory-6543-thread-2-processing-n:127.0.0.1:43629_solr) [n:127.0.0.1:43629_solr    ] o.a.s.c.c.ZkConfigManager Copying zk node /configs/_default/lang/stopwords_no.txt to /configs/testMultipleWithCollections_xyz.AUTOCREATED/lang/stopwords_no.txt
   [junit4]   2> 1966507 INFO  (OverseerThreadFactory-6543-thread-2-processing-n:127.0.0.1:43629_solr) [n:127.0.0.1:43629_solr    ] o.a.s.c.c.ZkConfigManager Copying zk node /configs/_default/lang/contractions_ca.txt to /configs/testMultipleWithCollections_xyz.AUTOCREATED/lang/contractions_ca.txt
   [junit4]   2> 1966508 INFO  (OverseerThreadFactory-6543-thread-2-processing-n:127.0.0.1:43629_solr) [n:127.0.0.1:43629_solr    ] o.a.s.c.c.ZkConfigManager Copying zk node /configs/_default/lang/stopwords_id.txt to /configs/testMultipleWithCollections_xyz.AUTOCREATED/lang/stopwords_id.txt
   [junit4]   2> 1966508 INFO  (OverseerThreadFactory-6543-thread-2-processing-n:127.0.0.1:43629_solr) [n:127.0.0.1:43629_solr    ] o.a.s.c.c.ZkConfigManager Copying zk node /configs/_default/lang/stopwords_ga.txt to /configs/testMultipleWithCollections_xyz.AUTOCREATED/lang/stopwords_ga.txt
   [junit4]   2> 1966509 INFO  (OverseerThreadFactory-6543-thread-2-processing-n:127.0.0.1:43629_solr) [n:127.0.0.1:43629_solr    ] o.a.s.c.c.ZkConfigManager Copying zk node /configs/_default/lang/stopwords_hi.txt to /configs/testMultipleWithCollections_xyz.AUTOCREATED/lang/stopwords_hi.txt
   [junit4]   2> 1966510 INFO  (OverseerThreadFactory-6543-thread-2-processing-n:127.0.0.1:43629_solr) [n:127.0.0.1:43629_solr    ] o.a.s.c.c.ZkConfigManager Copying zk node /configs/_default/lang/stopwords_da.txt to /configs/testMultipleWithCollections_xyz.AUTOCREATED/lang/stopwords_da.txt
   [junit4]   2> 1966510 INFO  (OverseerThreadFactory-6543-thread-2-processing-n:127.0.0.1:43629_solr) [n:127.0.0.1:43629_solr    ] o.a.s.c.c.ZkConfigManager Copying zk node /configs/_default/lang/stopwords_ja.txt to /configs/testMultipleWithCollections_xyz.AUTOCREATED/lang/stopwords_ja.txt
   [junit4]   2> 1966511 INFO  (OverseerThreadFactory-6543-thread-2-processing-n:127.0.0.1:43629_solr) [n:127.0.0.1:43629_solr    ] o.a.s.c.c.ZkConfigManager Copying zk node /configs/_default/lang/stopwords_pt.txt to /configs/testMultipleWithCollections_xyz.AUTOCREATED/lang/stopwords_pt.txt
   [junit4]   2> 1966511 INFO  (OverseerThreadFactory-6543-thread-2-processing-n:127.0.0.1:43629_solr) [n:127.0.0.1:43629_solr    ] o.a.s.c.c.ZkConfigManager Copying zk node /configs/_default/lang/stopwords_hu.txt to /configs/testMultipleWithCollections_xyz.AUTOCREATED/lang/stopwords_hu.txt
   [junit4]   2> 1966512 INFO  (OverseerThreadFactory-6543-thread-2-processing-n:127.0.0.1:43629_solr) [n:127.0.0.1:43629_solr    ] o.a.s.c.c.ZkConfigManager Copying zk node /configs/_default/lang/stopwords_el.txt to /configs/testMultipleWithCollections_xyz.AUTOCREATED/lang/stopwords_el.txt
   [junit4]   2> 1966513 INFO  (OverseerThreadFactory-6543-thread-2-processing-n:127.0.0.1:43629_solr) [n:127.0.0.1:43629_solr    ] o.a.s.c.c.ZkConfigManager Copying zk node /configs/_default/lang/stopwords_ru.txt to /configs/testMultipleWithCollections_xyz.AUTOCREATED/lang/stopwords_ru.txt
   [junit4]   2> 1966514 INFO  (OverseerThreadFactory-6543-thread-2-processing-n:127.0.0.1:43629_solr) [n:127.0.0.1:43629_solr    ] o.a.s.c.c.ZkConfigManager Copying zk node /configs/_default/lang/stopwords_tr.txt to /configs/testMultipleWithCollections_xyz.AUTOCREATED/lang/stopwords_tr.txt
   [junit4]   2> 1966514 INFO  (OverseerThreadFactory-6543-thread-2-processing-n:127.0.0.1:43629_solr) [n:127.0.0.1:43629_solr    ] o.a.s.c.c.ZkConfigManager Copying zk node /configs/_default/lang/stopwords_ar.txt to /configs/testMultipleWithCollections_xyz.AUTOCREATED/lang/stopwords_ar.txt
   [junit4]   2> 1966515 INFO  (OverseerThreadFactory-6543-thread-2-processing-n:127.0.0.1:43629_solr) [n:127.0.0.1:43629_solr    ] o.a.s.c.c.ZkConfigManager Copying zk node /configs/_default/lang/userdict_ja.txt to /configs/testMultipleWithCollections_xyz.AUTOCREATED/lang/userdict_ja.txt
   [junit4]   2> 1966516 INFO  (OverseerThreadFactory-6543-thread-2-processing-n:127.0.0.1:43629_solr) [n:127.0.0.1:43629_solr    ] o.a.s.c.c.ZkConfigManager Copying zk node /configs/_default/lang/stopwords_eu.txt to /configs/testMultipleWithCollections_xyz.AUTOCREATED/lang/stopwords_eu.txt
   [junit4]   2> 1966516 INFO  (OverseerThreadFactory-6543-thread-2-processing-n:127.0.0.1:43629_solr) [n:127.0.0.1:43629_solr    ] o.a.s.c.c.ZkConfigManager Copying zk node /configs/_default/lang/stopwords_it.txt to /configs/testMultipleWithCollections_xyz.AUTOCREATED/lang/stopwords_it.txt
   [junit4]   2> 1966517 INFO  (OverseerThreadFactory-6543-thread-2-processing-n:127.0.0.1:43629_solr) [n:127.0.0.1:43629_solr    ] o.a.s.c.c.ZkConfigManager Copying zk node /configs/_default/lang/stopwords_cz.txt to /configs/testMultipleWithCollections_xyz.AUTOCREATED/lang/stopwords_cz.txt
   [junit4]   2> 1966518 INFO  (OverseerThreadFactory-6543-thread-2-processing-n:127.0.0.1:43629_solr) [n:127.0.0.1:43629_solr    ] o.a.s.c.c.ZkConfigManager Copying zk node /configs/_default/lang/stoptags_ja.txt to /configs/testMultipleWithCollections_xyz.AUTOCREATED/lang/

[...truncated too long message...]

ength is 0.

-ivy-fail-disallowed-ivy-version:

ivy-fail:

resolve-groovy:
[ivy:cachepath] :: resolving dependencies :: org.codehaus.groovy#groovy-all-caller;working
[ivy:cachepath] 	confs: [default]
[ivy:cachepath] 	found org.codehaus.groovy#groovy-all;2.4.15 in public
[ivy:cachepath] :: resolution report :: resolve 13ms :: artifacts dl 0ms
	---------------------------------------------------------------------
	|                  |            modules            ||   artifacts   |
	|       conf       | number| search|dwnlded|evicted|| number|dwnlded|
	---------------------------------------------------------------------
	|      default     |   1   |   0   |   0   |   0   ||   1   |   0   |
	---------------------------------------------------------------------

-init-totals:

-test:
    [mkdir] Created dir: /home/jenkins/workspace/Lucene-Solr-7.x-Linux/solr/build/solr-core/test
[junit4:pickseed] Seed property 'tests.seed' already defined: AEBD9C0133E3AE84
    [mkdir] Created dir: /home/jenkins/workspace/Lucene-Solr-7.x-Linux/solr/build/solr-core/test/temp
   [junit4] <JUnit4> says नमस्ते! Master seed: AEBD9C0133E3AE84
   [junit4] Executing 5 suites with 3 JVMs.
   [junit4] 
   [junit4] Started J0 PID(10166@serv1.sd-datasolutions.de).
   [junit4] Started J2 PID(10165@serv1.sd-datasolutions.de).
   [junit4] Started J1 PID(10164@serv1.sd-datasolutions.de).
   [junit4] Suite: org.apache.solr.cloud.TestWithCollection
   [junit4] OK      20.4s J0 | TestWithCollection.testMultipleWithCollections
   [junit4] OK      16.4s J0 | TestWithCollection.testDeleteWithCollection
   [junit4] OK      7.94s J0 | TestWithCollection.testAddReplicaSimple
   [junit4] OK      4.43s J0 | TestWithCollection.testCreateCollectionNoWithCollection
   [junit4] OK      5.57s J0 | TestWithCollection.testCreateCollection
   [junit4] OK      15.5s J0 | TestWithCollection.testNodeAdded
   [junit4] OK      10.5s J0 | TestWithCollection.testMoveReplicaMainCollection
   [junit4] OK      11.0s J0 | TestWithCollection.testAddReplicaWithPolicy
   [junit4] OK      6.33s J0 | TestWithCollection.testMoveReplicaWithCollection
   [junit4] Completed [1/5] on J0 in 104.67s, 9 tests
   [junit4] 
   [junit4] Suite: org.apache.solr.cloud.TestWithCollection
   [junit4] OK      19.7s J1 | TestWithCollection.testMultipleWithCollections
   [junit4] OK      19.2s J1 | TestWithCollection.testDeleteWithCollection
   [junit4] OK      7.88s J1 | TestWithCollection.testAddReplicaSimple
   [junit4] OK      4.52s J1 | TestWithCollection.testCreateCollectionNoWithCollection
   [junit4] OK      5.50s J1 | TestWithCollection.testCreateCollection
   [junit4] OK      15.7s J1 | TestWithCollection.testNodeAdded
   [junit4] OK      10.6s J1 | TestWithCollection.testMoveReplicaMainCollection
   [junit4] OK      11.0s J1 | TestWithCollection.testAddReplicaWithPolicy
   [junit4] OK      6.46s J1 | TestWithCollection.testMoveReplicaWithCollection
   [junit4] Completed [2/5] on J1 in 107.12s, 9 tests
   [junit4] 
   [junit4] Duplicate suite name used with XML reports: org.apache.solr.cloud.TestWithCollection. This may confuse tools that process XML reports. Set 'ignoreDuplicateSuites' to true to skip this message.
   [junit4] Suite: org.apache.solr.cloud.TestWithCollection
   [junit4] OK      20.6s J2 | TestWithCollection.testMultipleWithCollections
   [junit4] OK      18.5s J2 | TestWithCollection.testDeleteWithCollection
   [junit4] OK      7.94s J2 | TestWithCollection.testAddReplicaSimple
   [junit4] OK      4.56s J2 | TestWithCollection.testCreateCollectionNoWithCollection
   [junit4] OK      5.49s J2 | TestWithCollection.testCreateCollection
   [junit4] OK      15.7s J2 | TestWithCollection.testNodeAdded
   [junit4] OK      10.6s J2 | TestWithCollection.testMoveReplicaMainCollection
   [junit4] OK      11.0s J2 | TestWithCollection.testAddReplicaWithPolicy
   [junit4] OK      6.37s J2 | TestWithCollection.testMoveReplicaWithCollection
   [junit4] Completed [3/5] on J2 in 108.70s, 9 tests
   [junit4] 
   [junit4] Suite: org.apache.solr.cloud.TestWithCollection
   [junit4] OK      14.7s J0 | TestWithCollection.testMultipleWithCollections
   [junit4] OK      18.8s J0 | TestWithCollection.testDeleteWithCollection
   [junit4] OK      7.83s J0 | TestWithCollection.testAddReplicaSimple
   [junit4] OK      4.36s J0 | TestWithCollection.testCreateCollectionNoWithCollection
   [junit4] OK      5.42s J0 | TestWithCollection.testCreateCollection
   [junit4] OK      15.4s J0 | TestWithCollection.testNodeAdded
   [junit4] OK      10.4s J0 | TestWithCollection.testMoveReplicaMainCollection
   [junit4] OK      10.9s J0 | TestWithCollection.testAddReplicaWithPolicy
   [junit4] OK      6.22s J0 | TestWithCollection.testMoveReplicaWithCollection
   [junit4] Completed [4/5] on J0 in 96.03s, 9 tests
   [junit4] 
   [junit4] Suite: org.apache.solr.cloud.TestWithCollection
   [junit4] OK      14.8s J1 | TestWithCollection.testMultipleWithCollections
   [junit4] OK      18.8s J1 | TestWithCollection.testDeleteWithCollection
   [junit4] OK      7.81s J1 | TestWithCollection.testAddReplicaSimple
   [junit4] OK      4.43s J1 | TestWithCollection.testCreateCollectionNoWithCollection
   [junit4] OK      5.56s J1 | TestWithCollection.testCreateCollection
   [junit4] OK      15.2s J1 | TestWithCollection.testNodeAdded
   [junit4] OK      10.4s J1 | TestWithCollection.testMoveReplicaMainCollection
   [junit4] OK      10.9s J1 | TestWithCollection.testAddReplicaWithPolicy
   [junit4] OK      6.19s J1 | TestWithCollection.testMoveReplicaWithCollection
   [junit4] Completed [5/5] on J1 in 95.92s, 9 tests
   [junit4] 
   [junit4] JVM J0:     0.39 ..   202.05 =   201.66s
   [junit4] JVM J1:     0.40 ..   204.48 =   204.08s
   [junit4] JVM J2:     0.40 ..   109.84 =   109.44s
   [junit4] Execution time total: 3 minutes 24 seconds
   [junit4] Tests summary: 5 suites, 45 tests
   [junit4] Could not remove temporary path: /home/jenkins/workspace/Lucene-Solr-7.x-Linux/solr/build/solr-core/test/J2 (java.nio.file.DirectoryNotEmptyException: Remaining files: [/home/jenkins/workspace/Lucene-Solr-7.x-Linux/solr/build/solr-core/test/J2/temp])
   [junit4] Could not remove temporary path: /home/jenkins/workspace/Lucene-Solr-7.x-Linux/solr/build/solr-core/test/J0 (java.nio.file.DirectoryNotEmptyException: Remaining files: [/home/jenkins/workspace/Lucene-Solr-7.x-Linux/solr/build/solr-core/test/J0/temp])
   [junit4] Could not remove temporary path: /home/jenkins/workspace/Lucene-Solr-7.x-Linux/solr/build/solr-core/test/J1 (java.nio.file.DirectoryNotEmptyException: Remaining files: [/home/jenkins/workspace/Lucene-Solr-7.x-Linux/solr/build/solr-core/test/J1/temp])
     [echo] 5 slowest tests:
[junit4:tophints] 691.78s | org.apache.solr.cloud.cdcr.CdcrWithNodesRestartsTest
[junit4:tophints] 567.98s | org.apache.solr.cloud.cdcr.CdcrOpsAndBoundariesTest
[junit4:tophints] 460.74s | org.apache.solr.cloud.api.collections.ShardSplitTest
[junit4:tophints] 116.41s | org.apache.solr.update.SoftAutoCommitTest
[junit4:tophints] 115.10s | org.apache.solr.cloud.ZkFailoverTest

-check-totals:

test-nocompile:

BUILD SUCCESSFUL
Total time: 3 minutes 26 seconds
[repro] Failures:
[repro]   0/5 failed: org.apache.solr.cloud.TestWithCollection
[repro] Exiting with code 0
+ mv lucene/build lucene/build.repro
+ mv solr/build solr/build.repro
+ mv lucene/build.orig lucene/build
+ mv solr/build.orig solr/build
Archiving artifacts
Setting ANT_1_8_2_HOME=/var/lib/jenkins/tools/hudson.tasks.Ant_AntInstallation/ANT_1.8.2
java.lang.InterruptedException: no matches found within 10000
	at hudson.FilePath$ValidateAntFileMask.hasMatch(FilePath.java:2845)
	at hudson.FilePath$ValidateAntFileMask.invoke(FilePath.java:2724)
	at hudson.FilePath$ValidateAntFileMask.invoke(FilePath.java:2705)
	at hudson.FilePath.act(FilePath.java:1076)
	at hudson.FilePath.act(FilePath.java:1059)
	at hudson.FilePath.validateAntFileMask(FilePath.java:2703)
	at hudson.tasks.ArtifactArchiver.perform(ArtifactArchiver.java:243)
	at hudson.tasks.BuildStepCompatibilityLayer.perform(BuildStepCompatibilityLayer.java:81)
	at hudson.tasks.BuildStepMonitor$1.perform(BuildStepMonitor.java:20)
	at hudson.model.AbstractBuild$AbstractBuildExecution.perform(AbstractBuild.java:744)
	at hudson.model.AbstractBuild$AbstractBuildExecution.performAllBuildSteps(AbstractBuild.java:690)
	at hudson.model.Build$BuildExecution.post2(Build.java:186)
	at hudson.model.AbstractBuild$AbstractBuildExecution.post(AbstractBuild.java:635)
	at hudson.model.Run.execute(Run.java:1840)
	at hudson.model.FreeStyleBuild.run(FreeStyleBuild.java:43)
	at hudson.model.ResourceController.execute(ResourceController.java:97)
	at hudson.model.Executor.run(Executor.java:429)
No artifacts found that match the file pattern "**/*.events,heapdumps/**,**/*_pid*.log". Configuration error?
[WARNINGS] Parsing warnings in console log with parser Java Compiler (javac)
Setting ANT_1_8_2_HOME=/var/lib/jenkins/tools/hudson.tasks.Ant_AntInstallation/ANT_1.8.2
Setting ANT_1_8_2_HOME=/var/lib/jenkins/tools/hudson.tasks.Ant_AntInstallation/ANT_1.8.2
<Git Blamer> Using GitBlamer to create author and commit information for all warnings.
<Git Blamer> GIT_COMMIT=26f6956cd3ebe71bfa04fa1d3e9fd22c9bc03559, workspace=/var/lib/jenkins/workspace/Lucene-Solr-7.x-Linux
[WARNINGS] Computing warning deltas based on reference build #2775
Recording test results
Setting ANT_1_8_2_HOME=/var/lib/jenkins/tools/hudson.tasks.Ant_AntInstallation/ANT_1.8.2
Build step 'Publish JUnit test result report' changed build result to UNSTABLE
Email was triggered for: Unstable (Test Failures)
Sending email for trigger: Unstable (Test Failures)
Setting ANT_1_8_2_HOME=/var/lib/jenkins/tools/hudson.tasks.Ant_AntInstallation/ANT_1.8.2
Setting ANT_1_8_2_HOME=/var/lib/jenkins/tools/hudson.tasks.Ant_AntInstallation/ANT_1.8.2
Setting ANT_1_8_2_HOME=/var/lib/jenkins/tools/hudson.tasks.Ant_AntInstallation/ANT_1.8.2
Setting ANT_1_8_2_HOME=/var/lib/jenkins/tools/hudson.tasks.Ant_AntInstallation/ANT_1.8.2

[JENKINS] Lucene-Solr-7.x-Linux (64bit/jdk-10.0.1) - Build # 2777 - Still Unstable!

Posted by Policeman Jenkins Server <je...@thetaphi.de>.
Build: https://jenkins.thetaphi.de/job/Lucene-Solr-7.x-Linux/2777/
Java: 64bit/jdk-10.0.1 -XX:+UseCompressedOops -XX:+UseConcMarkSweepGC

1 tests failed.
FAILED:  org.apache.solr.cloud.cdcr.CdcrBidirectionalTest.testBiDir

Error Message:
Captured an uncaught exception in thread: Thread[id=12320, name=cdcr-replicator-4989-thread-1, state=RUNNABLE, group=TGRP-CdcrBidirectionalTest]

Stack Trace:
com.carrotsearch.randomizedtesting.UncaughtExceptionError: Captured an uncaught exception in thread: Thread[id=12320, name=cdcr-replicator-4989-thread-1, state=RUNNABLE, group=TGRP-CdcrBidirectionalTest]
Caused by: java.lang.AssertionError: 1612133817950142464 != 1612133817540149248
	at __randomizedtesting.SeedInfo.seed([4931982D2F4E5A76]:0)
	at org.apache.solr.update.CdcrUpdateLog$CdcrLogReader.forwardSeek(CdcrUpdateLog.java:611)
	at org.apache.solr.handler.CdcrReplicator.run(CdcrReplicator.java:125)
	at org.apache.solr.handler.CdcrReplicatorScheduler.lambda$start$0(CdcrReplicatorScheduler.java:81)
	at org.apache.solr.common.util.ExecutorUtil$MDCAwareThreadPoolExecutor.lambda$execute$0(ExecutorUtil.java:209)
	at java.base/java.util.concurrent.ThreadPoolExecutor.runWorker(ThreadPoolExecutor.java:1135)
	at java.base/java.util.concurrent.ThreadPoolExecutor$Worker.run(ThreadPoolExecutor.java:635)
	at java.base/java.lang.Thread.run(Thread.java:844)




Build Log:
[...truncated 1913 lines...]
   [junit4] JVM J2: stderr was not empty, see: /home/jenkins/workspace/Lucene-Solr-7.x-Linux/lucene/build/core/test/temp/junit4-J2-20180920_125758_45216958027656647622516.syserr
   [junit4] >>> JVM J2 emitted unexpected output (verbatim) ----
   [junit4] OpenJDK 64-Bit Server VM warning: Option UseConcMarkSweepGC was deprecated in version 9.0 and will likely be removed in a future release.
   [junit4] <<< JVM J2: EOF ----

[...truncated 5 lines...]
   [junit4] JVM J1: stderr was not empty, see: /home/jenkins/workspace/Lucene-Solr-7.x-Linux/lucene/build/core/test/temp/junit4-J1-20180920_125758_4528420855454516004481.syserr
   [junit4] >>> JVM J1 emitted unexpected output (verbatim) ----
   [junit4] OpenJDK 64-Bit Server VM warning: Option UseConcMarkSweepGC was deprecated in version 9.0 and will likely be removed in a future release.
   [junit4] <<< JVM J1: EOF ----

[...truncated 5 lines...]
   [junit4] JVM J0: stderr was not empty, see: /home/jenkins/workspace/Lucene-Solr-7.x-Linux/lucene/build/core/test/temp/junit4-J0-20180920_125758_4535416961615406161810.syserr
   [junit4] >>> JVM J0 emitted unexpected output (verbatim) ----
   [junit4] OpenJDK 64-Bit Server VM warning: Option UseConcMarkSweepGC was deprecated in version 9.0 and will likely be removed in a future release.
   [junit4] <<< JVM J0: EOF ----

[...truncated 304 lines...]
   [junit4] JVM J0: stderr was not empty, see: /home/jenkins/workspace/Lucene-Solr-7.x-Linux/lucene/build/test-framework/test/temp/junit4-J0-20180920_130409_7713336906356271666262.syserr
   [junit4] >>> JVM J0 emitted unexpected output (verbatim) ----
   [junit4] OpenJDK 64-Bit Server VM warning: Option UseConcMarkSweepGC was deprecated in version 9.0 and will likely be removed in a future release.
   [junit4] <<< JVM J0: EOF ----

   [junit4] JVM J2: stderr was not empty, see: /home/jenkins/workspace/Lucene-Solr-7.x-Linux/lucene/build/test-framework/test/temp/junit4-J2-20180920_130409_77118288147481375209877.syserr
   [junit4] >>> JVM J2 emitted unexpected output (verbatim) ----
   [junit4] OpenJDK 64-Bit Server VM warning: Option UseConcMarkSweepGC was deprecated in version 9.0 and will likely be removed in a future release.
   [junit4] <<< JVM J2: EOF ----

[...truncated 3 lines...]
   [junit4] JVM J1: stderr was not empty, see: /home/jenkins/workspace/Lucene-Solr-7.x-Linux/lucene/build/test-framework/test/temp/junit4-J1-20180920_130409_77110201490783842745807.syserr
   [junit4] >>> JVM J1 emitted unexpected output (verbatim) ----
   [junit4] OpenJDK 64-Bit Server VM warning: Option UseConcMarkSweepGC was deprecated in version 9.0 and will likely be removed in a future release.
   [junit4] <<< JVM J1: EOF ----

[...truncated 1083 lines...]
   [junit4] JVM J2: stderr was not empty, see: /home/jenkins/workspace/Lucene-Solr-7.x-Linux/lucene/build/analysis/common/test/temp/junit4-J2-20180920_130517_87115308976112704082345.syserr
   [junit4] >>> JVM J2 emitted unexpected output (verbatim) ----
   [junit4] OpenJDK 64-Bit Server VM warning: Option UseConcMarkSweepGC was deprecated in version 9.0 and will likely be removed in a future release.
   [junit4] <<< JVM J2: EOF ----

   [junit4] JVM J0: stderr was not empty, see: /home/jenkins/workspace/Lucene-Solr-7.x-Linux/lucene/build/analysis/common/test/temp/junit4-J0-20180920_130517_8714140060011897283465.syserr
   [junit4] >>> JVM J0 emitted unexpected output (verbatim) ----
   [junit4] OpenJDK 64-Bit Server VM warning: Option UseConcMarkSweepGC was deprecated in version 9.0 and will likely be removed in a future release.
   [junit4] <<< JVM J0: EOF ----

[...truncated 3 lines...]
   [junit4] JVM J1: stderr was not empty, see: /home/jenkins/workspace/Lucene-Solr-7.x-Linux/lucene/build/analysis/common/test/temp/junit4-J1-20180920_130517_87117499756192259729406.syserr
   [junit4] >>> JVM J1 emitted unexpected output (verbatim) ----
   [junit4] OpenJDK 64-Bit Server VM warning: Option UseConcMarkSweepGC was deprecated in version 9.0 and will likely be removed in a future release.
   [junit4] <<< JVM J1: EOF ----

[...truncated 255 lines...]
   [junit4] JVM J2: stderr was not empty, see: /home/jenkins/workspace/Lucene-Solr-7.x-Linux/lucene/build/analysis/icu/test/temp/junit4-J2-20180920_130640_5501074066789169137285.syserr
   [junit4] >>> JVM J2 emitted unexpected output (verbatim) ----
   [junit4] OpenJDK 64-Bit Server VM warning: Option UseConcMarkSweepGC was deprecated in version 9.0 and will likely be removed in a future release.
   [junit4] <<< JVM J2: EOF ----

[...truncated 3 lines...]
   [junit4] JVM J0: stderr was not empty, see: /home/jenkins/workspace/Lucene-Solr-7.x-Linux/lucene/build/analysis/icu/test/temp/junit4-J0-20180920_130640_55016991146020548383432.syserr
   [junit4] >>> JVM J0 emitted unexpected output (verbatim) ----
   [junit4] OpenJDK 64-Bit Server VM warning: Option UseConcMarkSweepGC was deprecated in version 9.0 and will likely be removed in a future release.
   [junit4] <<< JVM J0: EOF ----

[...truncated 3 lines...]
   [junit4] JVM J1: stderr was not empty, see: /home/jenkins/workspace/Lucene-Solr-7.x-Linux/lucene/build/analysis/icu/test/temp/junit4-J1-20180920_130640_550499934984501952699.syserr
   [junit4] >>> JVM J1 emitted unexpected output (verbatim) ----
   [junit4] OpenJDK 64-Bit Server VM warning: Option UseConcMarkSweepGC was deprecated in version 9.0 and will likely be removed in a future release.
   [junit4] <<< JVM J1: EOF ----

[...truncated 251 lines...]
   [junit4] JVM J1: stderr was not empty, see: /home/jenkins/workspace/Lucene-Solr-7.x-Linux/lucene/build/analysis/kuromoji/test/temp/junit4-J1-20180920_130651_02215780631663395017625.syserr
   [junit4] >>> JVM J1 emitted unexpected output (verbatim) ----
   [junit4] OpenJDK 64-Bit Server VM warning: Option UseConcMarkSweepGC was deprecated in version 9.0 and will likely be removed in a future release.
   [junit4] <<< JVM J1: EOF ----

[...truncated 3 lines...]
   [junit4] JVM J2: stderr was not empty, see: /home/jenkins/workspace/Lucene-Solr-7.x-Linux/lucene/build/analysis/kuromoji/test/temp/junit4-J2-20180920_130651_02214541047116893883688.syserr
   [junit4] >>> JVM J2 emitted unexpected output (verbatim) ----
   [junit4] OpenJDK 64-Bit Server VM warning: Option UseConcMarkSweepGC was deprecated in version 9.0 and will likely be removed in a future release.
   [junit4] <<< JVM J2: EOF ----

[...truncated 5 lines...]
   [junit4] JVM J0: stderr was not empty, see: /home/jenkins/workspace/Lucene-Solr-7.x-Linux/lucene/build/analysis/kuromoji/test/temp/junit4-J0-20180920_130651_0227843617402488173288.syserr
   [junit4] >>> JVM J0 emitted unexpected output (verbatim) ----
   [junit4] OpenJDK 64-Bit Server VM warning: Option UseConcMarkSweepGC was deprecated in version 9.0 and will likely be removed in a future release.
   [junit4] <<< JVM J0: EOF ----

[...truncated 162 lines...]
   [junit4] JVM J1: stderr was not empty, see: /home/jenkins/workspace/Lucene-Solr-7.x-Linux/lucene/build/analysis/morfologik/test/temp/junit4-J1-20180920_130712_2742518315472010077917.syserr
   [junit4] >>> JVM J1 emitted unexpected output (verbatim) ----
   [junit4] OpenJDK 64-Bit Server VM warning: Option UseConcMarkSweepGC was deprecated in version 9.0 and will likely be removed in a future release.
   [junit4] <<< JVM J1: EOF ----

[...truncated 3 lines...]
   [junit4] JVM J0: stderr was not empty, see: /home/jenkins/workspace/Lucene-Solr-7.x-Linux/lucene/build/analysis/morfologik/test/temp/junit4-J0-20180920_130712_27415501043503646524652.syserr
   [junit4] >>> JVM J0 emitted unexpected output (verbatim) ----
   [junit4] OpenJDK 64-Bit Server VM warning: Option UseConcMarkSweepGC was deprecated in version 9.0 and will likely be removed in a future release.
   [junit4] <<< JVM J0: EOF ----

[...truncated 3 lines...]
   [junit4] JVM J2: stderr was not empty, see: /home/jenkins/workspace/Lucene-Solr-7.x-Linux/lucene/build/analysis/morfologik/test/temp/junit4-J2-20180920_130712_27413019261179969947739.syserr
   [junit4] >>> JVM J2 emitted unexpected output (verbatim) ----
   [junit4] OpenJDK 64-Bit Server VM warning: Option UseConcMarkSweepGC was deprecated in version 9.0 and will likely be removed in a future release.
   [junit4] <<< JVM J2: EOF ----

[...truncated 204 lines...]
   [junit4] JVM J0: stderr was not empty, see: /home/jenkins/workspace/Lucene-Solr-7.x-Linux/lucene/build/analysis/nori/test/temp/junit4-J0-20180920_130715_96011222426229948809560.syserr
   [junit4] >>> JVM J0 emitted unexpected output (verbatim) ----
   [junit4] OpenJDK 64-Bit Server VM warning: Option UseConcMarkSweepGC was deprecated in version 9.0 and will likely be removed in a future release.
   [junit4] <<< JVM J0: EOF ----

[...truncated 3 lines...]
   [junit4] JVM J2: stderr was not empty, see: /home/jenkins/workspace/Lucene-Solr-7.x-Linux/lucene/build/analysis/nori/test/temp/junit4-J2-20180920_130715_96013007467095810957531.syserr
   [junit4] >>> JVM J2 emitted unexpected output (verbatim) ----
   [junit4] OpenJDK 64-Bit Server VM warning: Option UseConcMarkSweepGC was deprecated in version 9.0 and will likely be removed in a future release.
   [junit4] <<< JVM J2: EOF ----

[...truncated 6 lines...]
   [junit4] JVM J1: stderr was not empty, see: /home/jenkins/workspace/Lucene-Solr-7.x-Linux/lucene/build/analysis/nori/test/temp/junit4-J1-20180920_130715_96015748658203581878831.syserr
   [junit4] >>> JVM J1 emitted unexpected output (verbatim) ----
   [junit4] OpenJDK 64-Bit Server VM warning: Option UseConcMarkSweepGC was deprecated in version 9.0 and will likely be removed in a future release.
   [junit4] <<< JVM J1: EOF ----

[...truncated 168 lines...]
   [junit4] JVM J1: stderr was not empty, see: /home/jenkins/workspace/Lucene-Solr-7.x-Linux/lucene/build/analysis/opennlp/test/temp/junit4-J1-20180920_130726_2306887215994236023929.syserr
   [junit4] >>> JVM J1 emitted unexpected output (verbatim) ----
   [junit4] OpenJDK 64-Bit Server VM warning: Option UseConcMarkSweepGC was deprecated in version 9.0 and will likely be removed in a future release.
   [junit4] <<< JVM J1: EOF ----

[...truncated 3 lines...]
   [junit4] JVM J2: stderr was not empty, see: /home/jenkins/workspace/Lucene-Solr-7.x-Linux/lucene/build/analysis/opennlp/test/temp/junit4-J2-20180920_130726_2303002021533233031946.syserr
   [junit4] >>> JVM J2 emitted unexpected output (verbatim) ----
   [junit4] OpenJDK 64-Bit Server VM warning: Option UseConcMarkSweepGC was deprecated in version 9.0 and will likely be removed in a future release.
   [junit4] <<< JVM J2: EOF ----

[...truncated 3 lines...]
   [junit4] JVM J0: stderr was not empty, see: /home/jenkins/workspace/Lucene-Solr-7.x-Linux/lucene/build/analysis/opennlp/test/temp/junit4-J0-20180920_130726_2307533998801137639779.syserr
   [junit4] >>> JVM J0 emitted unexpected output (verbatim) ----
   [junit4] OpenJDK 64-Bit Server VM warning: Option UseConcMarkSweepGC was deprecated in version 9.0 and will likely be removed in a future release.
   [junit4] <<< JVM J0: EOF ----

[...truncated 173 lines...]
   [junit4] JVM J2: stderr was not empty, see: /home/jenkins/workspace/Lucene-Solr-7.x-Linux/lucene/build/analysis/phonetic/test/temp/junit4-J2-20180920_130728_9064279449735585936579.syserr
   [junit4] >>> JVM J2 emitted unexpected output (verbatim) ----
   [junit4] OpenJDK 64-Bit Server VM warning: Option UseConcMarkSweepGC was deprecated in version 9.0 and will likely be removed in a future release.
   [junit4] <<< JVM J2: EOF ----

[...truncated 6 lines...]
   [junit4] JVM J1: stderr was not empty, see: /home/jenkins/workspace/Lucene-Solr-7.x-Linux/lucene/build/analysis/phonetic/test/temp/junit4-J1-20180920_130728_90617157419024718598923.syserr
   [junit4] >>> JVM J1 emitted unexpected output (verbatim) ----
   [junit4] OpenJDK 64-Bit Server VM warning: Option UseConcMarkSweepGC was deprecated in version 9.0 and will likely be removed in a future release.
   [junit4] <<< JVM J1: EOF ----

[...truncated 3 lines...]
   [junit4] JVM J0: stderr was not empty, see: /home/jenkins/workspace/Lucene-Solr-7.x-Linux/lucene/build/analysis/phonetic/test/temp/junit4-J0-20180920_130728_90616783949033189816955.syserr
   [junit4] >>> JVM J0 emitted unexpected output (verbatim) ----
   [junit4] OpenJDK 64-Bit Server VM warning: Option UseConcMarkSweepGC was deprecated in version 9.0 and will likely be removed in a future release.
   [junit4] <<< JVM J0: EOF ----

[...truncated 161 lines...]
   [junit4] JVM J0: stderr was not empty, see: /home/jenkins/workspace/Lucene-Solr-7.x-Linux/lucene/build/analysis/smartcn/test/temp/junit4-J0-20180920_130737_8408758011674352210089.syserr
   [junit4] >>> JVM J0 emitted unexpected output (verbatim) ----
   [junit4] OpenJDK 64-Bit Server VM warning: Option UseConcMarkSweepGC was deprecated in version 9.0 and will likely be removed in a future release.
   [junit4] <<< JVM J0: EOF ----

[...truncated 3 lines...]
   [junit4] JVM J1: stderr was not empty, see: /home/jenkins/workspace/Lucene-Solr-7.x-Linux/lucene/build/analysis/smartcn/test/temp/junit4-J1-20180920_130737_8403597047599247694358.syserr
   [junit4] >>> JVM J1 emitted unexpected output (verbatim) ----
   [junit4] OpenJDK 64-Bit Server VM warning: Option UseConcMarkSweepGC was deprecated in version 9.0 and will likely be removed in a future release.
   [junit4] <<< JVM J1: EOF ----

[...truncated 165 lines...]
   [junit4] JVM J2: stderr was not empty, see: /home/jenkins/workspace/Lucene-Solr-7.x-Linux/lucene/build/analysis/stempel/test/temp/junit4-J2-20180920_130744_30214157531485304760237.syserr
   [junit4] >>> JVM J2 emitted unexpected output (verbatim) ----
   [junit4] OpenJDK 64-Bit Server VM warning: Option UseConcMarkSweepGC was deprecated in version 9.0 and will likely be removed in a future release.
   [junit4] <<< JVM J2: EOF ----

   [junit4] JVM J1: stderr was not empty, see: /home/jenkins/workspace/Lucene-Solr-7.x-Linux/lucene/build/analysis/stempel/test/temp/junit4-J1-20180920_130744_3021466396019151020543.syserr
   [junit4] >>> JVM J1 emitted unexpected output (verbatim) ----
   [junit4] OpenJDK 64-Bit Server VM warning: Option UseConcMarkSweepGC was deprecated in version 9.0 and will likely be removed in a future release.
   [junit4] <<< JVM J1: EOF ----

[...truncated 3 lines...]
   [junit4] JVM J0: stderr was not empty, see: /home/jenkins/workspace/Lucene-Solr-7.x-Linux/lucene/build/analysis/stempel/test/temp/junit4-J0-20180920_130744_3023272983619255788681.syserr
   [junit4] >>> JVM J0 emitted unexpected output (verbatim) ----
   [junit4] OpenJDK 64-Bit Server VM warning: Option UseConcMarkSweepGC was deprecated in version 9.0 and will likely be removed in a future release.
   [junit4] <<< JVM J0: EOF ----

[...truncated 206 lines...]
   [junit4] JVM J1: stderr was not empty, see: /home/jenkins/workspace/Lucene-Solr-7.x-Linux/lucene/build/backward-codecs/test/temp/junit4-J1-20180920_130747_2333671283875331260440.syserr
   [junit4] >>> JVM J1 emitted unexpected output (verbatim) ----
   [junit4] OpenJDK 64-Bit Server VM warning: Option UseConcMarkSweepGC was deprecated in version 9.0 and will likely be removed in a future release.
   [junit4] <<< JVM J1: EOF ----

[...truncated 19 lines...]
   [junit4] JVM J2: stderr was not empty, see: /home/jenkins/workspace/Lucene-Solr-7.x-Linux/lucene/build/backward-codecs/test/temp/junit4-J2-20180920_130747_23317031502849004046994.syserr
   [junit4] >>> JVM J2 emitted unexpected output (verbatim) ----
   [junit4] OpenJDK 64-Bit Server VM warning: Option UseConcMarkSweepGC was deprecated in version 9.0 and will likely be removed in a future release.
   [junit4] <<< JVM J2: EOF ----

[...truncated 9 lines...]
   [junit4] JVM J0: stderr was not empty, see: /home/jenkins/workspace/Lucene-Solr-7.x-Linux/lucene/build/backward-codecs/test/temp/junit4-J0-20180920_130747_2339125286936919013145.syserr
   [junit4] >>> JVM J0 emitted unexpected output (verbatim) ----
   [junit4] OpenJDK 64-Bit Server VM warning: Option UseConcMarkSweepGC was deprecated in version 9.0 and will likely be removed in a future release.
   [junit4] <<< JVM J0: EOF ----

[...truncated 1409 lines...]
   [junit4] JVM J1: stderr was not empty, see: /home/jenkins/workspace/Lucene-Solr-7.x-Linux/lucene/build/benchmark/test/temp/junit4-J1-20180920_130953_9567875591921366821048.syserr
   [junit4] >>> JVM J1 emitted unexpected output (verbatim) ----
   [junit4] OpenJDK 64-Bit Server VM warning: Option UseConcMarkSweepGC was deprecated in version 9.0 and will likely be removed in a future release.
   [junit4] <<< JVM J1: EOF ----

   [junit4] JVM J2: stderr was not empty, see: /home/jenkins/workspace/Lucene-Solr-7.x-Linux/lucene/build/benchmark/test/temp/junit4-J2-20180920_130953_95611857394613115040984.syserr
   [junit4] >>> JVM J2 emitted unexpected output (verbatim) ----
   [junit4] OpenJDK 64-Bit Server VM warning: Option UseConcMarkSweepGC was deprecated in version 9.0 and will likely be removed in a future release.
   [junit4] <<< JVM J2: EOF ----

[...truncated 9 lines...]
   [junit4] JVM J0: stderr was not empty, see: /home/jenkins/workspace/Lucene-Solr-7.x-Linux/lucene/build/benchmark/test/temp/junit4-J0-20180920_130953_95612122848426541756677.syserr
   [junit4] >>> JVM J0 emitted unexpected output (verbatim) ----
   [junit4] OpenJDK 64-Bit Server VM warning: Option UseConcMarkSweepGC was deprecated in version 9.0 and will likely be removed in a future release.
   [junit4] <<< JVM J0: EOF ----

[...truncated 253 lines...]
   [junit4] JVM J1: stderr was not empty, see: /home/jenkins/workspace/Lucene-Solr-7.x-Linux/lucene/build/classification/test/temp/junit4-J1-20180920_131001_87811779209455152885582.syserr
   [junit4] >>> JVM J1 emitted unexpected output (verbatim) ----
   [junit4] OpenJDK 64-Bit Server VM warning: Option UseConcMarkSweepGC was deprecated in version 9.0 and will likely be removed in a future release.
   [junit4] <<< JVM J1: EOF ----

   [junit4] JVM J2: stderr was not empty, see: /home/jenkins/workspace/Lucene-Solr-7.x-Linux/lucene/build/classification/test/temp/junit4-J2-20180920_131001_8784477885015087430183.syserr
   [junit4] >>> JVM J2 emitted unexpected output (verbatim) ----
   [junit4] OpenJDK 64-Bit Server VM warning: Option UseConcMarkSweepGC was deprecated in version 9.0 and will likely be removed in a future release.
   [junit4] <<< JVM J2: EOF ----

[...truncated 3 lines...]
   [junit4] JVM J0: stderr was not empty, see: /home/jenkins/workspace/Lucene-Solr-7.x-Linux/lucene/build/classification/test/temp/junit4-J0-20180920_131001_8788699177098489400827.syserr
   [junit4] >>> JVM J0 emitted unexpected output (verbatim) ----
   [junit4] OpenJDK 64-Bit Server VM warning: Option UseConcMarkSweepGC was deprecated in version 9.0 and will likely be removed in a future release.
   [junit4] <<< JVM J0: EOF ----

[...truncated 258 lines...]
   [junit4] JVM J0: stderr was not empty, see: /home/jenkins/workspace/Lucene-Solr-7.x-Linux/lucene/build/codecs/test/temp/junit4-J0-20180920_131011_1758646175384841132874.syserr
   [junit4] >>> JVM J0 emitted unexpected output (verbatim) ----
   [junit4] OpenJDK 64-Bit Server VM warning: Option UseConcMarkSweepGC was deprecated in version 9.0 and will likely be removed in a future release.
   [junit4] <<< JVM J0: EOF ----

[...truncated 7 lines...]
   [junit4] JVM J1: stderr was not empty, see: /home/jenkins/workspace/Lucene-Solr-7.x-Linux/lucene/build/codecs/test/temp/junit4-J1-20180920_131011_1754119153025864646571.syserr
   [junit4] >>> JVM J1 emitted unexpected output (verbatim) ----
   [junit4] OpenJDK 64-Bit Server VM warning: Option UseConcMarkSweepGC was deprecated in version 9.0 and will likely be removed in a future release.
   [junit4] <<< JVM J1: EOF ----

[...truncated 8 lines...]
   [junit4] JVM J2: stderr was not empty, see: /home/jenkins/workspace/Lucene-Solr-7.x-Linux/lucene/build/codecs/test/temp/junit4-J2-20180920_131011_1757714963215028558201.syserr
   [junit4] >>> JVM J2 emitted unexpected output (verbatim) ----
   [junit4] OpenJDK 64-Bit Server VM warning: Option UseConcMarkSweepGC was deprecated in version 9.0 and will likely be removed in a future release.
   [junit4] <<< JVM J2: EOF ----

[...truncated 236 lines...]
   [junit4] JVM J2: stderr was not empty, see: /home/jenkins/workspace/Lucene-Solr-7.x-Linux/lucene/build/demo/test/temp/junit4-J2-20180920_131234_00714282864208442141174.syserr
   [junit4] >>> JVM J2 emitted unexpected output (verbatim) ----
   [junit4] OpenJDK 64-Bit Server VM warning: Option UseConcMarkSweepGC was deprecated in version 9.0 and will likely be removed in a future release.
   [junit4] <<< JVM J2: EOF ----

   [junit4] JVM J1: stderr was not empty, see: /home/jenkins/workspace/Lucene-Solr-7.x-Linux/lucene/build/demo/test/temp/junit4-J1-20180920_131234_0061317241565624059881.syserr
   [junit4] >>> JVM J1 emitted unexpected output (verbatim) ----
   [junit4] OpenJDK 64-Bit Server VM warning: Option UseConcMarkSweepGC was deprecated in version 9.0 and will likely be removed in a future release.
   [junit4] <<< JVM J1: EOF ----

   [junit4] JVM J0: stderr was not empty, see: /home/jenkins/workspace/Lucene-Solr-7.x-Linux/lucene/build/demo/test/temp/junit4-J0-20180920_131234_0068913326104437493474.syserr
   [junit4] >>> JVM J0 emitted unexpected output (verbatim) ----
   [junit4] OpenJDK 64-Bit Server VM warning: Option UseConcMarkSweepGC was deprecated in version 9.0 and will likely be removed in a future release.
   [junit4] <<< JVM J0: EOF ----

[...truncated 173 lines...]
   [junit4] JVM J1: stderr was not empty, see: /home/jenkins/workspace/Lucene-Solr-7.x-Linux/lucene/build/expressions/test/temp/junit4-J1-20180920_131236_613380353375876320021.syserr
   [junit4] >>> JVM J1 emitted unexpected output (verbatim) ----
   [junit4] OpenJDK 64-Bit Server VM warning: Option UseConcMarkSweepGC was deprecated in version 9.0 and will likely be removed in a future release.
   [junit4] <<< JVM J1: EOF ----

   [junit4] JVM J2: stderr was not empty, see: /home/jenkins/workspace/Lucene-Solr-7.x-Linux/lucene/build/expressions/test/temp/junit4-J2-20180920_131236_6133785453848969672920.syserr
   [junit4] >>> JVM J2 emitted unexpected output (verbatim) ----
   [junit4] OpenJDK 64-Bit Server VM warning: Option UseConcMarkSweepGC was deprecated in version 9.0 and will likely be removed in a future release.
   [junit4] <<< JVM J2: EOF ----

[...truncated 6 lines...]
   [junit4] JVM J0: stderr was not empty, see: /home/jenkins/workspace/Lucene-Solr-7.x-Linux/lucene/build/expressions/test/temp/junit4-J0-20180920_131236_61312925672090876017401.syserr
   [junit4] >>> JVM J0 emitted unexpected output (verbatim) ----
   [junit4] OpenJDK 64-Bit Server VM warning: Option UseConcMarkSweepGC was deprecated in version 9.0 and will likely be removed in a future release.
   [junit4] <<< JVM J0: EOF ----

[...truncated 236 lines...]
   [junit4] JVM J1: stderr was not empty, see: /home/jenkins/workspace/Lucene-Solr-7.x-Linux/lucene/build/facet/test/temp/junit4-J1-20180920_131241_5783791870327551162465.syserr
   [junit4] >>> JVM J1 emitted unexpected output (verbatim) ----
   [junit4] OpenJDK 64-Bit Server VM warning: Option UseConcMarkSweepGC was deprecated in version 9.0 and will likely be removed in a future release.
   [junit4] <<< JVM J1: EOF ----

[...truncated 3 lines...]
   [junit4] JVM J0: stderr was not empty, see: /home/jenkins/workspace/Lucene-Solr-7.x-Linux/lucene/build/facet/test/temp/junit4-J0-20180920_131241_5782166089452679452625.syserr
   [junit4] >>> JVM J0 emitted unexpected output (verbatim) ----
   [junit4] OpenJDK 64-Bit Server VM warning: Option UseConcMarkSweepGC was deprecated in version 9.0 and will likely be removed in a future release.
   [junit4] <<< JVM J0: EOF ----

[...truncated 3 lines...]
   [junit4] JVM J2: stderr was not empty, see: /home/jenkins/workspace/Lucene-Solr-7.x-Linux/lucene/build/facet/test/temp/junit4-J2-20180920_131241_57813983353036557863097.syserr
   [junit4] >>> JVM J2 emitted unexpected output (verbatim) ----
   [junit4] OpenJDK 64-Bit Server VM warning: Option UseConcMarkSweepGC was deprecated in version 9.0 and will likely be removed in a future release.
   [junit4] <<< JVM J2: EOF ----

[...truncated 182 lines...]
   [junit4] JVM J0: stderr was not empty, see: /home/jenkins/workspace/Lucene-Solr-7.x-Linux/lucene/build/grouping/test/temp/junit4-J0-20180920_131313_24214500905556205822115.syserr
   [junit4] >>> JVM J0 emitted unexpected output (verbatim) ----
   [junit4] OpenJDK 64-Bit Server VM warning: Option UseConcMarkSweepGC was deprecated in version 9.0 and will likely be removed in a future release.
   [junit4] <<< JVM J0: EOF ----

[...truncated 3 lines...]
   [junit4] JVM J2: stderr was not empty, see: /home/jenkins/workspace/Lucene-Solr-7.x-Linux/lucene/build/grouping/test/temp/junit4-J2-20180920_131313_24213685851946524704203.syserr
   [junit4] >>> JVM J2 emitted unexpected output (verbatim) ----
   [junit4] OpenJDK 64-Bit Server VM warning: Option UseConcMarkSweepGC was deprecated in version 9.0 and will likely be removed in a future release.
   [junit4] <<< JVM J2: EOF ----

[...truncated 3 lines...]
   [junit4] JVM J1: stderr was not empty, see: /home/jenkins/workspace/Lucene-Solr-7.x-Linux/lucene/build/grouping/test/temp/junit4-J1-20180920_131313_2423491841718564525131.syserr
   [junit4] >>> JVM J1 emitted unexpected output (verbatim) ----
   [junit4] OpenJDK 64-Bit Server VM warning: Option UseConcMarkSweepGC was deprecated in version 9.0 and will likely be removed in a future release.
   [junit4] <<< JVM J1: EOF ----

[...truncated 248 lines...]
   [junit4] JVM J1: stderr was not empty, see: /home/jenkins/workspace/Lucene-Solr-7.x-Linux/lucene/build/highlighter/test/temp/junit4-J1-20180920_131325_2104278778807573915501.syserr
   [junit4] >>> JVM J1 emitted unexpected output (verbatim) ----
   [junit4] OpenJDK 64-Bit Server VM warning: Option UseConcMarkSweepGC was deprecated in version 9.0 and will likely be removed in a future release.
   [junit4] <<< JVM J1: EOF ----

[...truncated 3 lines...]
   [junit4] JVM J0: stderr was not empty, see: /home/jenkins/workspace/Lucene-Solr-7.x-Linux/lucene/build/highlighter/test/temp/junit4-J0-20180920_131325_2108092216603647960279.syserr
   [junit4] >>> JVM J0 emitted unexpected output (verbatim) ----
   [junit4] OpenJDK 64-Bit Server VM warning: Option UseConcMarkSweepGC was deprecated in version 9.0 and will likely be removed in a future release.
   [junit4] <<< JVM J0: EOF ----

[...truncated 3 lines...]
   [junit4] JVM J2: stderr was not empty, see: /home/jenkins/workspace/Lucene-Solr-7.x-Linux/lucene/build/highlighter/test/temp/junit4-J2-20180920_131325_21015322086588837359838.syserr
   [junit4] >>> JVM J2 emitted unexpected output (verbatim) ----
   [junit4] OpenJDK 64-Bit Server VM warning: Option UseConcMarkSweepGC was deprecated in version 9.0 and will likely be removed in a future release.
   [junit4] <<< JVM J2: EOF ----

[...truncated 163 lines...]
   [junit4] JVM J1: stderr was not empty, see: /home/jenkins/workspace/Lucene-Solr-7.x-Linux/lucene/build/join/test/temp/junit4-J1-20180920_131343_7671334026219959267639.syserr
   [junit4] >>> JVM J1 emitted unexpected output (verbatim) ----
   [junit4] OpenJDK 64-Bit Server VM warning: Option UseConcMarkSweepGC was deprecated in version 9.0 and will likely be removed in a future release.
   [junit4] <<< JVM J1: EOF ----

[...truncated 3 lines...]
   [junit4] JVM J2: stderr was not empty, see: /home/jenkins/workspace/Lucene-Solr-7.x-Linux/lucene/build/join/test/temp/junit4-J2-20180920_131343_7679551639254665108886.syserr
   [junit4] >>> JVM J2 emitted unexpected output (verbatim) ----
   [junit4] OpenJDK 64-Bit Server VM warning: Option UseConcMarkSweepGC was deprecated in version 9.0 and will likely be removed in a future release.
   [junit4] <<< JVM J2: EOF ----

[...truncated 6 lines...]
   [junit4] JVM J0: stderr was not empty, see: /home/jenkins/workspace/Lucene-Solr-7.x-Linux/lucene/build/join/test/temp/junit4-J0-20180920_131343_7664659148883997784937.syserr
   [junit4] >>> JVM J0 emitted unexpected output (verbatim) ----
   [junit4] OpenJDK 64-Bit Server VM warning: Option UseConcMarkSweepGC was deprecated in version 9.0 and will likely be removed in a future release.
   [junit4] <<< JVM J0: EOF ----

[...truncated 157 lines...]
   [junit4] JVM J0: stderr was not empty, see: /home/jenkins/workspace/Lucene-Solr-7.x-Linux/lucene/build/memory/test/temp/junit4-J0-20180920_131451_58916299765635331662722.syserr
   [junit4] >>> JVM J0 emitted unexpected output (verbatim) ----
   [junit4] OpenJDK 64-Bit Server VM warning: Option UseConcMarkSweepGC was deprecated in version 9.0 and will likely be removed in a future release.
   [junit4] <<< JVM J0: EOF ----

[...truncated 3 lines...]
   [junit4] JVM J1: stderr was not empty, see: /home/jenkins/workspace/Lucene-Solr-7.x-Linux/lucene/build/memory/test/temp/junit4-J1-20180920_131451_58914953045467079396502.syserr
   [junit4] >>> JVM J1 emitted unexpected output (verbatim) ----
   [junit4] OpenJDK 64-Bit Server VM warning: Option UseConcMarkSweepGC was deprecated in version 9.0 and will likely be removed in a future release.
   [junit4] <<< JVM J1: EOF ----

[...truncated 187 lines...]
   [junit4] JVM J0: stderr was not empty, see: /home/jenkins/workspace/Lucene-Solr-7.x-Linux/lucene/build/misc/test/temp/junit4-J0-20180920_131500_9375500285210179424670.syserr
   [junit4] >>> JVM J0 emitted unexpected output (verbatim) ----
   [junit4] OpenJDK 64-Bit Server VM warning: Option UseConcMarkSweepGC was deprecated in version 9.0 and will likely be removed in a future release.
   [junit4] <<< JVM J0: EOF ----

[...truncated 5 lines...]
   [junit4] JVM J1: stderr was not empty, see: /home/jenkins/workspace/Lucene-Solr-7.x-Linux/lucene/build/misc/test/temp/junit4-J1-20180920_131500_9375972492302381272774.syserr
   [junit4] >>> JVM J1 emitted unexpected output (verbatim) ----
   [junit4] OpenJDK 64-Bit Server VM warning: Option UseConcMarkSweepGC was deprecated in version 9.0 and will likely be removed in a future release.
   [junit4] <<< JVM J1: EOF ----

[...truncated 3 lines...]
   [junit4] JVM J2: stderr was not empty, see: /home/jenkins/workspace/Lucene-Solr-7.x-Linux/lucene/build/misc/test/temp/junit4-J2-20180920_131500_9373027149120725147370.syserr
   [junit4] >>> JVM J2 emitted unexpected output (verbatim) ----
   [junit4] OpenJDK 64-Bit Server VM warning: Option UseConcMarkSweepGC was deprecated in version 9.0 and will likely be removed in a future release.
   [junit4] <<< JVM J2: EOF ----

[...truncated 344 lines...]
   [junit4] JVM J0: stderr was not empty, see: /home/jenkins/workspace/Lucene-Solr-7.x-Linux/lucene/build/queries/test/temp/junit4-J0-20180920_131521_23110965311521418600766.syserr
   [junit4] >>> JVM J0 emitted unexpected output (verbatim) ----
   [junit4] OpenJDK 64-Bit Server VM warning: Option UseConcMarkSweepGC was deprecated in version 9.0 and will likely be removed in a future release.
   [junit4] <<< JVM J0: EOF ----

   [junit4] JVM J1: stderr was not empty, see: /home/jenkins/workspace/Lucene-Solr-7.x-Linux/lucene/build/queries/test/temp/junit4-J1-20180920_131521_23115017530658264030067.syserr
   [junit4] >>> JVM J1 emitted unexpected output (verbatim) ----
   [junit4] OpenJDK 64-Bit Server VM warning: Option UseConcMarkSweepGC was deprecated in version 9.0 and will likely be removed in a future release.
   [junit4] <<< JVM J1: EOF ----

   [junit4] JVM J2: stderr was not empty, see: /home/jenkins/workspace/Lucene-Solr-7.x-Linux/lucene/build/queries/test/temp/junit4-J2-20180920_131521_2316431930638030436556.syserr
   [junit4] >>> JVM J2 emitted unexpected output (verbatim) ----
   [junit4] OpenJDK 64-Bit Server VM warning: Option UseConcMarkSweepGC was deprecated in version 9.0 and will likely be removed in a future release.
   [junit4] <<< JVM J2: EOF ----

[...truncated 231 lines...]
   [junit4] JVM J0: stderr was not empty, see: /home/jenkins/workspace/Lucene-Solr-7.x-Linux/lucene/build/queryparser/test/temp/junit4-J0-20180920_131528_765618255707320454207.syserr
   [junit4] >>> JVM J0 emitted unexpected output (verbatim) ----
   [junit4] OpenJDK 64-Bit Server VM warning: Option UseConcMarkSweepGC was deprecated in version 9.0 and will likely be removed in a future release.
   [junit4] <<< JVM J0: EOF ----

[...truncated 3 lines...]
   [junit4] JVM J2: stderr was not empty, see: /home/jenkins/workspace/Lucene-Solr-7.x-Linux/lucene/build/queryparser/test/temp/junit4-J2-20180920_131528_7667594547772087846401.syserr
   [junit4] >>> JVM J2 emitted unexpected output (verbatim) ----
   [junit4] OpenJDK 64-Bit Server VM warning: Option UseConcMarkSweepGC was deprecated in version 9.0 and will likely be removed in a future release.
   [junit4] <<< JVM J2: EOF ----

[...truncated 3 lines...]
   [junit4] JVM J1: stderr was not empty, see: /home/jenkins/workspace/Lucene-Solr-7.x-Linux/lucene/build/queryparser/test/temp/junit4-J1-20180920_131528_76515253588725220616150.syserr
   [junit4] >>> JVM J1 emitted unexpected output (verbatim) ----
   [junit4] OpenJDK 64-Bit Server VM warning: Option UseConcMarkSweepGC was deprecated in version 9.0 and will likely be removed in a future release.
   [junit4] <<< JVM J1: EOF ----

[...truncated 208 lines...]
   [junit4] JVM J1: stderr was not empty, see: /home/jenkins/workspace/Lucene-Solr-7.x-Linux/lucene/build/replicator/test/temp/junit4-J1-20180920_131535_13215026291303291840475.syserr
   [junit4] >>> JVM J1 emitted unexpected output (verbatim) ----
   [junit4] OpenJDK 64-Bit Server VM warning: Option UseConcMarkSweepGC was deprecated in version 9.0 and will likely be removed in a future release.
   [junit4] <<< JVM J1: EOF ----

[...truncated 8 lines...]
   [junit4] JVM J2: stderr was not empty, see: /home/jenkins/workspace/Lucene-Solr-7.x-Linux/lucene/build/replicator/test/temp/junit4-J2-20180920_131535_1324298030820910281881.syserr
   [junit4] >>> JVM J2 emitted unexpected output (verbatim) ----
   [junit4] OpenJDK 64-Bit Server VM warning: Option UseConcMarkSweepGC was deprecated in version 9.0 and will likely be removed in a future release.
   [junit4] <<< JVM J2: EOF ----

[...truncated 6 lines...]
   [junit4] JVM J0: stderr was not empty, see: /home/jenkins/workspace/Lucene-Solr-7.x-Linux/lucene/build/replicator/test/temp/junit4-J0-20180920_131535_13218012220199462492736.syserr
   [junit4] >>> JVM J0 emitted unexpected output (verbatim) ----
   [junit4] OpenJDK 64-Bit Server VM warning: Option UseConcMarkSweepGC was deprecated in version 9.0 and will likely be removed in a future release.
   [junit4] <<< JVM J0: EOF ----

[...truncated 215 lines...]
   [junit4] JVM J2: stderr was not empty, see: /home/jenkins/workspace/Lucene-Solr-7.x-Linux/lucene/build/sandbox/test/temp/junit4-J2-20180920_131547_27512465836265669442339.syserr
   [junit4] >>> JVM J2 emitted unexpected output (verbatim) ----
   [junit4] OpenJDK 64-Bit Server VM warning: Option UseConcMarkSweepGC was deprecated in version 9.0 and will likely be removed in a future release.
   [junit4] <<< JVM J2: EOF ----

[...truncated 5 lines...]
   [junit4] JVM J0: stderr was not empty, see: /home/jenkins/workspace/Lucene-Solr-7.x-Linux/lucene/build/sandbox/test/temp/junit4-J0-20180920_131547_2752391330295226938384.syserr
   [junit4] >>> JVM J0 emitted unexpected output (verbatim) ----
   [junit4] OpenJDK 64-Bit Server VM warning: Option UseConcMarkSweepGC was deprecated in version 9.0 and will likely be removed in a future release.
   [junit4] <<< JVM J0: EOF ----

[...truncated 5 lines...]
   [junit4] JVM J1: stderr was not empty, see: /home/jenkins/workspace/Lucene-Solr-7.x-Linux/lucene/build/sandbox/test/temp/junit4-J1-20180920_131547_27516879931909834087107.syserr
   [junit4] >>> JVM J1 emitted unexpected output (verbatim) ----
   [junit4] OpenJDK 64-Bit Server VM warning: Option UseConcMarkSweepGC was deprecated in version 9.0 and will likely be removed in a future release.
   [junit4] <<< JVM J1: EOF ----

[...truncated 290 lines...]
   [junit4] JVM J2: stderr was not empty, see: /home/jenkins/workspace/Lucene-Solr-7.x-Linux/lucene/build/spatial-extras/test/temp/junit4-J2-20180920_131702_3432709864408911137265.syserr
   [junit4] >>> JVM J2 emitted unexpected output (verbatim) ----
   [junit4] OpenJDK 64-Bit Server VM warning: Option UseConcMarkSweepGC was deprecated in version 9.0 and will likely be removed in a future release.
   [junit4] <<< JVM J2: EOF ----

[...truncated 3 lines...]
   [junit4] JVM J0: stderr was not empty, see: /home/jenkins/workspace/Lucene-Solr-7.x-Linux/lucene/build/spatial-extras/test/temp/junit4-J0-20180920_131702_3432172892639151172029.syserr
   [junit4] >>> JVM J0 emitted unexpected output (verbatim) ----
   [junit4] OpenJDK 64-Bit Server VM warning: Option UseConcMarkSweepGC was deprecated in version 9.0 and will likely be removed in a future release.
   [junit4] <<< JVM J0: EOF ----

[...truncated 9 lines...]
   [junit4] JVM J1: stderr was not empty, see: /home/jenkins/workspace/Lucene-Solr-7.x-Linux/lucene/build/spatial-extras/test/temp/junit4-J1-20180920_131702_3431875996471873824725.syserr
   [junit4] >>> JVM J1 emitted unexpected output (verbatim) ----
   [junit4] OpenJDK 64-Bit Server VM warning: Option UseConcMarkSweepGC was deprecated in version 9.0 and will likely be removed in a future release.
   [junit4] <<< JVM J1: EOF ----

[...truncated 153 lines...]
   [junit4] JVM J0: stderr was not empty, see: /home/jenkins/workspace/Lucene-Solr-7.x-Linux/lucene/build/spatial/test/temp/junit4-J0-20180920_131738_7309940911589878349579.syserr
   [junit4] >>> JVM J0 emitted unexpected output (verbatim) ----
   [junit4] OpenJDK 64-Bit Server VM warning: Option UseConcMarkSweepGC was deprecated in version 9.0 and will likely be removed in a future release.
   [junit4] <<< JVM J0: EOF ----

[...truncated 181 lines...]
   [junit4] JVM J0: stderr was not empty, see: /home/jenkins/workspace/Lucene-Solr-7.x-Linux/lucene/build/spatial3d/test/temp/junit4-J0-20180920_131740_4392874898241402310389.syserr
   [junit4] >>> JVM J0 emitted unexpected output (verbatim) ----
   [junit4] OpenJDK 64-Bit Server VM warning: Option UseConcMarkSweepGC was deprecated in version 9.0 and will likely be removed in a future release.
   [junit4] <<< JVM J0: EOF ----

[...truncated 3 lines...]
   [junit4] JVM J2: stderr was not empty, see: /home/jenkins/workspace/Lucene-Solr-7.x-Linux/lucene/build/spatial3d/test/temp/junit4-J2-20180920_131740_44017250055432315359689.syserr
   [junit4] >>> JVM J2 emitted unexpected output (verbatim) ----
   [junit4] OpenJDK 64-Bit Server VM warning: Option UseConcMarkSweepGC was deprecated in version 9.0 and will likely be removed in a future release.
   [junit4] <<< JVM J2: EOF ----

[...truncated 8 lines...]
   [junit4] JVM J1: stderr was not empty, see: /home/jenkins/workspace/Lucene-Solr-7.x-Linux/lucene/build/spatial3d/test/temp/junit4-J1-20180920_131740_4394567520045730741938.syserr
   [junit4] >>> JVM J1 emitted unexpected output (verbatim) ----
   [junit4] OpenJDK 64-Bit Server VM warning: Option UseConcMarkSweepGC was deprecated in version 9.0 and will likely be removed in a future release.
   [junit4] <<< JVM J1: EOF ----

[...truncated 246 lines...]
   [junit4] JVM J2: stderr was not empty, see: /home/jenkins/workspace/Lucene-Solr-7.x-Linux/lucene/build/suggest/test/temp/junit4-J2-20180920_131852_87610700957047370200829.syserr
   [junit4] >>> JVM J2 emitted unexpected output (verbatim) ----
   [junit4] OpenJDK 64-Bit Server VM warning: Option UseConcMarkSweepGC was deprecated in version 9.0 and will likely be removed in a future release.
   [junit4] <<< JVM J2: EOF ----

[...truncated 3 lines...]
   [junit4] JVM J1: stderr was not empty, see: /home/jenkins/workspace/Lucene-Solr-7.x-Linux/lucene/build/suggest/test/temp/junit4-J1-20180920_131852_87611801014862793300519.syserr
   [junit4] >>> JVM J1 emitted unexpected output (verbatim) ----
   [junit4] OpenJDK 64-Bit Server VM warning: Option UseConcMarkSweepGC was deprecated in version 9.0 and will likely be removed in a future release.
   [junit4] <<< JVM J1: EOF ----

[...truncated 18 lines...]
   [junit4] JVM J0: stderr was not empty, see: /home/jenkins/workspace/Lucene-Solr-7.x-Linux/lucene/build/suggest/test/temp/junit4-J0-20180920_131852_8769574707560508226343.syserr
   [junit4] >>> JVM J0 emitted unexpected output (verbatim) ----
   [junit4] OpenJDK 64-Bit Server VM warning: Option UseConcMarkSweepGC was deprecated in version 9.0 and will likely be removed in a future release.
   [junit4] <<< JVM J0: EOF ----

[...truncated 2833 lines...]
   [junit4] Suite: org.apache.solr.cloud.cdcr.CdcrBidirectionalTest
   [junit4]   2> 993310 INFO  (SUITE-CdcrBidirectionalTest-seed#[4931982D2F4E5A76]-worker) [    ] o.a.s.SolrTestCaseJ4 SecureRandom sanity checks: test.solr.allowed.securerandom=null & java.security.egd=file:/dev/./urandom
   [junit4]   2> Creating dataDir: /home/jenkins/workspace/Lucene-Solr-7.x-Linux/solr/build/solr-core/test/J1/temp/solr.cloud.cdcr.CdcrBidirectionalTest_4931982D2F4E5A76-001/init-core-data-001
   [junit4]   2> 993310 WARN  (SUITE-CdcrBidirectionalTest-seed#[4931982D2F4E5A76]-worker) [    ] o.a.s.SolrTestCaseJ4 startTrackingSearchers: numOpens=2 numCloses=2
   [junit4]   2> 993310 INFO  (SUITE-CdcrBidirectionalTest-seed#[4931982D2F4E5A76]-worker) [    ] o.a.s.SolrTestCaseJ4 Using PointFields (NUMERIC_POINTS_SYSPROP=true) w/NUMERIC_DOCVALUES_SYSPROP=false
   [junit4]   2> 993311 INFO  (SUITE-CdcrBidirectionalTest-seed#[4931982D2F4E5A76]-worker) [    ] o.a.s.SolrTestCaseJ4 Randomized ssl (false) and clientAuth (true) via: @org.apache.solr.util.RandomizeSSL(reason="", ssl=0.0/0.0, value=0.0/0.0, clientAuth=0.0/0.0)
   [junit4]   2> 993312 INFO  (TEST-CdcrBidirectionalTest.testBiDir-seed#[4931982D2F4E5A76]) [    ] o.a.s.SolrTestCaseJ4 ###Starting testBiDir
   [junit4]   2> 993312 INFO  (TEST-CdcrBidirectionalTest.testBiDir-seed#[4931982D2F4E5A76]) [    ] o.a.s.c.MiniSolrCloudCluster Starting cluster of 1 servers in /home/jenkins/workspace/Lucene-Solr-7.x-Linux/solr/build/solr-core/test/J1/temp/solr.cloud.cdcr.CdcrBidirectionalTest_4931982D2F4E5A76-001/cdcr-cluster2-001
   [junit4]   2> 993312 INFO  (TEST-CdcrBidirectionalTest.testBiDir-seed#[4931982D2F4E5A76]) [    ] o.a.s.c.ZkTestServer STARTING ZK TEST SERVER
   [junit4]   2> 993312 INFO  (Thread-2763) [    ] o.a.s.c.ZkTestServer client port:0.0.0.0/0.0.0.0:0
   [junit4]   2> 993312 INFO  (Thread-2763) [    ] o.a.s.c.ZkTestServer Starting server
   [junit4]   2> 993313 ERROR (Thread-2763) [    ] o.a.z.s.ZooKeeperServer ZKShutdownHandler is not registered, so ZooKeeper server won't take any action on ERROR or SHUTDOWN server state changes
   [junit4]   2> 993412 INFO  (TEST-CdcrBidirectionalTest.testBiDir-seed#[4931982D2F4E5A76]) [    ] o.a.s.c.ZkTestServer start zk server on port:41433
   [junit4]   2> 993414 INFO  (zkConnectionManagerCallback-3035-thread-1) [    ] o.a.s.c.c.ConnectionManager zkClient has connected
   [junit4]   2> 993417 INFO  (jetty-launcher-3032-thread-1) [    ] o.e.j.s.Server jetty-9.4.11.v20180605; built: 2018-06-05T18:24:03.829Z; git: d5fc0523cfa96bfebfbda19606cad384d772f04c; jvm 10.0.1+10
   [junit4]   2> 993417 INFO  (jetty-launcher-3032-thread-1) [    ] o.e.j.s.session DefaultSessionIdManager workerName=node0
   [junit4]   2> 993417 INFO  (jetty-launcher-3032-thread-1) [    ] o.e.j.s.session No SessionScavenger set, using defaults
   [junit4]   2> 993417 INFO  (jetty-launcher-3032-thread-1) [    ] o.e.j.s.session node0 Scavenging every 600000ms
   [junit4]   2> 993417 INFO  (jetty-launcher-3032-thread-1) [    ] o.e.j.s.h.ContextHandler Started o.e.j.s.ServletContextHandler@7a3cb3fa{/solr,null,AVAILABLE}
   [junit4]   2> 993418 INFO  (jetty-launcher-3032-thread-1) [    ] o.e.j.s.AbstractConnector Started ServerConnector@955c42c{HTTP/1.1,[http/1.1]}{127.0.0.1:34917}
   [junit4]   2> 993418 INFO  (jetty-launcher-3032-thread-1) [    ] o.e.j.s.Server Started @993497ms
   [junit4]   2> 993418 INFO  (jetty-launcher-3032-thread-1) [    ] o.a.s.c.s.e.JettySolrRunner Jetty properties: {hostContext=/solr, hostPort=34917}
   [junit4]   2> 993418 ERROR (jetty-launcher-3032-thread-1) [    ] o.a.s.u.StartupLoggingUtils Missing Java Option solr.log.dir. Logging may be missing or incomplete.
   [junit4]   2> 993418 INFO  (jetty-launcher-3032-thread-1) [    ] o.a.s.s.SolrDispatchFilter Using logger factory org.apache.logging.slf4j.Log4jLoggerFactory
   [junit4]   2> 993418 INFO  (jetty-launcher-3032-thread-1) [    ] o.a.s.s.SolrDispatchFilter  ___      _       Welcome to Apache Solr™ version 7.6.0
   [junit4]   2> 993418 INFO  (jetty-launcher-3032-thread-1) [    ] o.a.s.s.SolrDispatchFilter / __| ___| |_ _   Starting in cloud mode on port null
   [junit4]   2> 993418 INFO  (jetty-launcher-3032-thread-1) [    ] o.a.s.s.SolrDispatchFilter \__ \/ _ \ | '_|  Install dir: null
   [junit4]   2> 993418 INFO  (jetty-launcher-3032-thread-1) [    ] o.a.s.s.SolrDispatchFilter |___/\___/_|_|    Start time: 2018-09-20T13:36:32.796685Z
   [junit4]   2> 993419 INFO  (zkConnectionManagerCallback-3037-thread-1) [    ] o.a.s.c.c.ConnectionManager zkClient has connected
   [junit4]   2> 993419 INFO  (jetty-launcher-3032-thread-1) [    ] o.a.s.s.SolrDispatchFilter solr.xml found in ZooKeeper. Loading...
   [junit4]   2> 993478 INFO  (jetty-launcher-3032-thread-1) [    ] o.a.s.c.ZkContainer Zookeeper client=127.0.0.1:41433/solr
   [junit4]   2> 993483 INFO  (zkConnectionManagerCallback-3041-thread-1) [    ] o.a.s.c.c.ConnectionManager zkClient has connected
   [junit4]   2> 993485 INFO  (zkConnectionManagerCallback-3043-thread-1) [    ] o.a.s.c.c.ConnectionManager zkClient has connected
   [junit4]   2> 993518 INFO  (jetty-launcher-3032-thread-1) [n:127.0.0.1:34917_solr    ] o.a.s.c.OverseerElectionContext I am going to be the leader 127.0.0.1:34917_solr
   [junit4]   2> 993519 INFO  (jetty-launcher-3032-thread-1) [n:127.0.0.1:34917_solr    ] o.a.s.c.Overseer Overseer (id=72257234409553923-127.0.0.1:34917_solr-n_0000000000) starting
   [junit4]   2> 993521 INFO  (zkConnectionManagerCallback-3050-thread-1) [    ] o.a.s.c.c.ConnectionManager zkClient has connected
   [junit4]   2> 993523 INFO  (jetty-launcher-3032-thread-1) [n:127.0.0.1:34917_solr    ] o.a.s.c.s.i.ZkClientClusterStateProvider Cluster at 127.0.0.1:41433/solr ready
   [junit4]   2> 993523 INFO  (OverseerStateUpdate-72257234409553923-127.0.0.1:34917_solr-n_0000000000) [n:127.0.0.1:34917_solr    ] o.a.s.c.Overseer Starting to work on the main queue : 127.0.0.1:34917_solr
   [junit4]   2> 993523 INFO  (jetty-launcher-3032-thread-1) [n:127.0.0.1:34917_solr    ] o.a.s.c.ZkController Register node as live in ZooKeeper:/live_nodes/127.0.0.1:34917_solr
   [junit4]   2> 993525 INFO  (zkCallback-3042-thread-1) [    ] o.a.s.c.c.ZkStateReader Updated live nodes from ZooKeeper... (0) -> (1)
   [junit4]   2> 993525 INFO  (zkCallback-3049-thread-1) [    ] o.a.s.c.c.ZkStateReader Updated live nodes from ZooKeeper... (0) -> (1)
   [junit4]   2> 993531 INFO  (jetty-launcher-3032-thread-1) [n:127.0.0.1:34917_solr    ] o.a.s.h.a.MetricsHistoryHandler No .system collection, keeping metrics history in memory.
   [junit4]   2> 993540 INFO  (jetty-launcher-3032-thread-1) [n:127.0.0.1:34917_solr    ] o.a.s.m.r.SolrJmxReporter JMX monitoring for 'solr_34917.solr.node' (registry 'solr.node') enabled at server: com.sun.jmx.mbeanserver.JmxMBeanServer@107b56b9
   [junit4]   2> 993545 INFO  (jetty-launcher-3032-thread-1) [n:127.0.0.1:34917_solr    ] o.a.s.m.r.SolrJmxReporter JMX monitoring for 'solr_34917.solr.jvm' (registry 'solr.jvm') enabled at server: com.sun.jmx.mbeanserver.JmxMBeanServer@107b56b9
   [junit4]   2> 993545 INFO  (jetty-launcher-3032-thread-1) [n:127.0.0.1:34917_solr    ] o.a.s.m.r.SolrJmxReporter JMX monitoring for 'solr_34917.solr.jetty' (registry 'solr.jetty') enabled at server: com.sun.jmx.mbeanserver.JmxMBeanServer@107b56b9
   [junit4]   2> 993546 INFO  (jetty-launcher-3032-thread-1) [n:127.0.0.1:34917_solr    ] o.a.s.c.CorePropertiesLocator Found 0 core definitions underneath /home/jenkins/workspace/Lucene-Solr-7.x-Linux/solr/build/solr-core/test/J1/temp/solr.cloud.cdcr.CdcrBidirectionalTest_4931982D2F4E5A76-001/cdcr-cluster2-001/node1/.
   [junit4]   2> 993555 INFO  (zkConnectionManagerCallback-3053-thread-1) [    ] o.a.s.c.c.ConnectionManager zkClient has connected
   [junit4]   2> 993557 INFO  (zkConnectionManagerCallback-3056-thread-1) [    ] o.a.s.c.c.ConnectionManager zkClient has connected
   [junit4]   2> 993557 INFO  (TEST-CdcrBidirectionalTest.testBiDir-seed#[4931982D2F4E5A76]) [    ] o.a.s.c.MiniSolrCloudCluster Starting cluster of 1 servers in /home/jenkins/workspace/Lucene-Solr-7.x-Linux/solr/build/solr-core/test/J1/temp/solr.cloud.cdcr.CdcrBidirectionalTest_4931982D2F4E5A76-001/cdcr-cluster1-001
   [junit4]   2> 993558 INFO  (TEST-CdcrBidirectionalTest.testBiDir-seed#[4931982D2F4E5A76]) [    ] o.a.s.c.ZkTestServer STARTING ZK TEST SERVER
   [junit4]   2> 993558 INFO  (Thread-2773) [    ] o.a.s.c.ZkTestServer client port:0.0.0.0/0.0.0.0:0
   [junit4]   2> 993558 INFO  (Thread-2773) [    ] o.a.s.c.ZkTestServer Starting server
   [junit4]   2> 993559 ERROR (Thread-2773) [    ] o.a.z.s.ZooKeeperServer ZKShutdownHandler is not registered, so ZooKeeper server won't take any action on ERROR or SHUTDOWN server state changes
   [junit4]   2> 993658 INFO  (TEST-CdcrBidirectionalTest.testBiDir-seed#[4931982D2F4E5A76]) [    ] o.a.s.c.ZkTestServer start zk server on port:40583
   [junit4]   2> 993659 INFO  (zkConnectionManagerCallback-3060-thread-1) [    ] o.a.s.c.c.ConnectionManager zkClient has connected
   [junit4]   2> 993662 INFO  (jetty-launcher-3057-thread-1) [    ] o.e.j.s.Server jetty-9.4.11.v20180605; built: 2018-06-05T18:24:03.829Z; git: d5fc0523cfa96bfebfbda19606cad384d772f04c; jvm 10.0.1+10
   [junit4]   2> 993663 INFO  (jetty-launcher-3057-thread-1) [    ] o.e.j.s.session DefaultSessionIdManager workerName=node0
   [junit4]   2> 993663 INFO  (jetty-launcher-3057-thread-1) [    ] o.e.j.s.session No SessionScavenger set, using defaults
   [junit4]   2> 993663 INFO  (jetty-launcher-3057-thread-1) [    ] o.e.j.s.session node0 Scavenging every 600000ms
   [junit4]   2> 993663 INFO  (jetty-launcher-3057-thread-1) [    ] o.e.j.s.h.ContextHandler Started o.e.j.s.ServletContextHandler@21e0dea{/solr,null,AVAILABLE}
   [junit4]   2> 993663 INFO  (jetty-launcher-3057-thread-1) [    ] o.e.j.s.AbstractConnector Started ServerConnector@2e5356{HTTP/1.1,[http/1.1]}{127.0.0.1:42905}
   [junit4]   2> 993663 INFO  (jetty-launcher-3057-thread-1) [    ] o.e.j.s.Server Started @993743ms
   [junit4]   2> 993663 INFO  (jetty-launcher-3057-thread-1) [    ] o.a.s.c.s.e.JettySolrRunner Jetty properties: {hostContext=/solr, hostPort=42905}
   [junit4]   2> 993664 ERROR (jetty-launcher-3057-thread-1) [    ] o.a.s.u.StartupLoggingUtils Missing Java Option solr.log.dir. Logging may be missing or incomplete.
   [junit4]   2> 993664 INFO  (jetty-launcher-3057-thread-1) [    ] o.a.s.s.SolrDispatchFilter Using logger factory org.apache.logging.slf4j.Log4jLoggerFactory
   [junit4]   2> 993664 INFO  (jetty-launcher-3057-thread-1) [    ] o.a.s.s.SolrDispatchFilter  ___      _       Welcome to Apache Solr™ version 7.6.0
   [junit4]   2> 993664 INFO  (jetty-launcher-3057-thread-1) [    ] o.a.s.s.SolrDispatchFilter / __| ___| |_ _   Starting in cloud mode on port null
   [junit4]   2> 993664 INFO  (jetty-launcher-3057-thread-1) [    ] o.a.s.s.SolrDispatchFilter \__ \/ _ \ | '_|  Install dir: null
   [junit4]   2> 993664 INFO  (jetty-launcher-3057-thread-1) [    ] o.a.s.s.SolrDispatchFilter |___/\___/_|_|    Start time: 2018-09-20T13:36:33.042255Z
   [junit4]   2> 993665 INFO  (zkConnectionManagerCallback-3062-thread-1) [    ] o.a.s.c.c.ConnectionManager zkClient has connected
   [junit4]   2> 993665 INFO  (jetty-launcher-3057-thread-1) [    ] o.a.s.s.SolrDispatchFilter solr.xml found in ZooKeeper. Loading...
   [junit4]   2> 993716 INFO  (jetty-launcher-3057-thread-1) [    ] o.a.s.c.ZkContainer Zookeeper client=127.0.0.1:40583/solr
   [junit4]   2> 993717 INFO  (zkConnectionManagerCallback-3066-thread-1) [    ] o.a.s.c.c.ConnectionManager zkClient has connected
   [junit4]   2> 993718 INFO  (zkConnectionManagerCallback-3068-thread-1) [    ] o.a.s.c.c.ConnectionManager zkClient has connected
   [junit4]   2> 993750 INFO  (jetty-launcher-3057-thread-1) [n:127.0.0.1:42905_solr    ] o.a.s.c.OverseerElectionContext I am going to be the leader 127.0.0.1:42905_solr
   [junit4]   2> 993751 INFO  (jetty-launcher-3057-thread-1) [n:127.0.0.1:42905_solr    ] o.a.s.c.Overseer Overseer (id=72257234425675779-127.0.0.1:42905_solr-n_0000000000) starting
   [junit4]   2> 993753 INFO  (zkConnectionManagerCallback-3075-thread-1) [    ] o.a.s.c.c.ConnectionManager zkClient has connected
   [junit4]   2> 993754 INFO  (jetty-launcher-3057-thread-1) [n:127.0.0.1:42905_solr    ] o.a.s.c.s.i.ZkClientClusterStateProvider Cluster at 127.0.0.1:40583/solr ready
   [junit4]   2> 993755 INFO  (OverseerStateUpdate-72257234425675779-127.0.0.1:42905_solr-n_0000000000) [n:127.0.0.1:42905_solr    ] o.a.s.c.Overseer Starting to work on the main queue : 127.0.0.1:42905_solr
   [junit4]   2> 993755 INFO  (jetty-launcher-3057-thread-1) [n:127.0.0.1:42905_solr    ] o.a.s.c.ZkController Register node as live in ZooKeeper:/live_nodes/127.0.0.1:42905_solr
   [junit4]   2> 993755 INFO  (OverseerStateUpdate-72257234425675779-127.0.0.1:42905_solr-n_0000000000) [n:127.0.0.1:42905_solr    ] o.a.s.c.c.ZkStateReader Updated live nodes from ZooKeeper... (0) -> (1)
   [junit4]   2> 993755 INFO  (zkCallback-3074-thread-1) [    ] o.a.s.c.c.ZkStateReader Updated live nodes from ZooKeeper... (0) -> (1)
   [junit4]   2> 993763 INFO  (jetty-launcher-3057-thread-1) [n:127.0.0.1:42905_solr    ] o.a.s.h.a.MetricsHistoryHandler No .system collection, keeping metrics history in memory.
   [junit4]   2> 993771 INFO  (jetty-launcher-3057-thread-1) [n:127.0.0.1:42905_solr    ] o.a.s.m.r.SolrJmxReporter JMX monitoring for 'solr_42905.solr.node' (registry 'solr.node') enabled at server: com.sun.jmx.mbeanserver.JmxMBeanServer@107b56b9
   [junit4]   2> 993776 INFO  (jetty-launcher-3057-thread-1) [n:127.0.0.1:42905_solr    ] o.a.s.m.r.SolrJmxReporter JMX monitoring for 'solr_42905.solr.jvm' (registry 'solr.jvm') enabled at server: com.sun.jmx.mbeanserver.JmxMBeanServer@107b56b9
   [junit4]   2> 993776 INFO  (jetty-launcher-3057-thread-1) [n:127.0.0.1:42905_solr    ] o.a.s.m.r.SolrJmxReporter JMX monitoring for 'solr_42905.solr.jetty' (registry 'solr.jetty') enabled at server: com.sun.jmx.mbeanserver.JmxMBeanServer@107b56b9
   [junit4]   2> 993777 INFO  (jetty-launcher-3057-thread-1) [n:127.0.0.1:42905_solr    ] o.a.s.c.CorePropertiesLocator Found 0 core definitions underneath /home/jenkins/workspace/Lucene-Solr-7.x-Linux/solr/build/solr-core/test/J1/temp/solr.cloud.cdcr.CdcrBidirectionalTest_4931982D2F4E5A76-001/cdcr-cluster1-001/node1/.
   [junit4]   2> 993789 INFO  (zkConnectionManagerCallback-3078-thread-1) [    ] o.a.s.c.c.ConnectionManager zkClient has connected
   [junit4]   2> 993792 INFO  (zkConnectionManagerCallback-3081-thread-1) [    ] o.a.s.c.c.ConnectionManager zkClient has connected
   [junit4]   2> 993793 INFO  (TEST-CdcrBidirectionalTest.testBiDir-seed#[4931982D2F4E5A76]) [    ] o.a.s.c.c.CdcrBidirectionalTest cluster2 zkHost = 127.0.0.1:41433/solr
   [junit4]   2> 993793 INFO  (TEST-CdcrBidirectionalTest.testBiDir-seed#[4931982D2F4E5A76]) [    ] o.a.s.c.c.CdcrBidirectionalTest cluster1 zkHost = 127.0.0.1:40583/solr
   [junit4]   2> 993794 INFO  (zkConnectionManagerCallback-3083-thread-1) [    ] o.a.s.c.c.ConnectionManager zkClient has connected
   [junit4]   2> 993797 INFO  (zkConnectionManagerCallback-3087-thread-1) [    ] o.a.s.c.c.ConnectionManager zkClient has connected
   [junit4]   2> 993797 INFO  (TEST-CdcrBidirectionalTest.testBiDir-seed#[4931982D2F4E5A76]) [    ] o.a.s.c.c.ZkStateReader Updated live nodes from ZooKeeper... (0) -> (1)
   [junit4]   2> 993798 INFO  (TEST-CdcrBidirectionalTest.testBiDir-seed#[4931982D2F4E5A76]) [    ] o.a.s.c.s.i.ZkClientClusterStateProvider Cluster at 127.0.0.1:40583/solr ready
   [junit4]   2> 993799 INFO  (qtp1167533922-12180) [n:127.0.0.1:42905_solr    ] o.a.s.h.a.CollectionsHandler Invoked Collection Action :create with params collection.configName=cdcr-cluster1&maxShardsPerNode=2&name=cdcr-cluster1&nrtReplicas=1&action=CREATE&numShards=2&property.solr.directoryFactory=solr.StandardDirectoryFactory&wt=javabin&version=2 and sendToOCPQueue=true
   [junit4]   2> 993800 INFO  (OverseerThreadFactory-4950-thread-1-processing-n:127.0.0.1:42905_solr) [n:127.0.0.1:42905_solr    ] o.a.s.c.a.c.CreateCollectionCmd Create collection cdcr-cluster1
   [junit4]   2> 993904 INFO  (OverseerStateUpdate-72257234425675779-127.0.0.1:42905_solr-n_0000000000) [n:127.0.0.1:42905_solr    ] o.a.s.c.o.SliceMutator createReplica() {
   [junit4]   2>   "operation":"ADDREPLICA",
   [junit4]   2>   "collection":"cdcr-cluster1",
   [junit4]   2>   "shard":"shard1",
   [junit4]   2>   "core":"cdcr-cluster1_shard1_replica_n1",
   [junit4]   2>   "state":"down",
   [junit4]   2>   "base_url":"http://127.0.0.1:42905/solr",
   [junit4]   2>   "type":"NRT",
   [junit4]   2>   "waitForFinalState":"false"} 
   [junit4]   2> 993905 INFO  (OverseerStateUpdate-72257234425675779-127.0.0.1:42905_solr-n_0000000000) [n:127.0.0.1:42905_solr    ] o.a.s.c.o.SliceMutator createReplica() {
   [junit4]   2>   "operation":"ADDREPLICA",
   [junit4]   2>   "collection":"cdcr-cluster1",
   [junit4]   2>   "shard":"shard2",
   [junit4]   2>   "core":"cdcr-cluster1_shard2_replica_n2",
   [junit4]   2>   "state":"down",
   [junit4]   2>   "base_url":"http://127.0.0.1:42905/solr",
   [junit4]   2>   "type":"NRT",
   [junit4]   2>   "waitForFinalState":"false"} 
   [junit4]   2> 994107 INFO  (qtp1167533922-12175) [n:127.0.0.1:42905_solr    x:cdcr-cluster1_shard1_replica_n1] o.a.s.h.a.CoreAdminOperation core create command qt=/admin/cores&collection.configName=cdcr-cluster1&newCollection=true&collection=cdcr-cluster1&version=2&replicaType=NRT&coreNodeName=core_node3&name=cdcr-cluster1_shard1_replica_n1&action=CREATE&numShards=2&shard=shard1&property.solr.directoryFactory=solr.StandardDirectoryFactory&wt=javabin
   [junit4]   2> 994107 INFO  (qtp1167533922-12176) [n:127.0.0.1:42905_solr    x:cdcr-cluster1_shard2_replica_n2] o.a.s.h.a.CoreAdminOperation core create command qt=/admin/cores&collection.configName=cdcr-cluster1&newCollection=true&collection=cdcr-cluster1&version=2&replicaType=NRT&coreNodeName=core_node4&name=cdcr-cluster1_shard2_replica_n2&action=CREATE&numShards=2&shard=shard2&property.solr.directoryFactory=solr.StandardDirectoryFactory&wt=javabin
   [junit4]   2> 994108 INFO  (qtp1167533922-12176) [n:127.0.0.1:42905_solr    x:cdcr-cluster1_shard2_replica_n2] o.a.s.c.TransientSolrCoreCacheDefault Allocating transient cache for 2147483647 transient cores
   [junit4]   2> 995118 INFO  (qtp1167533922-12175) [n:127.0.0.1:42905_solr c:cdcr-cluster1 s:shard1 r:core_node3 x:cdcr-cluster1_shard1_replica_n1] o.a.s.c.SolrConfig Using Lucene MatchVersion: 7.6.0
   [junit4]   2> 995118 INFO  (qtp1167533922-12176) [n:127.0.0.1:42905_solr c:cdcr-cluster1 s:shard2 r:core_node4 x:cdcr-cluster1_shard2_replica_n2] o.a.s.c.SolrConfig Using Lucene MatchVersion: 7.6.0
   [junit4]   2> 995122 INFO  (qtp1167533922-12175) [n:127.0.0.1:42905_solr c:cdcr-cluster1 s:shard1 r:core_node3 x:cdcr-cluster1_shard1_replica_n1] o.a.s.s.IndexSchema [cdcr-cluster1_shard1_replica_n1] Schema name=minimal
   [junit4]   2> 995122 INFO  (qtp1167533922-12176) [n:127.0.0.1:42905_solr c:cdcr-cluster1 s:shard2 r:core_node4 x:cdcr-cluster1_shard2_replica_n2] o.a.s.s.IndexSchema [cdcr-cluster1_shard2_replica_n2] Schema name=minimal
   [junit4]   2> 995123 INFO  (qtp1167533922-12176) [n:127.0.0.1:42905_solr c:cdcr-cluster1 s:shard2 r:core_node4 x:cdcr-cluster1_shard2_replica_n2] o.a.s.s.IndexSchema Loaded schema minimal/1.1 with uniqueid field id
   [junit4]   2> 995123 INFO  (qtp1167533922-12175) [n:127.0.0.1:42905_solr c:cdcr-cluster1 s:shard1 r:core_node3 x:cdcr-cluster1_shard1_replica_n1] o.a.s.s.IndexSchema Loaded schema minimal/1.1 with uniqueid field id
   [junit4]   2> 995123 INFO  (qtp1167533922-12176) [n:127.0.0.1:42905_solr c:cdcr-cluster1 s:shard2 r:core_node4 x:cdcr-cluster1_shard2_replica_n2] o.a.s.c.CoreContainer Creating SolrCore 'cdcr-cluster1_shard2_replica_n2' using configuration from collection cdcr-cluster1, trusted=true
   [junit4]   2> 995123 INFO  (qtp1167533922-12175) [n:127.0.0.1:42905_solr c:cdcr-cluster1 s:shard1 r:core_node3 x:cdcr-cluster1_shard1_replica_n1] o.a.s.c.CoreContainer Creating SolrCore 'cdcr-cluster1_shard1_replica_n1' using configuration from collection cdcr-cluster1, trusted=true
   [junit4]   2> 995123 INFO  (qtp1167533922-12176) [n:127.0.0.1:42905_solr c:cdcr-cluster1 s:shard2 r:core_node4 x:cdcr-cluster1_shard2_replica_n2] o.a.s.m.r.SolrJmxReporter JMX monitoring for 'solr_42905.solr.core.cdcr-cluster1.shard2.replica_n2' (registry 'solr.core.cdcr-cluster1.shard2.replica_n2') enabled at server: com.sun.jmx.mbeanserver.JmxMBeanServer@107b56b9
   [junit4]   2> 995123 INFO  (qtp1167533922-12175) [n:127.0.0.1:42905_solr c:cdcr-cluster1 s:shard1 r:core_node3 x:cdcr-cluster1_shard1_replica_n1] o.a.s.m.r.SolrJmxReporter JMX monitoring for 'solr_42905.solr.core.cdcr-cluster1.shard1.replica_n1' (registry 'solr.core.cdcr-cluster1.shard1.replica_n1') enabled at server: com.sun.jmx.mbeanserver.JmxMBeanServer@107b56b9
   [junit4]   2> 995123 INFO  (qtp1167533922-12175) [n:127.0.0.1:42905_solr c:cdcr-cluster1 s:shard1 r:core_node3 x:cdcr-cluster1_shard1_replica_n1] o.a.s.c.SolrCore [[cdcr-cluster1_shard1_replica_n1] ] Opening new SolrCore at [/home/jenkins/workspace/Lucene-Solr-7.x-Linux/solr/build/solr-core/test/J1/temp/solr.cloud.cdcr.CdcrBidirectionalTest_4931982D2F4E5A76-001/cdcr-cluster1-001/node1/cdcr-cluster1_shard1_replica_n1], dataDir=[/home/jenkins/workspace/Lucene-Solr-7.x-Linux/solr/build/solr-core/test/J1/temp/solr.cloud.cdcr.CdcrBidirectionalTest_4931982D2F4E5A76-001/cdcr-cluster1-001/node1/./cdcr-cluster1_shard1_replica_n1/data/]
   [junit4]   2> 995123 INFO  (qtp1167533922-12176) [n:127.0.0.1:42905_solr c:cdcr-cluster1 s:shard2 r:core_node4 x:cdcr-cluster1_shard2_replica_n2] o.a.s.c.SolrCore [[cdcr-cluster1_shard2_replica_n2] ] Opening new SolrCore at [/home/jenkins/workspace/Lucene-Solr-7.x-Linux/solr/build/solr-core/test/J1/temp/solr.cloud.cdcr.CdcrBidirectionalTest_4931982D2F4E5A76-001/cdcr-cluster1-001/node1/cdcr-cluster1_shard2_replica_n2], dataDir=[/home/jenkins/workspace/Lucene-Solr-7.x-Linux/solr/build/solr-core/test/J1/temp/solr.cloud.cdcr.CdcrBidirectionalTest_4931982D2F4E5A76-001/cdcr-cluster1-001/node1/./cdcr-cluster1_shard2_replica_n2/data/]
   [junit4]   2> 995184 INFO  (qtp1167533922-12175) [n:127.0.0.1:42905_solr c:cdcr-cluster1 s:shard1 r:core_node3 x:cdcr-cluster1_shard1_replica_n1] o.a.s.u.UpdateHandler Using UpdateLog implementation: org.apache.solr.update.CdcrUpdateLog
   [junit4]   2> 995184 INFO  (qtp1167533922-12175) [n:127.0.0.1:42905_solr c:cdcr-cluster1 s:shard1 r:core_node3 x:cdcr-cluster1_shard1_replica_n1] o.a.s.u.UpdateLog Initializing UpdateLog: dataDir= defaultSyncLevel=FLUSH numRecordsToKeep=100 maxNumLogsToKeep=10 numVersionBuckets=65536
   [junit4]   2> 995184 INFO  (qtp1167533922-12176) [n:127.0.0.1:42905_solr c:cdcr-cluster1 s:shard2 r:core_node4 x:cdcr-cluster1_shard2_replica_n2] o.a.s.u.UpdateHandler Using UpdateLog implementation: org.apache.solr.update.CdcrUpdateLog
   [junit4]   2> 995184 INFO  (qtp1167533922-12176) [n:127.0.0.1:42905_solr c:cdcr-cluster1 s:shard2 r:core_node4 x:cdcr-cluster1_shard2_replica_n2] o.a.s.u.UpdateLog Initializing UpdateLog: dataDir= defaultSyncLevel=FLUSH numRecordsToKeep=100 maxNumLogsToKeep=10 numVersionBuckets=65536
   [junit4]   2> 995185 INFO  (qtp1167533922-12176) [n:127.0.0.1:42905_solr c:cdcr-cluster1 s:shard2 r:core_node4 x:cdcr-cluster1_shard2_replica_n2] o.a.s.u.CommitTracker Hard AutoCommit: disabled
   [junit4]   2> 995185 INFO  (qtp1167533922-12175) [n:127.0.0.1:42905_solr c:cdcr-cluster1 s:shard1 r:core_node3 x:cdcr-cluster1_shard1_replica_n1] o.a.s.u.CommitTracker Hard AutoCommit: disabled
   [junit4]   2> 995185 INFO  (qtp1167533922-12176) [n:127.0.0.1:42905_solr c:cdcr-cluster1 s:shard2 r:core_node4 x:cdcr-cluster1_shard2_replica_n2] o.a.s.u.CommitTracker Soft AutoCommit: disabled
   [junit4]   2> 995185 INFO  (qtp1167533922-12175) [n:127.0.0.1:42905_solr c:cdcr-cluster1 s:shard1 r:core_node3 x:cdcr-cluster1_shard1_replica_n1] o.a.s.u.CommitTracker Soft AutoCommit: disabled
   [junit4]   2> 995187 INFO  (qtp1167533922-12175) [n:127.0.0.1:42905_solr c:cdcr-cluster1 s:shard1 r:core_node3 x:cdcr-cluster1_shard1_replica_n1] o.a.s.s.SolrIndexSearcher Opening [Searcher@637c9cc1[cdcr-cluster1_shard1_replica_n1] main]
   [junit4]   2> 995187 INFO  (qtp1167533922-12176) [n:127.0.0.1:42905_solr c:cdcr-cluster1 s:shard2 r:core_node4 x:cdcr-cluster1_shard2_replica_n2] o.a.s.s.SolrIndexSearcher Opening [Searcher@39629552[cdcr-cluster1_shard2_replica_n2] main]
   [junit4]   2> 995188 INFO  (qtp1167533922-12176) [n:127.0.0.1:42905_solr c:cdcr-cluster1 s:shard2 r:core_node4 x:cdcr-cluster1_shard2_replica_n2] o.a.s.r.ManagedResourceStorage Configured ZooKeeperStorageIO with znodeBase: /configs/cdcr-cluster1
   [junit4]   2> 995188 INFO  (qtp1167533922-12175) [n:127.0.0.1:42905_solr c:cdcr-cluster1 s:shard1 r:core_node3 x:cdcr-cluster1_shard1_replica_n1] o.a.s.r.ManagedResourceStorage Configured ZooKeeperStorageIO with znodeBase: /configs/cdcr-cluster1
   [junit4]   2> 995188 INFO  (qtp1167533922-12175) [n:127.0.0.1:42905_solr c:cdcr-cluster1 s:shard1 r:core_node3 x:cdcr-cluster1_shard1_replica_n1] o.a.s.r.ManagedResourceStorage Loaded null at path _rest_managed.json using ZooKeeperStorageIO:path=/configs/cdcr-cluster1
   [junit4]   2> 995188 INFO  (qtp1167533922-12176) [n:127.0.0.1:42905_solr c:cdcr-cluster1 s:shard2 r:core_node4 x:cdcr-cluster1_shard2_replica_n2] o.a.s.r.ManagedResourceStorage Loaded null at path _rest_managed.json using ZooKeeperStorageIO:path=/configs/cdcr-cluster1
   [junit4]   2> 995188 INFO  (qtp1167533922-12175) [n:127.0.0.1:42905_solr c:cdcr-cluster1 s:shard1 r:core_node3 x:cdcr-cluster1_shard1_replica_n1] o.a.s.s.ZkIndexSchemaReader Creating ZooKeeper watch for the managed schema at /configs/cdcr-cluster1/managed-schema
   [junit4]   2> 995188 INFO  (qtp1167533922-12176) [n:127.0.0.1:42905_solr c:cdcr-cluster1 s:shard2 r:core_node4 x:cdcr-cluster1_shard2_replica_n2] o.a.s.s.ZkIndexSchemaReader Creating ZooKeeper watch for the managed schema at /configs/cdcr-cluster1/managed-schema
   [junit4]   2> 995188 INFO  (qtp1167533922-12175) [n:127.0.0.1:42905_solr c:cdcr-cluster1 s:shard1 r:core_node3 x:cdcr-cluster1_shard1_replica_n1] o.a.s.s.ZkIndexSchemaReader Current schema version 0 is already the latest
   [junit4]   2> 995188 INFO  (qtp1167533922-12176) [n:127.0.0.1:42905_solr c:cdcr-cluster1 s:shard2 r:core_node4 x:cdcr-cluster1_shard2_replica_n2] o.a.s.s.ZkIndexSchemaReader Current schema version 0 is already the latest
   [junit4]   2> 995189 INFO  (qtp1167533922-12175) [n:127.0.0.1:42905_solr c:cdcr-cluster1 s:shard1 r:core_node3 x:cdcr-cluster1_shard1_replica_n1] o.a.s.h.ReplicationHandler Commits will be reserved for 10000ms.
   [junit4]   2> 995189 INFO  (qtp1167533922-12176) [n:127.0.0.1:42905_solr c:cdcr-cluster1 s:shard2 r:core_node4 x:cdcr-cluster1_shard2_replica_n2] o.a.s.h.ReplicationHandler Commits will be reserved for 10000ms.
   [junit4]   2> 995191 INFO  (qtp1167533922-12175) [n:127.0.0.1:42905_solr c:cdcr-cluster1 s:shard1 r:core_node3 x:cdcr-cluster1_shard1_replica_n1] o.a.s.h.CdcrBufferStateManager Created znode /collections/cdcr-cluster1/cdcr/state/buffer
   [junit4]   2> 995194 INFO  (qtp1167533922-12176) [n:127.0.0.1:42905_solr c:cdcr-cluster1 s:shard2 r:core_node4 x:cdcr-cluster1_shard2_replica_n2] o.a.s.h.CdcrProcessStateManager Created znode /collections/cdcr-cluster1/cdcr/state/process
   [junit4]   2> 995205 INFO  (qtp1167533922-12176) [n:127.0.0.1:42905_solr c:cdcr-cluster1 s:shard2 r:core_node4 x:cdcr-cluster1_shard2_replica_n2] o.a.s.u.UpdateLog Could not find max version in index or recent updates, using new clock 1612133794665463808
   [junit4]   2> 995205 INFO  (qtp1167533922-12175) [n:127.0.0.1:42905_solr c:cdcr-cluster1 s:shard1 r:core_node3 x:cdcr-cluster1_shard1_replica_n1] o.a.s.u.UpdateLog Could not find max version in index or recent updates, using new clock 1612133794665463808
   [junit4]   2> 995205 INFO  (searcherExecutor-4956-thread-1-processing-n:127.0.0.1:42905_solr x:cdcr-cluster1_shard2_replica_n2 c:cdcr-cluster1 s:shard2 r:core_node4) [n:127.0.0.1:42905_solr c:cdcr-cluster1 s:shard2 r:core_node4 x:cdcr-cluster1_shard2_replica_n2] o.a.s.c.SolrCore [cdcr-cluster1_shard2_replica_n2] Registered new searcher Searcher@39629552[cdcr-cluster1_shard2_replica_n2] main{ExitableDirectoryReader(UninvertingDirectoryReader())}
   [junit4]   2> 995205 INFO  (searcherExecutor-4955-thread-1-processing-n:127.0.0.1:42905_solr x:cdcr-cluster1_shard1_replica_n1 c:cdcr-cluster1 s:shard1 r:core_node3) [n:127.0.0.1:42905_solr c:cdcr-cluster1 s:shard1 r:core_node3 x:cdcr-cluster1_shard1_replica_n1] o.a.s.c.SolrCore [cdcr-cluster1_shard1_replica_n1] Registered new searcher Searcher@637c9cc1[cdcr-cluster1_shard1_replica_n1] main{ExitableDirectoryReader(UninvertingDirectoryReader())}
   [junit4]   2> 995209 INFO  (qtp1167533922-12175) [n:127.0.0.1:42905_solr c:cdcr-cluster1 s:shard1 r:core_node3 x:cdcr-cluster1_shard1_replica_n1] o.a.s.c.ZkShardTerms Successful update of terms at /collections/cdcr-cluster1/terms/shard1 to Terms{values={core_node3=0}, version=0}
   [junit4]   2> 995209 INFO  (qtp1167533922-12176) [n:127.0.0.1:42905_solr c:cdcr-cluster1 s:shard2 r:core_node4 x:cdcr-cluster1_shard2_replica_n2] o.a.s.c.ZkShardTerms Successful update of terms at /collections/cdcr-cluster1/terms/shard2 to Terms{values={core_node4=0}, version=0}
   [junit4]   2> 995216 INFO  (qtp1167533922-12175) [n:127.0.0.1:42905_solr c:cdcr-cluster1 s:shard1 r:core_node3 x:cdcr-cluster1_shard1_replica_n1] o.a.s.c.ShardLeaderElectionContext Enough replicas found to continue.
   [junit4]   2> 995216 INFO  (qtp1167533922-12175) [n:127.0.0.1:42905_solr c:cdcr-cluster1 s:shard1 r:core_node3 x:cdcr-cluster1_shard1_replica_n1] o.a.s.c.ShardLeaderElectionContext I may be the new leader - try and sync
   [junit4]   2> 995216 INFO  (qtp1167533922-12175) [n:127.0.0.1:42905_solr c:cdcr-cluster1 s:shard1 r:core_node3 x:cdcr-cluster1_shard1_replica_n1] o.a.s.c.SyncStrategy Sync replicas to http://127.0.0.1:42905/solr/cdcr-cluster1_shard1_replica_n1/
   [junit4]   2> 995216 INFO  (qtp1167533922-12175) [n:127.0.0.1:42905_solr c:cdcr-cluster1 s:shard1 r:core_node3 x:cdcr-cluster1_shard1_replica_n1] o.a.s.c.SyncStrategy Sync Success - now sync replicas to me
   [junit4]   2> 995216 INFO  (qtp1167533922-12176) [n:127.0.0.1:42905_solr c:cdcr-cluster1 s:shard2 r:core_node4 x:cdcr-cluster1_shard2_replica_n2] o.a.s.c.ShardLeaderElectionContext Enough replicas found to continue.
   [junit4]   2> 995216 INFO  (qtp1167533922-12175) [n:127.0.0.1:42905_solr c:cdcr-cluster1 s:shard1 r:core_node3 x:cdcr-cluster1_shard1_replica_n1] o.a.s.c.SyncStrategy http://127.0.0.1:42905/solr/cdcr-cluster1_shard1_replica_n1/ has no replicas
   [junit4]   2> 995216 INFO  (qtp1167533922-12176) [n:127.0.0.1:42905_solr c:cdcr-cluster1 s:shard2 r:core_node4 x:cdcr-cluster1_shard2_replica_n2] o.a.s.c.ShardLeaderElectionContext I may be the new leader - try and sync
   [junit4]   2> 995216 INFO  (qtp1167533922-12175) [n:127.0.0.1:42905_solr c:cdcr-cluster1 s:shard1 r:core_node3 x:cdcr-cluster1_shard1_replica_n1] o.a.s.c.ShardLeaderElectionContext Found all replicas participating in election, clear LIR
   [junit4]   2> 995216 INFO  (qtp1167533922-12176) [n:127.0.0.1:42905_solr c:cdcr-cluster1 s:shard2 r:core_node4 x:cdcr-cluster1_shard2_replica_n2] o.a.s.c.SyncStrategy Sync replicas to http://127.0.0.1:42905/solr/cdcr-cluster1_shard2_replica_n2/
   [junit4]   2> 995217 INFO  (qtp1167533922-12176) [n:127.0.0.1:42905_solr c:cdcr-cluster1 s:shard2 r:core_node4 x:cdcr-cluster1_shard2_replica_n2] o.a.s.c.SyncStrategy Sync Success - now sync replicas to me
   [junit4]   2> 995217 INFO  (qtp1167533922-12176) [n:127.0.0.1:42905_solr c:cdcr-cluster1 s:shard2 r:core_node4 x:cdcr-cluster1_shard2_replica_n2] o.a.s.c.SyncStrategy http://127.0.0.1:42905/solr/cdcr-cluster1_shard2_replica_n2/ has no replicas
   [junit4]   2> 995217 INFO  (qtp1167533922-12176) [n:127.0.0.1:42905_solr c:cdcr-cluster1 s:shard2 r:core_node4 x:cdcr-cluster1_shard2_replica_n2] o.a.s.c.ShardLeaderElectionContext Found all replicas participating in election, clear LIR
   [junit4]   2> 995218 INFO  (zkCallback-3067-thread-1) [    ] o.a.s.h.CdcrLeaderStateManager Received new leader state @ cdcr-cluster1:shard1
   [junit4]   2> 995219 INFO  (qtp1167533922-12175) [n:127.0.0.1:42905_solr c:cdcr-cluster1 s:shard1 r:core_node3 x:cdcr-cluster1_shard1_replica_n1] o.a.s.c.ShardLeaderElectionContext I am the new leader: http://127.0.0.1:42905/solr/cdcr-cluster1_shard1_replica_n1/ shard1
   [junit4]   2> 995219 INFO  (qtp1167533922-12176) [n:127.0.0.1:42905_solr c:cdcr-cluster1 s:shard2 r:core_node4 x:cdcr-cluster1_shard2_replica_n2] o.a.s.c.ShardLeaderElectionContext I am the new leader: http://127.0.0.1:42905/solr/cdcr-cluster1_shard2_replica_n2/ shard2
   [junit4]   2> 995221 INFO  (zkCallback-3067-thread-2) [    ] o.a.s.h.CdcrLeaderStateManager Received new leader state @ cdcr-cluster1:shard2
   [junit4]   2> 995371 INFO  (qtp1167533922-12175) [n:127.0.0.1:42905_solr c:cdcr-cluster1 s:shard1 r:core_node3 x:cdcr-cluster1_shard1_replica_n1] o.a.s.c.ZkController I am the leader, no recovery necessary
   [junit4]   2> 995371 INFO  (qtp1167533922-12176) [n:127.0.0.1:42905_solr c:cdcr-cluster1 s:shard2 r:core_node4 x:cdcr-cluster1_shard2_replica_n2] o.a.s.c.ZkController I am the leader, no recovery necessary
   [junit4]   2> 995374 INFO  (qtp1167533922-12176) [n:127.0.0.1:42905_solr c:cdcr-cluster1 s:shard2 r:core_node4 x:cdcr-cluster1_shard2_replica_n2] o.a.s.s.HttpSolrCall [admin] webapp=null path=/admin/cores params={qt=/admin/cores&collection.configName=cdcr-cluster1&newCollection=true&collection=cdcr-cluster1&version=2&replicaType=NRT&coreNodeName=core_node4&name=cdcr-cluster1_shard2_replica_n2&action=CREATE&numShards=2&shard=shard2&property.solr.directoryFactory=solr.StandardDirectoryFactory&wt=javabin} status=0 QTime=1266
   [junit4]   2> 995374 INFO  (qtp1167533922-12175) [n:127.0.0.1:42905_solr c:cdcr-cluster1 s:shard1 r:core_node3 x:cdcr-cluster1_shard1_replica_n1] o.a.s.s.HttpSolrCall [admin] webapp=null path=/admin/cores params={qt=/admin/cores&collection.configName=cdcr-cluster1&newCollection=true&collection=cdcr-cluster1&version=2&replicaType=NRT&coreNodeName=core_node3&name=cdcr-cluster1_shard1_replica_n1&action=CREATE&numShards=2&shard=shard1&property.solr.directoryFactory=solr.StandardDirectoryFactory&wt=javabin} status=0 QTime=1266
   [junit4]   2> 995376 INFO  (qtp1167533922-12180) [n:127.0.0.1:42905_solr    ] o.a.s.h.a.CollectionsHandler Wait for new collection to be active for at most 30 seconds. Check all shard replicas
   [junit4]   2> 995475 INFO  (zkCallback-3067-thread-2) [    ] o.a.s.c.c.ZkStateReader A cluster state change: [WatchedEvent state:SyncConnected type:NodeDataChanged path:/collections/cdcr-cluster1/state.json] for collection [cdcr-cluster1] has occurred - updating... (live nodes size: [1])
   [junit4]   2> 995802 INFO  (OverseerCollectionConfigSetProcessor-72257234425675779-127.0.0.1:42905_solr-n_0000000000) [n:127.0.0.1:42905_solr    ] o.a.s.c.OverseerTaskQueue Response ZK path: /overseer/collection-queue-work/qnr-0000000000 doesn't exist.  Requestor may have disconnected from ZooKeeper
   [junit4]   2> 996376 INFO  (qtp1167533922-12180) [n:127.0.0.1:42905_solr    ] o.a.s.s.HttpSolrCall [admin] webapp=null path=/admin/collections params={collection.configName=cdcr-cluster1&maxShardsPerNode=2&name=cdcr-cluster1&nrtReplicas=1&action=CREATE&numShards=2&property.solr.directoryFactory=solr.StandardDirectoryFactory&wt=javabin&version=2} status=0 QTime=2577
   [junit4]   2> 996378 INFO  (zkConnectionManagerCallback-3091-thread-1) [    ] o.a.s.c.c.ConnectionManager zkClient has connected
   [junit4]   2> 996381 INFO  (zkConnectionManagerCallback-3095-thread-1) [    ] o.a.s.c.c.ConnectionManager zkClient has connected
   [junit4]   2> 996383 INFO  (TEST-CdcrBidirectionalTest.testBiDir-seed#[4931982D2F4E5A76]) [    ] o.a.s.c.c.ZkStateReader Updated live nodes from ZooKeeper... (0) -> (1)
   [junit4]   2> 996387 INFO  (TEST-CdcrBidirectionalTest.testBiDir-seed#[4931982D2F4E5A76]) [    ] o.a.s.c.s.i.ZkClientClusterStateProvider Cluster at 127.0.0.1:41433/solr ready
   [junit4]   2> 996387 INFO  (qtp66475914-12126) [n:127.0.0.1:34917_solr    ] o.a.s.h.a.CollectionsHandler Invoked Collection Action :create with params collection.configName=cdcr-cluster2&maxShardsPerNode=2&name=cdcr-cluster2&nrtReplicas=1&action=CREATE&numShards=2&property.solr.directoryFactory=solr.StandardDirectoryFactory&wt=javabin&version=2 and sendToOCPQueue=true
   [junit4]   2> 996389 INFO  (OverseerThreadFactory-4937-thread-1-processing-n:127.0.0.1:34917_solr) [n:127.0.0.1:34917_solr    ] o.a.s.c.a.c.CreateCollectionCmd Create collection cdcr-cluster2
   [junit4]   2> 996494 INFO  (OverseerStateUpdate-72257234409553923-127.0.0.1:34917_solr-n_0000000000) [n:127.0.0.1:34917_solr    ] o.a.s.c.o.SliceMutator createReplica() {
   [junit4]   2>   "operation":"ADDREPLICA",
   [junit4]   2>   "collection":"cdcr-cluster2",
   [junit4]   2>   "shard":"shard1",
   [junit4]   2>   "core":"cdcr-cluster2_shard1_replica_n1",
   [junit4]   2>   "state":"down",
   [junit4]   2>   "base_url":"http://127.0.0.1:34917/solr",
   [junit4]   2>   "type":"NRT",
   [junit4]   2>   "waitForFinalState":"false"} 
   [junit4]   2> 996495 INFO  (OverseerStateUpdate-72257234409553923-127.0.0.1:34917_solr-n_0000000000) [n:127.0.0.1:34917_solr    ] o.a.s.c.o.SliceMutator createReplica() {
   [junit4]   2>   "operation":"ADDREPLICA",
   [junit4]   2>   "collection":"cdcr-cluster2",
   [junit4]   2>   "shard":"shard2",
   [junit4]   2>   "core":"cdcr-cluster2_shard2_replica_n2",
   [junit4]   2>   "state":"down",
   [junit4]   2>   "base_url":"http://127.0.0.1:34917/solr",
   [junit4]   2>   "type":"NRT",
   [junit4]   2>   "waitForFinalState":"false"} 
   [junit4]   2> 996698 INFO  (qtp66475914-12121) [n:127.0.0.1:34917_solr    x:cdcr-cluster2_shard2_replica_n2] o.a.s.h.a.CoreAdminOperation core create command qt=/admin/cores&collection.configName=cdcr-cluster2&newCollection=true&collection=cdcr-cluster2&version=2&replicaType=NRT&coreNodeName=core_node4&name=cdcr-cluster2_shard2_replica_n2&action=CREATE&numShards=2&shard=shard2&property.solr.directoryFactory=solr.StandardDirectoryFactory&wt=javabin
   [junit4]   2> 996698 INFO  (qtp66475914-12121) [n:127.0.0.1:34917_solr    x:cdcr-cluster2_shard2_replica_n2] o.a.s.c.TransientSolrCoreCacheDefault Allocating transient cache for 2147483647 transient cores
   [junit4]   2> 996698 INFO  (qtp66475914-12253) [n:127.0.0.1:34917_solr    x:cdcr-cluster2_shard1_replica_n1] o.a.s.h.a.CoreAdminOperation core create command qt=/admin/cores&collection.configName=cdcr-cluster2&newCollection=true&collection=cdcr-cluster2&version=2&replicaType=NRT&coreNodeName=core_node3&name=cdcr-cluster2_shard1_replica_n1&action=CREATE&numShards=2&shard=shard1&property.solr.directoryFactory=solr.StandardDirectoryFactory&wt=javabin
   [junit4]   2> 997707 INFO  (qtp66475914-12121) [n:127.0.0.1:34917_solr c:cdcr-cluster2 s:shard2 r:core_node4 x:cdcr-cluster2_shard2_replica_n2] o.a.s.c.SolrConfig Using Lucene MatchVersion: 7.6.0
   [junit4]   2> 997707 INFO  (qtp66475914-12253) [n:127.0.0.1:34917_solr c:cdcr-cluster2 s:shard1 r:core_node3 x:cdcr-cluster2_shard1_replica_n1] o.a.s.c.SolrConfig Using Lucene MatchVersion: 7.6.0
   [junit4]   2> 997710 INFO  (qtp66475914-12253) [n:127.0.0.1:34917_solr c:cdcr-cluster2 s:shard1 r:core_node3 x:cdcr-cluster2_shard1_replica_n1] o.a.s.s.IndexSchema [cdcr-cluster2_shard1_replica_n1] Schema name=minimal
   [junit4]   2> 997710 INFO  (qtp66475914-12121) [n:127.0.0.1:34917_solr c:cdcr-cluster2 s:shard2 r:core_node4 x:cdcr-cluster2_shard2_replica_n2] o.a.s.s.IndexSchema [cdcr-cluster2_shard2_replica_n2] Schema name=minimal
   [junit4]   2> 997711 INFO  (qtp66475914-12121) [n:127.0.0.1:34917_solr c:cdcr-cluster2 s:shard2 r:core_node4 x:cdcr-cluster2_shard2_replica_n2] o.a.s.s.IndexSchema Loaded schema minimal/1.1 with uniqueid field id
   [junit4]   2> 997711 INFO  (qtp66475914-12253) [n:127.0.0.1:34917_solr c:cdcr-cluster2 s:shard1 r:core_node3 x:cdcr-cluster2_shard1_replica_n1] o.a.s.s.IndexSchema Loaded schema minimal/1.1 with uniqueid field id
   [junit4]   2> 997711 INFO  (qtp66475914-12121) [n:127.0.0.1:34917_solr c:cdcr-cluster2 s:shard2 r:core_node4 x:cdcr-cluster2_shard2_replica_n2] o.a.s.c.CoreContainer Creating SolrCore 'cdcr-cluster2_shard2_replica_n2' using configuration from collection cdcr-cluster2, trusted=true
   [junit4]   2> 997711 INFO  (qtp66475914-12253) [n:127.0.0.1:34917_solr c:cdcr-cluster2 s:shard1 r:core_node3 x:cdcr-cluster2_shard1_replica_n1] o.a.s.c.CoreContainer Creating SolrCore 'cdcr-cluster2_shard1_replica_n1' using configuration from collection cdcr-cluster2, trusted=true
   [junit4]   2> 997711 INFO  (qtp66475914-12253) [n:127.0.0.1:34917_solr c:cdcr-cluster2 s:shard1 r:core_node3 x:cdcr-cluster2_shard1_replica_n1] o.a.s.m.r.SolrJmxReporter JMX monitoring for 'solr_34917.solr.core.cdcr-cluster2.shard1.replica_n1' (registry 'solr.core.cdcr-cluster2.shard1.replica_n1') enabled at server: com.sun.jmx.mbeanserver.JmxMBeanServer@107b56b9
   [junit4]   2> 997711 INFO  (qtp66475914-12121) [n:127.0.0.1:34917_solr c:cdcr-cluster2 s:shard2 r:core_node4 x:cdcr-cluster2_shard2_replica_n2] o.a.s.m.r.SolrJmxReporter JMX monitoring for 'solr_34917.solr.core.cdcr-cluster2.shard2.replica_n2' (registry 'solr.core.cdcr-cluster2.shard2.replica_n2') enabled at server: com.sun.jmx.mbeanserver.JmxMBeanServer@107b56b9
   [junit4]   2> 997712 INFO  (qtp66475914-12121) [n:127.0.0.1:34917_solr c:cdcr-cluster2 s:shard2 r:core_node4 x:cdcr-cluster2_shard2_replica_n2] o.a.s.c.SolrCore [[cdcr-cluster2_shard2_replica_n2] ] Opening new SolrCore at [/home/jenkins/workspace/Lucene-Solr-7.x-Linux/solr/build/solr-core/test/J1/temp/solr.cloud.cdcr.CdcrBidirectionalTest_4931982D2F4E5A76-001/cdcr-cluster2-001/node1/cdcr-cluster2_shard2_replica_n2], dataDir=[/home/jenkins/workspace/Lucene-Solr-7.x-Linux/solr/build/solr-core/test/J1/temp/solr.cloud.cdcr.CdcrBidirectionalTest_4931982D2F4E5A76-001/cdcr-cluster2-001/node1/./cdcr-cluster2_shard2_replica_n2/data/]
   [junit4]   2> 997712 INFO  (qtp66475914-12253) [n:127.0.0.1:34917_solr c:cdcr-cluster2 s:shard1 r:core_node3 x:cdcr-cluster2_shard1_replica_n1] o.a.s.c.SolrCore [[cdcr-cluster2_shard1_replica_n1] ] Opening new SolrCore at [/home/jenkins/workspace/Lucene-Solr-7.x-Linux/solr/build/solr-core/test/J1/temp/solr.cloud.cdcr.CdcrBidirectionalTest_4931982D2F4E5A76-001/cdcr-cluster2-001/node1/cdcr-cluster2_shard1_replica_n1], dataDir=[/home/jenkins/workspace/Lucene-Solr-7.x-Linux/solr/build/solr-core/test/J1/temp/solr.cloud.cdcr.CdcrBidirectionalTest_4931982D2F4E5A76-001/cdcr-cluster2-001/node1/./cdcr-cluster2_shard1_replica_n1/data/]
   [junit4]   2> 997815 INFO  (qtp66475914-12121) [n:127.0.0.1:34917_solr c:cdcr-cluster2 s:shard2 r:core_node4 x:cdcr-cluster2_shard2_replica_n2] o.a.s.u.UpdateHandler Using UpdateLog implementation: org.apache.solr.update.CdcrUpdateLog
   [junit4]   2> 997815 INFO  (qtp66475914-12121) [n:127.0.0.1:34917_solr c:cdcr-cluster2 s:shard2 r:core_node4 x:cdcr-cluster2_shard2_replica_n2] o.a.s.u.UpdateLog Initializing UpdateLog: dataDir= defaultSyncLevel=FLUSH numRecordsToKeep=100 maxNumLogsToKeep=10 numVersionBuckets=65536
   [junit4]   2> 997815 INFO  (qtp66475914-12253) [n:127.0.0.1:34917_solr c:cdcr-cluster2 s:shard1 r:core_node3 x:cdcr-cluster2_shard1_replica_n1] o.a.s.u.UpdateHandler Using UpdateLog implementation: org.apache.solr.update.CdcrUpdateLog
   [junit4]   2> 997815 INFO  (qtp66475914-12253) [n:127.0.0.1:34917_solr c:cdcr-cluster2 s:shard1 r:core_node3 x:cdcr-cluster2_shard1_replica_n1] o.a.s.u.UpdateLog Initializing UpdateLog: dataDir= defaultSyncLevel=FLUSH numRecordsToKeep=100 maxNumLogsToKeep=10 numVersionBuckets=65536
   [junit4]   2> 997815 INFO  (qtp66475914-12121) [n:127.0.0.1:34917_solr c:cdcr-cluster2 s:shard2 r:core_node4 x:cdcr-cluster2_shard2_replica_n2] o.a.s.u.CommitTracker Hard AutoCommit: disabled
   [junit4]   2> 997815 INFO  (qtp66475914-12121) [n:127.0.0.1:34917_solr c:cdcr-cluster2 s:shard2 r:core_node4 x:cdcr-cluster2_shard2_replica_n2] o.a.s.u.CommitTracker Soft AutoCommit: disabled
   [junit4]   2> 997816 INFO  (qtp66475914-12253) [n:127.0.0.1:34917_solr c:cdcr-cluster2 s:shard1 r:core_node3 x:cdcr-cluster2_shard1_replica_n1] o.a.s.u.CommitTracker Hard AutoCommit: disabled
   [junit4]   2> 997816 INFO  (qtp66475914-12253) [n:127.0.0.1:34917_solr c:cdcr-cluster2 s:shard1 r:core_node3 x:cdcr-cluster2_shard1_replica_n1] o.a.s.u.CommitTracker Soft AutoCommit: disabled
   [junit4]   2> 997817 INFO  (qtp66475914-12121) [n:127.0.0.1:34917_solr c:cdcr-cluster2 s:shard2 r:core_node4 x:cdcr-cluster2_shard2_replica_n2] o.a.s.s.SolrIndexSearcher Opening [Searcher@35e2c7ea[cdcr-cluster2_shard2_replica_n2] main]
   [junit4]   2> 997818 INFO  (qtp66475914-12121) [n:127.0.0.1:34917_solr c:cdcr-cluster2 s:shard2 r:core_node4 x:cdcr-cluster2_shard2_replica_n2] o.a.s.r.ManagedResourceStorage Configured ZooKeeperStorageIO with znodeBase: /configs/cdcr-cluster2
   [junit4]   2> 997818 INFO  (qtp66475914-12253) [n:127.0.0.1:34917_solr c:cdcr-cluster2 s:shard1 r:core_node3 x:cdcr-cluster2_shard1_replica_n1] o.a.s.s.SolrIndexSearcher Opening [Searcher@32feee64[cdcr-cluster2_shard1_replica_n1] main]
   [junit4]   2> 997818 INFO  (qtp66475914-12121) [n:127.0.0.1:34917_solr c:cdcr-cluster2 s:shard2 r:core_node4 x:cdcr-cluster2_shard2_replica_n2] o.a.s.r.ManagedResourceStorage Loaded null at path _rest_managed.json using ZooKeeperStorageIO:path=/configs/cdcr-cluster2
   [junit4]   2> 997818 INFO  (qtp66475914-12121) [n:127.0.0.1:34917_solr c:cdcr-cluster2 s:shard2 r:core_node4 x:cdcr-cluster2_shard2_replica_n2] o.a.s.s.ZkIndexSchemaReader Creating ZooKeeper watch for the managed schema at /configs/cdcr-cluster2/managed-schema
   [junit4]   2> 997818 INFO  (qtp66475914-12121) [n:127.0.0.1:34917_solr c:cdcr-cluster2 s:shard2 r:core_node4 x:cdcr-cluster2_shard2_replica_n2] o.a.s.s.ZkIndexSchemaReader Current schema version 0 is already the latest
   [junit4]   2> 997818 INFO  (qtp66475914-12253) [n:127.0.0.1:34917_solr c:cdcr-cluster2 s:shard1 r:core_node3 x:cdcr-cluster2_shard1_replica_n1] o.a.s.r.ManagedResourceStorage Configured ZooKeeperStorageIO with znodeBase: /configs/cdcr-cluster2
   [junit4]   2> 997819 INFO  (qtp66475914-12253) [n:127.0.0.1:34917_solr c:cdcr-cluster2 s:shard1 r:core_node3 x:cdcr-cluster2_shard1_replica_n1] o.a.s.r.ManagedResourceStorage Loaded null at path _rest_managed.json using ZooKeeperStorageIO:path=/configs/cdcr-cluster2
   [junit4]   2> 997819 INFO  (qtp66475914-12253) [n:127.0.0.1:34917_solr c:cdcr-cluster2 s:shard1 r:core_node3 x:cdcr-cluster2_shard1_replica_n1] o.a.s.s.ZkIndexSchemaReader Creating ZooKeeper watch for the managed schema at /configs/cdcr-cluster2/managed-schema
   [junit4]   2> 997819 INFO  (qtp66475914-12121) [n:127.0.0.1:34917_solr c:cdcr-cluster2 s:shard2 r:core_node4 x:cdcr-cluster2_shard2_replica_n2] o.a.s.h.ReplicationHandler Commits will be reserved for 10000ms.
   [junit4]   2> 997819 INFO  (qtp66475914-12253) [n:127.0.0.1:34917_solr c:cdcr-cluster2 s:shard1 r:core_node3 x:cdcr-cluster2_shard1_replica_n1] o.a.s.s.ZkIndexSchemaReader Current schema version 0 is already the latest
   [junit4]   2> 997819 INFO  (qtp66475914-12253) [n:127.0.0.1:34917_solr c:cdcr-cluster2 s:shard1 r:core_node3 x:cdcr-cluster2_shard1_replica_n1] o.a.s.h.ReplicationHandler Commits will be reserved for 10000ms.
   [junit4]   2> 997820 INFO  (qtp66475914-12121) [n:127.0.0.1:34917_solr c:cdcr-cluster2 s:shard2 r:core_node4 x:cdcr-cluster2_shard2_replica_n2] o.a.s.h.CdcrBufferStateManager Created zno

[...truncated too long message...]

derr was not empty, see: /home/jenkins/workspace/Lucene-Solr-7.x-Linux/solr/build/contrib/solr-dataimporthandler-extras/test/temp/junit4-J1-20180920_141232_0453356148440142263436.syserr
   [junit4] >>> JVM J1 emitted unexpected output (verbatim) ----
   [junit4] OpenJDK 64-Bit Server VM warning: Option UseConcMarkSweepGC was deprecated in version 9.0 and will likely be removed in a future release.
   [junit4] <<< JVM J1: EOF ----

[...truncated 662 lines...]
   [junit4] JVM J1: stderr was not empty, see: /home/jenkins/workspace/Lucene-Solr-7.x-Linux/solr/build/contrib/solr-dataimporthandler/test/temp/junit4-J1-20180920_141239_8885952227681633146121.syserr
   [junit4] >>> JVM J1 emitted unexpected output (verbatim) ----
   [junit4] OpenJDK 64-Bit Server VM warning: Option UseConcMarkSweepGC was deprecated in version 9.0 and will likely be removed in a future release.
   [junit4] <<< JVM J1: EOF ----

[...truncated 3 lines...]
   [junit4] JVM J0: stderr was not empty, see: /home/jenkins/workspace/Lucene-Solr-7.x-Linux/solr/build/contrib/solr-dataimporthandler/test/temp/junit4-J0-20180920_141239_88816591752377930048927.syserr
   [junit4] >>> JVM J0 emitted unexpected output (verbatim) ----
   [junit4] OpenJDK 64-Bit Server VM warning: Option UseConcMarkSweepGC was deprecated in version 9.0 and will likely be removed in a future release.
   [junit4] <<< JVM J0: EOF ----

[...truncated 3 lines...]
   [junit4] JVM J2: stderr was not empty, see: /home/jenkins/workspace/Lucene-Solr-7.x-Linux/solr/build/contrib/solr-dataimporthandler/test/temp/junit4-J2-20180920_141239_8881762615685844618528.syserr
   [junit4] >>> JVM J2 emitted unexpected output (verbatim) ----
   [junit4] OpenJDK 64-Bit Server VM warning: Option UseConcMarkSweepGC was deprecated in version 9.0 and will likely be removed in a future release.
   [junit4] <<< JVM J2: EOF ----

[...truncated 578 lines...]
   [junit4] JVM J1: stderr was not empty, see: /home/jenkins/workspace/Lucene-Solr-7.x-Linux/solr/build/contrib/solr-cell/test/temp/junit4-J1-20180920_141301_90610444635010063231633.syserr
   [junit4] >>> JVM J1 emitted unexpected output (verbatim) ----
   [junit4] OpenJDK 64-Bit Server VM warning: Option UseConcMarkSweepGC was deprecated in version 9.0 and will likely be removed in a future release.
   [junit4] <<< JVM J1: EOF ----

[...truncated 3 lines...]
   [junit4] JVM J2: stderr was not empty, see: /home/jenkins/workspace/Lucene-Solr-7.x-Linux/solr/build/contrib/solr-cell/test/temp/junit4-J2-20180920_141301_9069253534306054405037.syserr
   [junit4] >>> JVM J2 emitted unexpected output (verbatim) ----
   [junit4] OpenJDK 64-Bit Server VM warning: Option UseConcMarkSweepGC was deprecated in version 9.0 and will likely be removed in a future release.
   [junit4] <<< JVM J2: EOF ----

[...truncated 3 lines...]
   [junit4] JVM J0: stderr was not empty, see: /home/jenkins/workspace/Lucene-Solr-7.x-Linux/solr/build/contrib/solr-cell/test/temp/junit4-J0-20180920_141301_9067962124295115636998.syserr
   [junit4] >>> JVM J0 emitted unexpected output (verbatim) ----
   [junit4] OpenJDK 64-Bit Server VM warning: Option UseConcMarkSweepGC was deprecated in version 9.0 and will likely be removed in a future release.
   [junit4] <<< JVM J0: EOF ----

[...truncated 585 lines...]
   [junit4] JVM J0: stderr was not empty, see: /home/jenkins/workspace/Lucene-Solr-7.x-Linux/solr/build/contrib/solr-langid/test/temp/junit4-J0-20180920_141312_9085686248647720724590.syserr
   [junit4] >>> JVM J0 emitted unexpected output (verbatim) ----
   [junit4] OpenJDK 64-Bit Server VM warning: Option UseConcMarkSweepGC was deprecated in version 9.0 and will likely be removed in a future release.
   [junit4] <<< JVM J0: EOF ----

   [junit4] JVM J2: stderr was not empty, see: /home/jenkins/workspace/Lucene-Solr-7.x-Linux/solr/build/contrib/solr-langid/test/temp/junit4-J2-20180920_141312_90816497505623204041511.syserr
   [junit4] >>> JVM J2 emitted unexpected output (verbatim) ----
   [junit4] OpenJDK 64-Bit Server VM warning: Option UseConcMarkSweepGC was deprecated in version 9.0 and will likely be removed in a future release.
   [junit4] <<< JVM J2: EOF ----

   [junit4] JVM J1: stderr was not empty, see: /home/jenkins/workspace/Lucene-Solr-7.x-Linux/solr/build/contrib/solr-langid/test/temp/junit4-J1-20180920_141312_90815654367294730215164.syserr
   [junit4] >>> JVM J1 emitted unexpected output (verbatim) ----
   [junit4] OpenJDK 64-Bit Server VM warning: Option UseConcMarkSweepGC was deprecated in version 9.0 and will likely be removed in a future release.
   [junit4] <<< JVM J1: EOF ----

[...truncated 683 lines...]
   [junit4] JVM J2: stderr was not empty, see: /home/jenkins/workspace/Lucene-Solr-7.x-Linux/solr/build/contrib/solr-ltr/test/temp/junit4-J2-20180920_141321_8267344101221712206802.syserr
   [junit4] >>> JVM J2 emitted unexpected output (verbatim) ----
   [junit4] OpenJDK 64-Bit Server VM warning: Option UseConcMarkSweepGC was deprecated in version 9.0 and will likely be removed in a future release.
   [junit4] <<< JVM J2: EOF ----

[...truncated 3 lines...]
   [junit4] JVM J1: stderr was not empty, see: /home/jenkins/workspace/Lucene-Solr-7.x-Linux/solr/build/contrib/solr-ltr/test/temp/junit4-J1-20180920_141321_82614455212442483370043.syserr
   [junit4] >>> JVM J1 emitted unexpected output (verbatim) ----
   [junit4] OpenJDK 64-Bit Server VM warning: Option UseConcMarkSweepGC was deprecated in version 9.0 and will likely be removed in a future release.
   [junit4] <<< JVM J1: EOF ----

[...truncated 3 lines...]
   [junit4] JVM J0: stderr was not empty, see: /home/jenkins/workspace/Lucene-Solr-7.x-Linux/solr/build/contrib/solr-ltr/test/temp/junit4-J0-20180920_141321_8269002064190701651668.syserr
   [junit4] >>> JVM J0 emitted unexpected output (verbatim) ----
   [junit4] OpenJDK 64-Bit Server VM warning: Option UseConcMarkSweepGC was deprecated in version 9.0 and will likely be removed in a future release.
   [junit4] <<< JVM J0: EOF ----

[...truncated 579 lines...]
   [junit4] JVM J0: stderr was not empty, see: /home/jenkins/workspace/Lucene-Solr-7.x-Linux/solr/build/contrib/solr-prometheus-exporter/test/temp/junit4-J0-20180920_141347_3611138504363718478264.syserr
   [junit4] >>> JVM J0 emitted unexpected output (verbatim) ----
   [junit4] OpenJDK 64-Bit Server VM warning: Option UseConcMarkSweepGC was deprecated in version 9.0 and will likely be removed in a future release.
   [junit4] <<< JVM J0: EOF ----

   [junit4] JVM J1: stderr was not empty, see: /home/jenkins/workspace/Lucene-Solr-7.x-Linux/solr/build/contrib/solr-prometheus-exporter/test/temp/junit4-J1-20180920_141347_3616795832635531254710.syserr
   [junit4] >>> JVM J1 emitted unexpected output (verbatim) ----
   [junit4] OpenJDK 64-Bit Server VM warning: Option UseConcMarkSweepGC was deprecated in version 9.0 and will likely be removed in a future release.
   [junit4] <<< JVM J1: EOF ----

[...truncated 566 lines...]
   [junit4] JVM J0: stderr was not empty, see: /home/jenkins/workspace/Lucene-Solr-7.x-Linux/solr/build/contrib/solr-velocity/test/temp/junit4-J0-20180920_141403_71511156400280116905369.syserr
   [junit4] >>> JVM J0 emitted unexpected output (verbatim) ----
   [junit4] OpenJDK 64-Bit Server VM warning: Option UseConcMarkSweepGC was deprecated in version 9.0 and will likely be removed in a future release.
   [junit4] <<< JVM J0: EOF ----

[...truncated 33352 lines...]
[repro] Jenkins log URL: https://jenkins.thetaphi.de/job/Lucene-Solr-7.x-Linux/2777/consoleText

[repro] Revision: 99df2bd2f350b328ce36beb7a6fe76ac5316e551

[repro] Ant options: "-Dargs=-XX:+UseCompressedOops -XX:+UseConcMarkSweepGC"
[repro] Repro line:  ant test  -Dtestcase=CdcrBidirectionalTest -Dtests.method=testBiDir -Dtests.seed=4931982D2F4E5A76 -Dtests.multiplier=3 -Dtests.slow=true -Dtests.locale=ar-EH -Dtests.timezone=SystemV/PST8 -Dtests.asserts=true -Dtests.file.encoding=UTF-8

[repro] ant clean

[...truncated 6 lines...]
[repro] Test suites by module:
[repro]    solr/core
[repro]       CdcrBidirectionalTest
[repro] ant compile-test

[...truncated 3442 lines...]
[repro] ant test-nocompile -Dtests.dups=5 -Dtests.maxfailures=5 -Dtests.class="*.CdcrBidirectionalTest" -Dtests.showOutput=onerror "-Dargs=-XX:+UseCompressedOops -XX:+UseConcMarkSweepGC" -Dtests.seed=4931982D2F4E5A76 -Dtests.multiplier=3 -Dtests.slow=true -Dtests.locale=ar-EH -Dtests.timezone=SystemV/PST8 -Dtests.asserts=true -Dtests.file.encoding=UTF-8

[...truncated 45 lines...]
   [junit4] JVM J2: stderr was not empty, see: /home/jenkins/workspace/Lucene-Solr-7.x-Linux/solr/build/solr-core/test/temp/junit4-J2-20180920_141636_980126068163031638530.syserr
   [junit4] >>> JVM J2 emitted unexpected output (verbatim) ----
   [junit4] OpenJDK 64-Bit Server VM warning: Option UseConcMarkSweepGC was deprecated in version 9.0 and will likely be removed in a future release.
   [junit4] <<< JVM J2: EOF ----

[...truncated 4 lines...]
   [junit4] JVM J0: stderr was not empty, see: /home/jenkins/workspace/Lucene-Solr-7.x-Linux/solr/build/solr-core/test/temp/junit4-J0-20180920_141636_9805592623696240084106.syserr
   [junit4] >>> JVM J0 emitted unexpected output (verbatim) ----
   [junit4] OpenJDK 64-Bit Server VM warning: Option UseConcMarkSweepGC was deprecated in version 9.0 and will likely be removed in a future release.
   [junit4] <<< JVM J0: EOF ----

[...truncated 4 lines...]
   [junit4] JVM J1: stderr was not empty, see: /home/jenkins/workspace/Lucene-Solr-7.x-Linux/solr/build/solr-core/test/temp/junit4-J1-20180920_141636_9807355573731174750613.syserr
   [junit4] >>> JVM J1 emitted unexpected output (verbatim) ----
   [junit4] OpenJDK 64-Bit Server VM warning: Option UseConcMarkSweepGC was deprecated in version 9.0 and will likely be removed in a future release.
   [junit4] <<< JVM J1: EOF ----

[...truncated 23 lines...]
[repro] Failures:
[repro]   0/5 failed: org.apache.solr.cloud.cdcr.CdcrBidirectionalTest
[repro] Exiting with code 0

[...truncated 40 lines...]